<svg width="94" height="94" viewBox="0 0 94 94" fill="none" xmlns="http://www.w3.org/2000/svg">
<rect x="0.5" y="0.5" width="93" height="93" rx="9.5" stroke="#4F4F4F"/>
<path d="M37.983 79.2777V74.7635H39.1563V82.3999H37.983V81.1073H37.9035C37.7245 81.4951 37.4461 81.8249 37.0683 82.0966C36.6904 82.3651 36.2132 82.4993 35.6365 82.4993C35.1592 82.4993 34.7349 82.3949 34.3637 82.1861C33.9925 81.974 33.7008 81.6558 33.4887 81.2316C33.2766 80.804 33.1705 80.2654 33.1705 79.6158V74.7635H34.3438V79.5363C34.3438 80.0931 34.4996 80.5372 34.8112 80.8687C35.126 81.2001 35.5271 81.3658 36.0143 81.3658C36.306 81.3658 36.6026 81.2912 36.9042 81.1421C37.2091 80.9929 37.4643 80.7642 37.6698 80.456C37.8786 80.1478 37.983 79.755 37.983 79.2777ZM46.7144 76.4738L45.6604 76.7721C45.5941 76.5964 45.4964 76.4257 45.3671 76.26C45.2412 76.091 45.0688 75.9517 44.8501 75.8424C44.6313 75.733 44.3512 75.6783 44.0099 75.6783C43.5425 75.6783 43.1531 75.786 42.8415 76.0015C42.5333 76.2136 42.3792 76.4837 42.3792 76.8118C42.3792 77.1035 42.4852 77.3339 42.6974 77.5029C42.9095 77.6719 43.2409 77.8128 43.6917 77.9255L44.8252 78.2039C45.508 78.3696 46.0167 78.6232 46.3515 78.9645C46.6862 79.3026 46.8536 79.7384 46.8536 80.2721C46.8536 80.7096 46.7277 81.1007 46.4758 81.4454C46.2272 81.7901 45.8792 82.0618 45.4317 82.2607C44.9843 82.4596 44.4639 82.559 43.8706 82.559C43.0918 82.559 42.4471 82.39 41.9367 82.0519C41.4263 81.7138 41.1031 81.22 40.9672 80.5704L42.0809 80.2919C42.1869 80.7029 42.3875 81.0112 42.6824 81.2167C42.9807 81.4222 43.3702 81.5249 43.8508 81.5249C44.3976 81.5249 44.8318 81.4089 45.1533 81.1769C45.4781 80.9416 45.6405 80.6598 45.6405 80.3317C45.6405 80.0666 45.5477 79.8445 45.3621 79.6655C45.1765 79.4832 44.8915 79.3473 44.507 79.2579L43.2343 78.9596C42.5349 78.7938 42.0212 78.537 41.6931 78.189C41.3683 77.8376 41.2059 77.3985 41.2059 76.8715C41.2059 76.4406 41.3269 76.0595 41.5688 75.728C41.8141 75.3966 42.1472 75.1364 42.5681 74.9475C42.9923 74.7586 43.4729 74.6641 44.0099 74.6641C44.7655 74.6641 45.3588 74.8298 45.7897 75.1613C46.2239 75.4927 46.5321 75.9302 46.7144 76.4738ZM51.8215 82.559C51.0857 82.559 50.451 82.3966 49.9173 82.0718C49.387 81.7437 48.9777 81.2863 48.6894 80.6996C48.4043 80.1097 48.2618 79.4236 48.2618 78.6414C48.2618 77.8592 48.4043 77.1698 48.6894 76.5732C48.9777 75.9733 49.3788 75.506 49.8925 75.1712C50.4095 74.8331 51.0128 74.6641 51.7021 74.6641C52.0999 74.6641 52.4926 74.7304 52.8804 74.863C53.2682 74.9955 53.6212 75.211 53.9394 75.5093C54.2575 75.8043 54.5111 76.1954 54.7 76.6826C54.8889 77.1698 54.9834 77.7697 54.9834 78.4823V78.9794H49.097V77.9652H53.7902C53.7902 77.5344 53.704 77.1499 53.5317 76.8118C53.3627 76.4738 53.1207 76.207 52.8058 76.0114C52.4943 75.8159 52.1264 75.7181 51.7021 75.7181C51.2348 75.7181 50.8305 75.8341 50.4891 76.0661C50.151 76.2948 49.8908 76.5931 49.7085 76.961C49.5262 77.3289 49.4351 77.7233 49.4351 78.1442V78.8204C49.4351 79.3971 49.5345 79.8859 49.7334 80.287C49.9356 80.6847 50.2156 80.988 50.5736 81.1968C50.9316 81.4023 51.3475 81.505 51.8215 81.505C52.1297 81.505 52.4081 81.4619 52.6567 81.3758C52.9086 81.2863 53.1257 81.1537 53.308 80.978C53.4903 80.7991 53.6311 80.577 53.7306 80.3118L54.8641 80.63C54.7448 81.0145 54.5442 81.3526 54.2625 81.6442C53.9808 81.9326 53.6328 82.158 53.2185 82.3204C52.8042 82.4794 52.3385 82.559 51.8215 82.559ZM56.7682 82.3999V74.7635H57.9017V75.9169H57.9813C58.1205 75.5391 58.3724 75.2325 58.7369 74.9972C59.1015 74.7619 59.5125 74.6442 59.9699 74.6442C60.0561 74.6442 60.1638 74.6459 60.2931 74.6492C60.4223 74.6525 60.5201 74.6575 60.5864 74.6641V75.8573C60.5466 75.8473 60.4555 75.8324 60.3129 75.8125C60.1737 75.7893 60.0262 75.7777 59.8705 75.7777C59.4993 75.7777 59.1678 75.8556 58.8762 76.0114C58.5878 76.1639 58.3591 76.376 58.1901 76.6478C58.0244 76.9162 57.9415 77.2228 57.9415 77.5675V82.3999H56.7682Z" fill="#4F4F4F"/>
<mask id="path-3-inside-1_25_147" fill="white">
<path fill-rule="evenodd" clip-rule="evenodd" d="M55.5335 41.5998C59.312 38.9479 61.7818 34.5578 61.7818 29.591C61.7818 21.4938 55.2178 14.9297 47.1206 14.9297C39.0233 14.9297 32.4593 21.4938 32.4593 29.591C32.4593 34.5159 34.8876 38.8737 38.6122 41.5323C30.623 44.8275 25 52.6928 25 61.8714C25 61.9143 25.0001 61.9571 25.0004 61.9999H68.9835C68.9838 61.9571 68.9839 61.9143 68.9839 61.8714C68.9839 52.7549 63.4367 44.934 55.5335 41.5998Z"/>
</mask>
<path d="M55.5335 41.5998L54.3845 39.9628L51.4274 42.0383L54.7561 43.4426L55.5335 41.5998ZM38.6122 41.5323L39.3748 43.3812L42.715 42.0036L39.7742 39.9045L38.6122 41.5323ZM25.0004 61.9999L23.0004 62.0113L23.0118 63.9999H25.0004V61.9999ZM68.9835 61.9999V63.9999H70.9721L70.9835 62.0113L68.9835 61.9999ZM59.7818 29.591C59.7818 33.8786 57.6525 37.6692 54.3845 39.9628L56.6825 43.2369C60.9716 40.2265 63.7818 35.2371 63.7818 29.591H59.7818ZM47.1206 16.9297C54.1132 16.9297 59.7818 22.5983 59.7818 29.591H63.7818C63.7818 20.3892 56.3223 12.9297 47.1206 12.9297V16.9297ZM34.4593 29.591C34.4593 22.5983 40.1279 16.9297 47.1206 16.9297V12.9297C37.9188 12.9297 30.4593 20.3892 30.4593 29.591H34.4593ZM39.7742 39.9045C36.5528 37.6051 34.4593 33.8425 34.4593 29.591H30.4593C30.4593 35.1893 33.2223 40.1423 37.4503 43.1602L39.7742 39.9045ZM37.8497 39.6834C29.1377 43.2766 23 51.8549 23 61.8714H27C27 53.5307 32.1084 46.3783 39.3748 43.3812L37.8497 39.6834ZM23 61.8714C23 61.9181 23.0001 61.9647 23.0004 62.0113L27.0003 61.9884C27.0001 61.9495 27 61.9105 27 61.8714H23ZM25.0004 63.9999H68.9835V59.9999H25.0004V63.9999ZM70.9835 62.0113C70.9837 61.9647 70.9839 61.9181 70.9839 61.8714H66.9839C66.9839 61.9105 66.9838 61.9495 66.9835 61.9885L70.9835 62.0113ZM70.9839 61.8714C70.9839 51.9227 64.9288 43.3928 56.3109 39.7571L54.7561 43.4426C61.9445 46.4751 66.9839 53.5871 66.9839 61.8714H70.9839Z" fill="#4F4F4F" mask="url(#path-3-inside-1_25_147)"/>
</svg>
