[
  {
    "id": "-",
    "country": "Economy groups",
    "disable": true
  },
  {
    "iso": "escap",
    "country": "Asia-Pacific"
  },
  {
    "iso": "ene_asia",
    "country": "East and Nort-East Asia (ENEA)"
  },
  {
    "iso": "nc_asia",
    "country": "North and Central Asia (NCA)"
  },
  {
    "iso": "pacific",
    "country": "Pacific (PAC)"
  },
  {
    "iso": "ssw_asia",
    "country": "South and South-Weast Asia (SSWA)"
  },
  {
    "iso": "se_asia",
    "country": "South-East Asia (SEA)"
  },

  {
    "iso": "apta",
    "country": "APTA"
  },
  {
    "iso": "asean",
    "country": "ASEAN"
  },
  {
    "iso": "bimstec",
    "country": "BIMSTEC"
  },

  {
    "iso": "rcep",
    "country": "RCEP"
  },
  {
    "iso": "saarc",
    "country": "SAARC"
  },
  {
    "iso": "speca",
    "country": "SPECA"
  },
  {
    "iso": "ap_high_income",
    "country": "Asia-Pacific High-income economies"
  },
  {
    "iso": "ap_upper_middle_income",
    "country": "Asia-Pacific Upper-middle-income economies"
  },
  {
    "iso": "ap_lower_middle_income",
    "country": "Asia-Pacific Lower-middle-income economies"
  },
  {
    "iso": "ap_low_income",
    "country": "Asia-Pacific Low-income economies"
  },
  {
    "iso": "ap_ldc",
    "country": "Asia-Pacific Least developed countries"
  },
  {
    "iso": "ap_lldc",
    "country": "Asia-Pacific Landlocked least developed countries"
  },
  {
    "iso": "ap_landlocked_dev",
    "country": "Asia-Pacific Landlocked developing countries"
  },
  {
    "iso": "ap_pacific_developing",
    "country": "Asia-Pacific Pacific developing economies"
  },
  {
    "iso": "ap_sids",
    "country": "Asia-Pacific Small Islands Developing States (SIDS)"
  },
  {
    "id": "-",
    "disable": true,
    "country": "Individual economies"
  },
  {
    "iso": "AFG",
    "code": "AF",
    "country": "Afghanistan"
  },
  {
    "iso": "ARM",
    "code": "AM",
    "country": "Armenia"
  },
  {
    "iso": "AUS",
    "code": "AU",
    "country": "Australia"
  },

  {
    "iso": "AZE",
    "code": "AZ",
    "country": "Azerbaijan"
  },
  {
    "iso": "BGD",
    "code": "BD",
    "country": "Bangladesh"
  },
  {
    "iso": "BTN",
    "code": "BT",
    "country": "Bhutan"
  },
  {
    "iso": "BRN",
    "code": "BN",
    "country": "Brunei Darussalam"
  },
  {
    "iso": "KHM",
    "code": "KH",
    "country": "Cambodia"
  },

  {
    "iso": "CHN",
    "code": "CN",
    "country": "China"
  },
  {
    "iso": "FJI",
    "code": "FJ",
    "country": "Fiji"
  },
  {
    "iso": "GEO",
    "code": "GE",
    "country": "Georgia"
  },
  {
    "iso": "HKG",
    "code": "HK",
    "country": "Hong Kong, China"
  },
  {
    "iso": "IND",
    "code": "IN",
    "country": "India"
  },
  {
    "iso": "IDN",
    "code": "ID",
    "country": "Indonesia"
  },
  {
    "iso": "IRN",
    "code": "IR",
    "country": "Iran (Islamic Rep. of)"
  },
  {
    "iso": "JPN",
    "code": "JP",
    "country": "Japan"
  },
  {
    "iso": "KAZ",
    "code": "KZ",
    "country": "Kazakhstan"
  },
  {
    "iso": "KIR",
    "code": "KI",
    "country": "Kiribati"
  },
  {
    "iso": "KGZ",
    "code": "KG",
    "country": "Kyrgyzstan"
  },
  {
    "iso": "LAO",
    "code": "LA",
    "country": "Lao P.D.R."
  },
  {
    "iso": "MAC",
    "code": "MO",
    "country": "Macao, China"
  },
  {
    "iso": "MYS",
    "code": "MY",
    "country": "Malaysia"
  },
  {
    "iso": "MDV",
    "code": "MV",
    "country": "Maldives"
  },
  {
    "iso": "MNG",
    "code": "MN",
    "country": "Mongolia"
  },
  {
    "iso": "MMR",
    "code": "MM",
    "country": "Myanmar"
  },
  {
    "iso": "NPL",
    "code": "NP",
    "country": "Nepal"
  },
  {
    "iso": "NZL",
    "code": "NZ",
    "country": "New Zealand"
  },
  {
    "iso": "PAK",
    "code": "PK",
    "country": "Pakistan"
  },
  {
    "iso": "PNG",
    "code": "PG",
    "country": "Papua New Guinea"
  },
  {
    "iso": "PHL",
    "code": "PH",
    "country": "Philippines"
  },
  {
    "iso": "KOR",
    "code": "KR",
    "country": "Republic of Korea"
  },
  {
    "iso": "RUS",
    "code": "RU",
    "country": "Russian Federation"
  },
  {
    "iso": "WSM",
    "code": "SA",
    "country": "Samoa"
  },
  {
    "iso": "SGP",
    "code": "SG",
    "country": "Singapore"
  },
  {
    "iso": "SLB",
    "code": "SB",
    "country": "Solomon Islands"
  },
  {
    "iso": "LKA",
    "code": "LK",
    "country": "Sri Lanka"
  },
  {
    "iso": "TJK",
    "code": "CH",
    "country": "Tajikistan"
  },

  {
    "iso": "THA",
    "code": "TH",
    "country": "Thailand"
  },
  {
    "iso": "TLS",
    "code": "TL",
    "country": "Timor-Leste"
  },
  {
    "iso": "TON",
    "code": "TO",
    "country": "Tonga"
  },

  {
    "iso": "TUR",
    "code": "TR",
    "country": "Türkiye"
  },
  {
    "iso": "TKM",
    "code": "TM",
    "country": "Turkmenistan"
  },
  {
    "iso": "UZB",
    "code": "UZ",
    "country": "Uzbekistan"
  },
  {
    "iso": "VUT",
    "code": "VU",
    "country": "Vanuatu"
  },
  {
    "iso": "VNM",
    "code": "VN",
    "country": "Viet Nam"
  }
]
