{"id":"Trending","order":0,"path":""}
{"id":"Next","order":1,"path":""}
{"id":"Later","order":2,"path":"watchlater.txt"}
{"id":"History","order":3,"path":"history.txt"}
{"id":"Paused","order":4,"path":"paused.txt"}
{"id":"Finished","order":5,"path":"finished.txt"}
{"id":"Waiting","order":6,"path":"waitlist.txt"}
{"id":"Rejected","order":7,"path":"rejected.txt"}
