{"timestamp":1679747305871,"infoId":79299,"episode":1,"series":1,"networkId":1024,"profileId":102}
{"timestamp":1679747605839,"infoId":120317,"episode":1,"series":1,"networkId":1024,"profileId":100}
{"timestamp":1679747656369,"infoId":1165,"episode":1,"series":1,"networkId":1024,"profileId":100}
{"timestamp":1679747740827,"infoId":155491,"episode":1,"series":1,"networkId":213,"profileId":100}
{"timestamp":1679748043401,"infoId":67716,"episode":1,"series":1,"networkId":453,"profileId":102}
{"timestamp":1679748342177,"infoId":3476,"episode":1,"series":1,"networkId":14,"profileId":102}
{"timestamp":1679748382360,"infoId":1167,"episode":1,"series":1,"networkId":1024,"profileId":102}
{"timestamp":1679748884196,"infoId":72748,"episode":1,"series":1,"networkId":3186,"profileId":102}
{"timestamp":1679749021627,"infoId":19880,"episode":1,"series":1,"networkId":1024,"profileId":102}
{"timestamp":1679768729994,"infoId":214065,"episode":1,"series":1,"networkId":1024,"profileId":102}
{"timestamp":1680296337423,"infoId":11099,"episode":1,"series":1,"networkId":0,"profileId":0}
{"timestamp":1680906747530,"infoId":87104,"episode":1,"series":1,"networkId":3186,"profileId":102}
{"timestamp":1682458464343,"infoId":114922,"episode":1,"series":1,"networkId":0,"profileId":0}
{"timestamp":1683416464623,"infoId":158439,"episode":1,"series":1,"networkId":14,"profileId":102}
{"timestamp":1683482018711,"infoId":203857,"episode":1,"series":1,"networkId":0,"profileId":0}
{"timestamp":1684094771509,"infoId":106454,"episode":1,"series":1,"networkId":0,"profileId":0}
{"timestamp":1684452515258,"infoId":120317,"episode":1,"series":1,"networkId":0,"profileId":102}
{"timestamp":1685314616247,"infoId":76331,"episode":1,"series":1,"networkId":0,"profileId":102}
{"timestamp":1685667965949,"infoId":64257,"episode":1,"series":1,"networkId":0,"profileId":102}
{"timestamp":1685747911068,"infoId":210916,"episode":1,"series":1,"networkId":213,"profileId":102}
{"timestamp":1686284410792,"infoId":33273,"episode":1,"series":1,"networkId":4025,"profileId":102}
{"timestamp":1685927402153,"infoId":62474,"episode":1,"series":1,"networkId":14,"profileId":102}
{"timestamp":1687741418613,"infoId":197548,"episode":1,"series":1,"networkId":0,"profileId":102}
