Name,WeightClassKg,Division,Sex,AgeRange,Age,BodyweightKg,Country,Bench1Kg,Bench2Kg,Bench3Kg,Best3BenchKg,Bench4Kg,Best3DeadliftKg,Deadlift4Kg,TotalKg,Event,Equipment,Place
Josh Harrison,60,Class 1,M,,,,,,,,135,,,,135,B,Multi-ply,1
Jon Shapiro,60,Class 1,M,,,,,,,,130,,,,130,B,Multi-ply,2
Jason Imamura,60,Class 1,M,,,,,,,,130,,,,130,B,Multi-ply,3
Danny Dickey,60,Class 1,M,,,,,,,,105,,,,105,B,Multi-ply,4
Adam Chamie,67.5,Class 1,M,,,,,,,,160,,,,160,B,Multi-ply,1
Eric Nahorniak,67.5,Class 1,M,,,,,,,,145,,,,145,B,Multi-ply,2
Scott Graves,67.5,Class 1,M,,,,,,,,130,,,,130,B,Multi-ply,3
Garette Langmead,67.5,Class 1,M,,,,,,,,127.5,,,,127.5,B,Multi-ply,4
Amadeo Fernandez,67.5,Class 1,M,,,,,,,,110,,,,110,B,Multi-ply,5
David Brinegar,67.5,Class 1,M,,,,,,,,85,,,,85,B,Multi-ply,6
Randall Wrye,75,Class 1,M,,,,,,,,170,,,,170,B,Multi-ply,1
Kenny Baleman,75,Class 1,M,,,,,,,,147.5,,,,147.5,B,Multi-ply,2
Ronnie High,75,Class 1,M,,,,,,,,145,,,,145,B,Multi-ply,3
Kenny Rothe,75,Class 1,M,,,,,,,,140,,,,140,B,Multi-ply,4
Curtis Stranghoener,75,Class 1,M,,,,,,,,110,,,,110,B,Multi-ply,5
Tom Swisher,75,Class 1,M,,,,,,,,92.5,,,,92.5,B,Multi-ply,6
Ferrel Gray,75,Class 1,M,,,,,,,,,,,,,B,Multi-ply,DQ
Jamie Siebrecht,82.5,Class 1,M,,,,,,,,187.5,,,,187.5,B,Multi-ply,1
Sofala Maiava,82.5,Class 1,M,,,,,,,,185,,,,185,B,Multi-ply,2
Rich Eley,82.5,Class 1,M,,,,,,,,172.5,,,,172.5,B,Multi-ply,3
Pablo Arriaga,82.5,Class 1,M,,,,,,,,162.5,,,,162.5,B,Multi-ply,4
Torin McKellar,82.5,Class 1,M,,,,,,,,142.5,,,,142.5,B,Multi-ply,5
Knute Matthews,82.5,Class 1,M,,,,,,,,137.5,,,,137.5,B,Multi-ply,6
James Whitney,90,Class 1,M,,,,,,,,190,,,,190,B,Multi-ply,1
Steve Ughe,90,Class 1,M,,,,,,,,190,,,,190,B,Multi-ply,2
Jefferey Waters,90,Class 1,M,,,,,,,,187.5,,,,187.5,B,Multi-ply,3
Nathan Nelson,90,Class 1,M,,,,,,,,187.5,,,,187.5,B,Multi-ply,4
Michael Choate,90,Class 1,M,,,,,,,,185,,,,185,B,Multi-ply,5
Sean Olsen,90,Class 1,M,,,,,,,,185,,,,185,B,Multi-ply,6
Jason Frickey,90,Class 1,M,,,,,,,,182.5,,,,182.5,B,Multi-ply,7
Rick MacQuarrie,90,Class 1,M,,,,,,,,180,,,,180,B,Multi-ply,8
Frank Powell,90,Class 1,M,,,,,,,,177.5,,,,177.5,B,Multi-ply,9
Matthew Christie,90,Class 1,M,,,,,,,,175,,,,175,B,Multi-ply,10
Dennis Sugimoto,90,Class 1,M,,,,,,,,170,,,,170,B,Multi-ply,11
Jeff Ray,90,Class 1,M,,,,,,,,165,,,,165,B,Multi-ply,12
Robed Reynolds,90,Class 1,M,,,,,,,,155,,,,155,B,Multi-ply,13
Mike Dees,90,Class 1,M,,,,,,,,132.5,,,,132.5,B,Multi-ply,14
Mick Quilici,100,Class 1,M,,,,,,,,210,,,,210,B,Multi-ply,1
Bruce Nichols,100,Class 1,M,,,,,,,,192.5,,,,192.5,B,Multi-ply,2
John Boettger,100,Class 1,M,,,,,,,,192.5,,,,192.5,B,Multi-ply,3
David Bradshaw,100,Class 1,M,,,,,,,,187.5,,,,187.5,B,Multi-ply,4
Jason Gibson,100,Class 1,M,,,,,,,,182.5,,,,182.5,B,Multi-ply,5
Thomas Reiher,100,Class 1,M,,,,,,,,182.5,,,,182.5,B,Multi-ply,6
Michael Overbey,100,Class 1,M,,,,,,,,177.5,,,,177.5,B,Multi-ply,7
Gary Hughes,100,Class 1,M,,,,,,,,177.5,,,,177.5,B,Multi-ply,8
Joshua Schrag,100,Class 1,M,,,,,,,,175,,,,175,B,Multi-ply,9
Michael Rainey,100,Class 1,M,,,,,,,,165,,,,165,B,Multi-ply,10
Harland Barrett,100,Class 1,M,,,,,,,,152.5,,,,152.5,B,Multi-ply,11
Dale Lindsey,100,Class 1,M,,,,,,,,117.5,,,,117.5,B,Multi-ply,12
Ronald Edwards,100,Class 1,M,,,,,,,,,,,,,B,Multi-ply,DQ
Robert Yost,100,Class 1,M,,,,,,,,,,,,,B,Multi-ply,DQ
Scott Cartwright,110,Class 1,M,,,,,,,,212.5,,,,212.5,B,Multi-ply,1
Ed Barnes,110,Class 1,M,,,,,,,,205,,,,205,B,Multi-ply,2
Buddy McKee,110,Class 1,M,,,,,,,,202.5,,,,202.5,B,Multi-ply,3
Allen Leavitt,110,Class 1,M,,,,,,,,192.5,,,,192.5,B,Multi-ply,4
Michael Smyser,110,Class 1,M,,,,,,,,192.5,,,,192.5,B,Multi-ply,5
Anthony Dilk,110,Class 1,M,,,,,,,,185,,,,185,B,Multi-ply,6
Frank Gonzales,110,Class 1,M,,,,,,,,182.5,,,,182.5,B,Multi-ply,7
Tim Prince,110,Class 1,M,,,,,,,,177.5,,,,177.5,B,Multi-ply,8
Terry Putman,110,Class 1,M,,,,,,,,175,,,,175,B,Multi-ply,9
Gregg Ramsdell,110,Class 1,M,,,,,,,,175,,,,175,B,Multi-ply,10
Kevin Lockett,110,Class 1,M,,,,,,,,170,,,,170,B,Multi-ply,11
Mike Murphy,110,Class 1,M,,,,,,,,157.5,,,,157.5,B,Multi-ply,12
Bobby Blackmon,110,Class 1,M,,,,,,,,150,,,,150,B,Multi-ply,13
Jim Presley,125,Class 1,M,,,,,,,,222.5,,,,222.5,B,Multi-ply,1
Norman Rial,125,Class 1,M,,,,,,,,200,,,,200,B,Multi-ply,2
Leo Contreas,125,Class 1,M,,,,,,,,195,,,,195,B,Multi-ply,3
Carl Wimmer,125,Class 1,M,,,,,,,,192.5,,,,192.5,B,Multi-ply,4
William Burke,125,Class 1,M,,,,,,,,182.5,,,,182.5,B,Multi-ply,5
William Poston,125,Class 1,M,,,,,,,,170,,,,170,B,Multi-ply,6
David Dunn,140,Class 1,M,,,,,,,,230,,,,230,B,Multi-ply,1
Colin Bonneau,140,Class 1,M,,,,Canada,,,,227.5,232,,,227.5,B,Multi-ply,2
Bruce Sabin,140,Class 1,M,,,,,,,,215,,,,215,B,Multi-ply,3
Brett Fleak,140,Class 1,M,,,,,,,,200,,,,200,B,Multi-ply,5
Mall Wattles,140,Class 1,M,,,,,,,,210,,,,210,B,Multi-ply,4
John Newman,140,Class 1,M,,,,,,,,185,,,,185,B,Multi-ply,6
James Crawford,140+,Class 1,M,,,,,,,,230,,,,230,B,Multi-ply,1
John Wooner,140+,Class 1,M,,,,,,,,220,,,,220,B,Multi-ply,2
Marcus Matheney,140+,Class 1,M,,,,,,,,200,,,,200,B,Multi-ply,3
Bryan Huffer,67.5,Disabled,M,,,,,,,,35,,,,35,B,Multi-ply,1
Jose Valtierra,90,Disabled,M,,,,,,,,167.5,,,,167.5,B,Multi-ply,1
Ched Ward,90,Disabled,M,,,,,,,,137.5,,,,137.5,B,Multi-ply,2
Nick Sinardi,90,Disabled,M,,,,,,,,115,,,,115,B,Multi-ply,3
Michael Elliott,100,Disabled,M,,,,,,,,142.5,,,,142.5,B,Multi-ply,1
Steve Peña #1,100,Disabled,M,,,,,,,,,,,,,B,Single-ply,DQ
Cody Colchado,110,Disabled,M,,,,,,,,215,,,,215,B,Multi-ply,1
Bobby Blackmon,110,Disabled,M,,,,,,,,167.5,,,,167.5,B,Multi-ply,2
Omar Sanchez,140,Disabled,M,,,,,,,,192.5,,,,192.5,B,Multi-ply,1
Lisa Marie #2,44,Disabled,F,,,,,,,,37.5,,,,37.5,B,Multi-ply,1
Kathrine Todd,44,Disabled,F,,,,,,,,25,,,,25,B,Multi-ply,2
Alyxa Conlee,90+,Disabled,F,,,,,,,,42.5,,,,42.5,B,Multi-ply,1
Matt Elrod,75,Juniors 20-25,M,20-25,,,,,,,192.5,,,,192.5,B,Multi-ply,1
Gabe Hamel,75,Juniors 20-25,M,20-25,,,,,,,182.5,,,,182.5,B,Multi-ply,2
Casey Dunaway,82.5,Juniors 20-25,M,20-25,,,,,,,165,,,,165,B,Multi-ply,1
Ryan LaPlace,82.5,Juniors 20-25,M,20-25,,,,,,,137.5,,,,137.5,B,Multi-ply,2
Chad Matthews,90,Juniors 20-25,M,20-25,,,,,,,207.5,,,,207.5,B,Multi-ply,1
Matthew Christie,90,Juniors 20-25,M,20-25,,,,,,,175,,,,175,B,Multi-ply,2
Jason Rooney,90,Juniors 20-25,M,20-25,,,,,,,167.5,,,,167.5,B,Multi-ply,3
Chris Duffin,100,Juniors 20-25,M,20-25,,,,,,,232.5,,,,232.5,B,Multi-ply,1
Brad Neal,100,Juniors 20-25,M,20-25,,,,,,,227.5,,,,227.5,B,Multi-ply,2
Richard McKeefer,100,Juniors 20-25,M,20-25,,,,,,,202.5,,,,202.5,B,Multi-ply,3
Brandon Chamras,100,Juniors 20-25,M,20-25,,,,,,,182.5,,,,182.5,B,Multi-ply,4
Joshua Schrag,100,Juniors 20-25,M,20-25,,,,,,,175,,,,175,B,Multi-ply,5
Jamie Bennett,100,Juniors 20-25,M,20-25,,,,,,,145,,,,145,B,Multi-ply,6
Phil Davi,110,Juniors 20-25,M,20-25,,,,,,,242.5,,,,242.5,B,Multi-ply,1
Don Goldswodhy,110,Juniors 20-25,M,20-25,,,,,,,240,,,,240,B,Multi-ply,2
Eric Wright,110,Juniors 20-25,M,20-25,,,,,,,230,,,,230,B,Multi-ply,3
Tony Aderburn,110,Juniors 20-25,M,20-25,,,,,,,220,,,,220,B,Multi-ply,4
Mike Womack #1,125,Juniors 20-25,M,20-25,,,,,,,235,,,,235,B,Multi-ply,1
Adam Gruver,125,Juniors 20-25,M,20-25,,,,,,,210,,,,210,B,Multi-ply,2
Jerry Pritchett,125,Juniors 20-25,M,20-25,,,,,,,197.5,,,,197.5,B,Multi-ply,3
Bobby Snyder,125,Juniors 20-25,M,20-25,,,,,,,167.5,,,,167.5,B,Multi-ply,4
Jeremy Martin,125,Juniors 20-25,M,20-25,,,,,,,160,,,,160,B,Multi-ply,5
Josh Bryant #1,140,Juniors 20-25,M,20-25,,,,,,,175,,,,175,B,Multi-ply,2
Toby Levers,140,Juniors 20-25,M,20-25,,,,,,,242.5,,,,242.5,B,Multi-ply,1
Kevin Tashiro,140+,Juniors 20-25,M,20-25,,,,,,,185,,,,185,B,Multi-ply,1
C. Fernandez #3,44,Juniors 20-25,F,20-25,,,,,,,,,,,,B,Multi-ply,DQ
Cristy Richer,60,Juniors 20-25,F,20-25,,,,,,,87.5,,,,87.5,B,Multi-ply,1
Carie McKeefer,67.5,Juniors 20-25,F,20-25,,,,,,,62.5,,,,62.5,B,Multi-ply,1
Leonetta Richardson,75,Juniors 20-25,F,20-25,,,,,,,132.5,,,,132.5,B,Multi-ply,1
Stacey Hammar,75,Juniors 20-25,F,20-25,,,,,,,92.5,,,,92.5,B,Multi-ply,2
David Edmondson,67.5,Law-Fire 40-47,M,40-47,,,,,,,135,137.5,,,135,B,Multi-ply,1
LeeRoy Banks,82.5,Law-Fire 40-47,M,40-47,,,,,,,197.5,,,,197.5,B,Raw,1
Rudy Lopez,82.5,Law-Fire 40-47,M,40-47,,,,,,,,,,,,B,Multi-ply,DQ
Craig Palmer,100,Law-Fire 40-47,M,40-47,,,,,,,212.5,,,,212.5,B,Multi-ply,1
Zachary Clark,100,Law-Fire 40-47,M,40-47,,,,,,,210,,,,210,B,Multi-ply,2
Jeffery Jones,100,Law-Fire 40-47,M,40-47,,,,,,,197.5,,,,197.5,B,Multi-ply,3
Ronald England,100,Law-Fire 40-47,M,40-47,,,,,,,155,,,,155,B,Multi-ply,4
John Minahan,125,Law-Fire 40-47,M,40-47,,,,,,,215,,,,215,B,Multi-ply,1
David Marchant,140+,Law-Fire 40-47,M,40-47,,,,,,,265,,,,265,B,Multi-ply,1
Charles McFarland,90,Law-Fire 48+,M,48-999,,,,,,,142.5,,,,142.5,B,Multi-ply,1
Michael Overbey,100,Law-Fire 48+,M,48-999,,,,,,,177.5,,,,177.5,B,Multi-ply,1
Bruce Sabin,140,Law-Fire 48+,M,48-999,,,,,,,200,,,,200,B,Multi-ply,1
Paul Goodwin,140+,Law-Fire 48+,M,48-999,,,,,,,195,,,,195,B,Multi-ply,1
Leticia Rosales-Buie,56,Law-Fire 40-47,F,40-47,,,,,,,72.5,,,,72.5,B,Multi-ply,1
Camellia Luprete,75,Law-Fire 48+,F,48-999,,,,,,,70,,,,70,B,Multi-ply,1
Carolyn Fay,90+,Law-Fire 48+,F,48-999,,,,,,,45,,,,45,B,Multi-ply,1
David Edmondson,67.5,Law-Fire Open,M,,,,,,,,135,,,,135,B,Multi-ply,1
Pablo Arriaga,82.5,Law-Fire Open,M,,,,,,,,162.5,,,,162.5,B,Multi-ply,1
Jeffrey Waters,90,Law-Fire Open,M,,,,,,,,187.5,,,,187.5,B,Multi-ply,1
William Rivord,90,Law-Fire Open,M,,,,,,,,177.5,,,,177.5,B,Multi-ply,2
Matt LaMarque,100,Law-Fire Open,M,,,,,,,,247.5,,,,247.5,B,Multi-ply,1
Mike McKenzie,100,Law-Fire Open,M,,,,,,,,227.5,,,,227.5,B,Multi-ply,2
Joe Guerra,100,Law-Fire Open,M,,,,,,,,217.5,,,,217.5,B,Multi-ply,3
Zachary Clark,100,Law-Fire Open,M,,,,,,,,210,,,,210,B,Multi-ply,4
Joah Ash,100,Law-Fire Open,M,,,,,,,,205,,,,205,B,Multi-ply,5
Sean Boyle,100,Law-Fire Open,M,,,,,,,,200,,,,200,B,Multi-ply,6
Jason Jackson #7,110,Law-Fire Open,M,,,,,,,,287.5,,,,287.5,B,Multi-ply,1
Tony Arterburn,110,Law-Fire Open,M,,,,,,,,220,,,,220,B,Multi-ply,2
Andrew Poder,125,Law-Fire Open,M,,,,,,,,195,,,,195,B,Multi-ply,1
Carl Wimmer,125,Law-Fire Open,M,,,,,,,,192.5,,,,192.5,B,Multi-ply,2
George Sutton,125,Law-Fire Open,M,,,,,,,,,,,,,B,Multi-ply,DQ
Kevin Tashiro,140,Law-Fire Open,M,,,,,,,,185,,,,185,B,Multi-ply,1
Karen Gordon,56,Law-Fire Open,F,,,55.34,,,,,77.5,,,,77.5,B,Multi-ply,1
Camellia Luprete,75,Law-Fire Open,F,,,,,,,,70,,,,70,B,Multi-ply,1
AJ Agamao,75,Law-Fire Submasters,M,34-39,,,,,,,200,212.5,,,200,B,Multi-ply,1
Andy Ellis,82.5,Law-Fire Submasters,M,34-39,,,,,,,172.5,,,,172.5,B,Multi-ply,1
James Whitney,90,Law-Fire Submasters,M,34-39,,,,,,,190,,,,190,B,Multi-ply,1
Kenneth Millrany,100,Law-Fire Submasters,M,34-39,,,,,,,212.5,,,,212.5,B,Multi-ply,1
Rodger Broome,100,Law-Fire Submasters,M,34-39,,,,,,,,,,,,B,Multi-ply,DQ
Frank Wakakuwa,110,Law-Fire Submasters,M,34-39,,,,,,,272.5,,,,272.5,B,Multi-ply,1
Doug Tracy,110,Law-Fire Submasters,M,34-39,,,,,,,197.5,,,,197.5,B,Multi-ply,2
Michael Smyser,110,Law-Fire Submasters,M,34-39,,,,,,,192.5,,,,192.5,B,Multi-ply,3
Ismyanto Soekardi,110,Law-Fire Submasters,M,34-39,,,,,,,,,,,,B,Multi-ply,DQ
Michael Lemes,56,Law-Fire Submasters,F,34-39,,,,,,,57.5,,,,57.5,B,Multi-ply,1
Latasia Anzai,67.5,Law-Fire Submasters,F,34-39,,,,,,,72.5,,,,72.5,B,Multi-ply,1
Bobby Sanders,56,Masters 40-46,M,40-46,,,,,,,115,,,,115,B,Multi-ply,1
Dan Marxheimer,75,Masters 40-46,M,40-46,,,,,,,167.5,,,,167.5,B,Multi-ply,1
Danny Winslow,75,Masters 40-46,M,40-46,,,,,,,147.5,,,,147.5,B,Multi-ply,2
Leo Mattoni,75,Masters 40-46,M,40-46,,,,,,,137.5,,,,137.5,B,Multi-ply,3
Marloe Mosley,75,Masters 40-46,M,40-46,,,,,,,132.5,,,,132.5,B,Multi-ply,4
Bob Levering,82.5,Masters 40-46,M,40-46,,,,,,,217.5,,,,217.5,B,Multi-ply,1
Ed Morishima,82.5,Masters 40-46,M,40-46,40,,,,,,217.5,,,,217.5,B,Multi-ply,2
LeeRoy Banks,82.5,Masters 40-46,M,40-46,,,,,,,197.5,,,,197.5,B,Raw,3
Jeff Jones,82.5,Masters 40-46,M,40-46,,,,,,,177.5,,,,177.5,B,Multi-ply,3
Keith Kanemoto,90,Masters 40-46,M,40-46,,,,,,,227.5,,,,227.5,B,Multi-ply,1
George Herring #1,90,Masters 40-46,M,40-46,,,,,,,227.5,,,,227.5,B,Single-ply,2
Rick Brewer,90,Masters 40-46,M,40-46,,,,,,,190,,,,190,B,Multi-ply,3
Robert Reynolds,90,Masters 40-46,M,40-46,,,,,,,155,,,,155,B,Multi-ply,4
David Bertier,90,Masters 40-46,M,40-46,,,,,,,147.5,,,,147.5,B,Multi-ply,5
Mike McCormack,90,Masters 40-46,M,40-46,,,,,,,137.5,,,,137.5,B,Multi-ply,6
Bruce Young,100,Masters 40-46,M,40-46,,,,,,,200,,,,200,B,Multi-ply,1
Mike Robinson,100,Masters 40-46,M,40-46,,,,,,,195,,,,195,B,Multi-ply,2
Bruce Read,100,Masters 40-46,M,40-46,,,,,,,182.5,,,,182.5,B,Multi-ply,3
Larry Benner,100,Masters 40-46,M,40-46,,,,,,,182.5,,,,182.5,B,Multi-ply,4
Andy Gose,100,Masters 40-46,M,40-46,,,,,,,175,,,,175,B,Multi-ply,5
Ray Whatley,100,Masters 40-46,M,40-46,,,,,,,172.5,,,,172.5,B,Multi-ply,6
Paul Wondra,100,Masters 40-46,M,40-46,,,,,,,172.5,,,,172.5,B,Multi-ply,7
Duane Burlingame,100,Masters 40-46,M,40-46,,,,,,,165,,,,165,B,Multi-ply,8
Ronald England,100,Masters 40-46,M,40-46,,,,,,,155,,,,155,B,Multi-ply,9
Michael Elliott,100,Masters 40-46,M,40-46,,,,,,,142.5,,,,142.5,B,Multi-ply,10
Dave Henderson,110,Masters 40-46,M,40-46,,,,,,,227.5,,,,227.5,B,Multi-ply,1
Rich Ludlam,110,Masters 40-46,M,40-46,,,,,,,227.5,,,,227.5,B,Multi-ply,2
Tom Starkweather,110,Masters 40-46,M,40-46,,,,,,,215,,,,215,B,Multi-ply,3
Buddy McKee,110,Masters 40-46,M,40-46,,,,,,,205,,,,205,B,Multi-ply,4
Chris Warrick,110,Masters 40-46,M,40-46,,,,,,,197.5,,,,197.5,B,Multi-ply,5
Cozy Cozine,110,Masters 40-46,M,40-46,,,,,,,190,,,,190,B,Multi-ply,6
Frank Gonzales,110,Masters 40-46,M,40-46,,,,,,,182.5,,,,182.5,B,Multi-ply,7
Al Dawson,110,Masters 40-46,M,40-46,,,,,,,170,,,,170,B,Multi-ply,8
Steve Gaytan,110,Masters 40-46,M,40-46,,,,,,,160,,,,160,B,Multi-ply,9
Brad Stewart,110,Masters 40-46,M,40-46,,,,,,,142.5,,,,142.5,B,Multi-ply,10
Joe Harms,125,Masters 40-46,M,40-46,,,,,,,237.5,,,,237.5,B,Multi-ply,1
Jim Presley,125,Masters 40-46,M,40-46,,,,,,,222.5,,,,222.5,B,Multi-ply,2
William Burke,125,Masters 40-46,M,40-46,,,,,,,182.5,,,,182.5,B,Multi-ply,3
Ken Eyre,125,Masters 40-46,M,40-46,,,,,,,182.5,,,,182.5,B,Multi-ply,4
Robert Jackson,125,Masters 40-46,M,40-46,,,,,,,177.5,,,,177.5,B,Multi-ply,5
Bradley Butler,125,Masters 40-46,M,40-46,,,,,,,170,,,,170,B,Multi-ply,6
Eddie McDonald,125,Masters 40-46,M,40-46,,,,,,,167.5,,,,167.5,B,Multi-ply,7
Jim Cunningltam,140,Masters 40-46,M,40-46,,,,,,,265,,,,265,B,Multi-ply,1
Cyril Lewis,140,Masters 40-46,M,40-46,,,,,,,250,,,,250,B,Multi-ply,2
Paul Ratsch,140,Masters 40-46,M,40-46,,,,,,,237.5,,,,237.5,B,Multi-ply,3
Steve Khader,140,Masters 40-46,M,40-46,,,,,,,205,,,,205,B,Multi-ply,4
Joe Mickelson,140,Masters 40-46,M,40-46,,,,,,,192.5,,,,192.5,B,Multi-ply,5
John Newman,140,Masters 40-46,M,40-46,,,,,,,185,,,,185,B,Multi-ply,6
Bill Gillespie,140+,Masters 40-46,M,40-46,,,,,,,305,,,,305,B,Multi-ply,1
Tom Manno,140+,Masters 40-46,M,40-46,,,,,,,302.5,,,,302.5,B,Multi-ply,2
David Marchant,140+,Masters 40-46,M,40-46,,,,,,,265,272,,,265,B,Multi-ply,3
James Young,140+,Masters 40-46,M,40-46,,,,,,,232.5,,,,232.5,B,Multi-ply,4
Brian Rehberg,140+,Masters 40-46,M,40-46,,,,,,,227.5,,,,227.5,B,Multi-ply,5
Tomas McKinney,140+,Masters 40-46,M,40-46,,,,,,,225,,,,225,B,Multi-ply,6
John Wooner,140+,Masters 40-46,M,40-46,,,,,,,220,,,,220,B,Multi-ply,7
David Chase,140+,Masters 40-46,M,40-46,,,,,,,220,,,,220,B,Multi-ply,8
Gary Bobrovitz,60,Masters 47-53,M,47-53,,,Canada,,,,112.5,,,,112.5,B,Multi-ply,1
Homi Shivaie,60,Masters 47-53,M,47-53,,,,,,,95,,,,95,B,Multi-ply,2
Clotario Ortiz Portugal,67.5,Masters 47-53,M,47-53,,,Brazil,,,,117.5,,,,117.5,B,Multi-ply,1
David Higgins,67.5,Masters 47-53,M,47-53,,,,,,,105,,,,105,B,Multi-ply,2
Sheldon Weingust,75,Masters 47-53,M,47-53,,,,,,,182.5,,,,182.5,B,Multi-ply,1
Randall Wrye,75,Masters 47-53,M,47-53,,,,,,,170,,,,170,B,Multi-ply,2
Jim Cargill,75,Masters 47-53,M,47-53,,,,,,,157.5,,,,157.5,B,Multi-ply,3
Ferrel Gray,75,Masters 47-53,M,47-53,,,,,,,110,,,,110,B,Multi-ply,4
Edgar Martinez #7,82.5,Masters 47-53,M,47-53,,,,,,,155,,,,155,B,Single-ply,1
Perry Plush,82.5,Masters 47-53,M,47-53,,,,,,,152.5,,,,152.5,B,Multi-ply,2
Rocco Parodi,82.5,Masters 47-53,M,47-53,,,,,,,150,,,,150,B,Multi-ply,3
John Tyree,82.5,Masters 47-53,M,47-53,,,,,,,150,,,,150,B,Multi-ply,4
Ron Jones,82.5,Masters 47-53,M,47-53,,,,,,,110,,,,110,B,Multi-ply,5
Eric Ansberry,82.5,Masters 47-53,M,47-53,,,,,,,100,,,,100,B,Multi-ply,6
Fred Martichuski,82.5,Masters 47-53,M,47-53,,,,,,,92.5,,,,92.5,B,Multi-ply,7
Rocky Gingg,90,Masters 47-53,M,47-53,,,,,,,220,,,,220,B,Multi-ply,1
Tom Gonnering,90,Masters 47-53,M,47-53,,,,,,,200,,,,200,B,Multi-ply,2
Steve Ramey,90,Masters 47-53,M,47-53,,,,,,,192.5,,,,192.5,B,Multi-ply,3
Mark Jamey Mauldin,90,Masters 47-53,M,47-53,,,,,,,157.5,,,,157.5,B,Multi-ply,4
Cecil Wood,90,Masters 47-53,M,47-53,,,,,,,127.5,,,,127.5,B,Multi-ply,5
Ronald Proctor,90,Masters 47-53,M,47-53,,,,,,,,,,,,B,Multi-ply,DQ
Randy Marchant,100,Masters 47-53,M,47-53,,,,,,,170,,,,170,B,Multi-ply,1
Ronald Edwards,100,Masters 47-53,M,47-53,,,,,,,167.5,,,,167.5,B,Multi-ply,2
Byron Sanford,100,Masters 47-53,M,47-53,,,,,,,147.5,,,,147.5,B,Multi-ply,3
Raul Lopez,100,Masters 47-53,M,47-53,,,,,,,140,,,,140,B,Multi-ply,4
Bob Gunn,110,Masters 47-53,M,47-53,,,,,,,205,,,,205,B,Multi-ply,1
Forest Hofer,110,Masters 47-53,M,47-53,,,,,,,175,,,,175,B,Multi-ply,2
Doug Ward,110,Masters 47-53,M,47-53,,,,,,,160,,,,160,B,Multi-ply,3
Mike Murphy,110,Masters 47-53,M,47-53,,,,,,,157.5,,,,157.5,B,Multi-ply,4
Gary Stevens,110,Masters 47-53,M,47-53,,,,,,,140,,,,140,B,Multi-ply,5
Willard Crossen Jr,110,Masters 47-53,M,47-53,,,,,,,,,,,,B,Multi-ply,DQ
Phil Andrews,125,Masters 47-53,M,47-53,,,,,,,225,,,,225,B,Multi-ply,1
Don Frosland Jr,125,Masters 47-53,M,47-53,,,,,,,225,,,,225,B,Multi-ply,2
Sam Pecktol,125,Masters 47-53,M,47-53,,,,,,,210,,,,210,B,Multi-ply,3
Steve Brown #8,125,Masters 47-53,M,47-53,,,,,,,197.5,,,,197.5,B,Multi-ply,4
Leo Contreras,125,Masters 47-53,M,47-53,,,,,,,195,,,,195,B,Multi-ply,5
Charles Kelly,125,Masters 47-53,M,47-53,,,,,,,172.5,,,,172.5,B,Multi-ply,6
William Poston,125,Masters 47-53,M,47-53,,,,,,,170,,,,170,B,Multi-ply,7
Frank Beeler,140,Masters 47-53,M,47-53,,,,,,,255,257,,,255,B,Multi-ply,1
Carl Rosborough,140+,Masters 47-53,M,47-53,,,,,,,230,,,,230,B,Multi-ply,1
Theodore Feight,67.5,Masters 54-60,M,54-60,,,,,,,85,,,,85,B,Multi-ply,1
Al Dalton,82.5,Masters 54-60,M,54-60,,,,,,,,,,,,B,Multi-ply,DQ
Rich Tsutsui,82.5,Masters 54-60,M,54-60,,,,,,,165,,,,165,B,Multi-ply,1
Jerry McCamman,82.5,Masters 54-60,M,54-60,,,,,,,147.5,,,,147.5,B,Multi-ply,2
R. Contreras,82.5,Masters 54-60,M,54-60,,,,,,,147.5,,,,147.5,B,Multi-ply,3
Ritchie Creevy,82.5,Masters 54-60,M,54-60,,,,,,,137.5,,,,137.5,B,Multi-ply,4
Michel Rioland,82.5,Masters 54-60,M,54-60,,,,,,,132.5,,,,132.5,B,Multi-ply,5
Dan Swift,90,Masters 54-60,M,54-60,,,,,,,182.5,,,,182.5,B,Multi-ply,1
Olício dos Santos Filho,90,Masters 54-60,M,54-60,58,,Brazil,,,,147.5,,,,147.5,B,Multi-ply,2
Tom Haggenmiller,90,Masters 54-60,M,54-60,,,,,,,145,,,,145,B,Multi-ply,3
Godfrey Holzinger,90,Masters 54-60,M,54-60,,,,,,,137.5,,,,137.5,B,Multi-ply,4
Bob Hill,90,Masters 54-60,M,54-60,,,,,,,132.5,,,,132.5,B,Multi-ply,5
George Nelson,110,Masters 54-60,M,54-60,59,,,,,,240,,,,240,B,Multi-ply,1
Daniel Smith III,110,Masters 54-60,M,54-60,,,,,,,182.5,,,,182.5,B,Multi-ply,2
McElvin Pope,110,Masters 54-60,M,54-60,,,,,,,165,,,,165,B,Multi-ply,3
Burt Merriman,110,Masters 54-60,M,54-60,,,Canada,,,,152.5,,,,152.5,B,Multi-ply,4
Harold Barrat,110,Masters 54-60,M,54-60,,,,,,,122.5,,,,122.5,B,Multi-ply,5
Colin Bonneau,140,Masters 54-60,M,54-60,,,Canada,,,,227.5,232,,,227.5,B,Multi-ply,1
Robert O. Smith,140,Masters 54-60,M,54-60,,,Canada,,,,192.5,,,,192.5,B,Multi-ply,2
Richard Hamilton,140,Masters 54-60,M,54-60,,,,,,,150,,,,150,B,Multi-ply,3
Precious McKenzie,67.5,Masters 61-67,M,61-67,,61.69,New Zealand,,,,110,,,,110,B,Raw,1
Gerard Boucher,75,Masters 61-67,M,61-67,,,,,,,147.5,,,,147.5,B,Multi-ply,1
Richard Gidcumb,75,Masters 61-67,M,61-67,,,,,,,112.5,,,,112.5,B,Multi-ply,2
Rudy Lozano,82.5,Masters 61-67,M,61-67,,,,,,,160,,,,160,B,Multi-ply,1
Roy Guidry,82.5,Masters 61-67,M,61-67,,,,,,,147.5,,,,147.5,B,Multi-ply,2
Earl Beardall,82.5,Masters 61-67,M,61-67,,,,,,,110,,,,110,B,Multi-ply,3
Ken Anderson,90,Masters 61-67,M,61-67,,,,,,,192.5,,,,192.5,B,Multi-ply,1
John Herbein,90,Masters 61-67,M,61-67,,,,,,,110,,,,110,B,Multi-ply,2
Rodney Guidry,90,Masters 61-67,M,61-67,,,,,,,105,,,,105,B,Multi-ply,3
Bob Bassman,100,Masters 61-67,M,61-67,,,,,,,155,,,,155,B,Multi-ply,1
Mike Bonifield,110,Masters 61-67,M,61-67,,,,,,,127.5,,,,127.5,B,Multi-ply,1
Danny Herrera,125,Masters 61-67,M,61-67,,,,,,,182.5,,,,182.5,B,Multi-ply,1
Jimmy Duckett,125,Masters 61-67,M,61-67,,,,,,,150,,,,150,B,Multi-ply,2
Gary Thomas,140,Masters 61-67,M,61-67,,,,,,,192.5,,,,192.5,B,Multi-ply,1
Gary Johnson,140,Masters 61-67,M,61-67,,,,,,,155,,,,155,B,Multi-ply,2
Robert Cortes,67.5,Masters 68-74,M,68-74,,,,,,,110,,,,110,B,Multi-ply,1
Martin Gary,75,Masters 68-74,M,68-74,70,,,,,,100,,,,100,B,Multi-ply,1
Ron Goodman,75,Masters 68-74,M,68-74,,,,,,,95,,,,95,B,Multi-ply,2
Charles Ferrando,82.5,Masters 68-74,M,68-74,,,,,,,120,,,,120,B,Multi-ply,1
Earl Cotton,90,Masters 68-74,M,68-74,,,,,,,135,,,,135,B,Multi-ply,1
Jack Puccio,100,Masters 68-74,M,68-74,70,,,,,,145,,,,145,B,Multi-ply,1
Ernie Anderson,110,Masters 68-74,M,68-74,,,,,,,200,,,,200,B,Multi-ply,1
Arthur Whinston,67.5,Masters 75-79,M,75-79,77,,,,,,50,,,,50,B,Multi-ply,1
Robert Fornachon,75,Masters 75-79,M,75-79,,,,,,,100,,,,100,B,Multi-ply,1
Jim Schall,75,Masters 75-79,M,75-79,,,,,,,95,,,,95,B,Multi-ply,2
Dick Gibson,75,Masters 75-79,M,75-79,,,,,,,77.5,,,,77.5,B,Multi-ply,3
Sonny Ronolo,82.5,Masters 75-79,M,75-79,79,,,,,,132.5,,,,132.5,B,Multi-ply,1
Eugene L Miranda,100,Masters 75-79,M,75-79,,,,,,,110,,,,110,B,Multi-ply,1
Richard Turner #2,100,Masters 75-79,M,75-79,,,,,,,100,,,,100,B,Multi-ply,2
Jack Heizelman,67.5,Masters 80+,M,80-999,,,,,,,75,,,,75,B,Multi-ply,1
Donald Dreyer,82.5,Masters 80+,M,80-999,,,,,,,65,,,,65,B,Multi-ply,1
Gerardo Merino Jaramilio,48,Open,M,,,,Ecuador,,,,125,127.5,,,125,B,Multi-ply,1
Jason Imamura,60,Open,M,,,,,,,,130,,,,130,B,Multi-ply,1
Jeff Thomure,60,Open,M,,,,,,,,122.5,,,,122.5,B,Multi-ply,2
Danny Dickey,67.5,Open,M,,,,,,,,105,,,,105,B,Multi-ply,5
Taylor Tom,67.5,Open,M,,,,,,,,197.5,,,,197.5,B,Multi-ply,1
Kom Phanekham,67.5,Open,M,,,,,,,,157.5,,,,157.5,B,Multi-ply,2
Brad Montague,67.5,Open,M,,,,,,,,157.5,,,,157.5,B,Multi-ply,3
Scott Graves,67.5,Open,M,,,,,,,,130,,,,130,B,Multi-ply,4
Ray Hickman,75,Open,M,,,,,,,,195,,,,195,B,Multi-ply,1
Matt Elrod,75,Open,M,,,,,,,,192.5,,,,192.5,B,Multi-ply,2
Sheldon Weingust,75,Open,M,,,,,,,,182.5,,,,182.5,B,Multi-ply,3
Monte Hokoana,75,Open,M,,,,,,,,170,,,,170,B,Multi-ply,4
Jesse Romero,75,Open,M,,,,,,,,167.5,,,,167.5,B,Multi-ply,5
Andrew Scherer,75,Open,M,,,,,,,,162.5,,,,162.5,B,Multi-ply,6
Kenny Rothe,75,Open,M,,,,,,,,147.5,,,,147.5,B,Multi-ply,7
Michael Haynes,75,Open,M,,,,,,,,137.5,,,,137.5,B,Multi-ply,8
Ed Morishima,82.5,Open,M,,40,,,,,,217.5,,,,217.5,B,Multi-ply,1
Lee Jones,82.5,Open,M,,,,,,,,212.5,,,,212.5,B,Multi-ply,2
Jeff Sussman,82.5,Open,M,,,,,,,,205,,,,205,B,Multi-ply,3
Greg Bullington,82.5,Open,M,,,,,,,,162.5,,,,162.5,B,Multi-ply,4
Darren Carr,82.5,Open,M,,,,,,,,160,,,,160,B,Multi-ply,5
Byron Beebe,90,Open,M,,,,,,,,205,,,,205,B,Multi-ply,6
Allen Berry,90,Open,M,,,,,,,,200,,,,200,B,Multi-ply,8
Gustavo Warrington,90,Open,M,,,,,,,,242.5,,,,242.5,B,Multi-ply,1
George Herring #1,90,Open,M,,,,,,,,227.5,,,,227.5,B,Single-ply,2
Bill Shalkowski,90,Open,M,,,,,,,,227.5,,,,227.5,B,Multi-ply,3
Ernie Mil-Homens,90,Open,M,,,,,,,,210,,,,210,B,Multi-ply,4
Chad Matthews,90,Open,M,,,,,,,,207.5,,,,207.5,B,Multi-ply,5
Brant Bishop,90,Open,M,,,,,,,,202.5,,,,202.5,B,Multi-ply,7
Tom Gonnering,90,Open,M,,,,,,,,200,,,,200,B,Multi-ply,9
Frank Powell,90,Open,M,,,,,,,,177.5,,,,177.5,B,Multi-ply,10
Delwin Chinn,90,Open,M,,,,,,,,172.5,,,,172.5,B,Multi-ply,11
Fernando Salinas,90,Open,M,,,,,,,,145,,,,145,B,Multi-ply,12
Ched Ward,90,Open,M,,,,,,,,137.5,,,,137.5,B,Multi-ply,13
Cecil Wood,90,Open,M,,,,,,,,127.5,,,,127.5,B,Multi-ply,14
Matt LaMarque,100,Open,M,,,,,,,,247.5,,,,247.5,B,Multi-ply,1
Joe Raynor,100,Open,M,,,,,,,,247.5,,,,247.5,B,Multi-ply,2
Harry Woods,100,Open,M,,,,,,,,245,,,,245,B,Multi-ply,3
Mike Ludovico,100,Open,M,,,,,,,,240,,,,240,B,Multi-ply,4
Chris Duffin,100,Open,M,,,,,,,,232.5,,,,232.5,B,Multi-ply,5
Greg Stephens,100,Open,M,,,,,,,,232.5,,,,232.5,B,Multi-ply,6
Patrick Thomas #2,100,Open,M,,,,,,,,230,,,,230,B,Multi-ply,7
Brad Neal,100,Open,M,,,,,,,,227.5,,,,227.5,B,Multi-ply,8
Joe Guerra,100,Open,M,,,,,,,,217.5,,,,217.5,B,Multi-ply,9
Mike Desrosiers,100,Open,M,,,,,,,,212.5,,,,212.5,B,Multi-ply,10
Richard McKeefer,100,Open,M,,,,,,,,202.5,,,,202.5,B,Multi-ply,11
Bruce Nichols,100,Open,M,,,,,,,,192.5,,,,192.5,B,Multi-ply,12
Jason Gibson,100,Open,M,,,,,,,,182.5,,,,182.5,B,Multi-ply,13
Thomas Reiher,100,Open,M,,,,,,,,182.5,,,,182.5,B,Multi-ply,14
Paul Wondra,100,Open,M,,,,,,,,172.5,,,,172.5,B,Multi-ply,15
Dan Tubridy,100,Open,M,,,,,,,,150,,,,150,B,Multi-ply,16
Steve Peña #1,100,Open,M,,,,,,,,,,,,,B,Single-ply,DQ
Jason Jackson #7,110,Open,M,,,,,,,,287.5,292,,,287.5,B,Multi-ply,1
Russell Kilani,110,Open,M,,,,,,,,272.5,,,,272.5,B,Multi-ply,2
Frank Wakakuwa,110,Open,M,,,,,,,,272.5,,,,272.5,B,Multi-ply,3
George Nelson,110,Open,M,,59,,,,,,240,,,,240,B,Multi-ply,4
Phil Davi,110,Open,M,,,,,,,,235,,,,235,B,Multi-ply,5
Ryan Girard,110,Open,M,,,,,,,,217.5,,,,217.5,B,Multi-ply,6
Bob Vessels,110,Open,M,,,,,,,,200,,,,200,B,Multi-ply,7
Darren Thompson,125,Open,M,,,,,,,,222.5,,,,222.5,B,Multi-ply,1
George Sutton,125,Open,M,,,,,,,,217.5,,,,217.5,B,Multi-ply,2
Jerry Prichett,125,Open,M,,,,,,,,197.5,,,,197.5,B,Multi-ply,3
Tiny Meeker,125,Open,M,,,,,,,,,,,,,B,Multi-ply,DQ
Jim Schermerhorn,140,Open,M,,,,,,,,272.5,,,,272.5,B,Multi-ply,1
Jim Cunningham,140,Open,M,,,,,,,,267.5,,,,267.5,B,Multi-ply,2
David Dunn,140,Open,M,,,,,,,,230,,,,230,B,Multi-ply,3
Steve Khader,140,Open,M,,,,,,,,205,,,,205,B,Multi-ply,4
Bill Gillespie,140+,Open,M,,,,,,,,305,,,,305,B,Multi-ply,1
Tom Manno,140+,Open,M,,,,,,,,302.5,,,,302.5,B,Multi-ply,2
Chad Aichs,140+,Open,M,,,,,,,,250,,,,250,B,Multi-ply,3
Tomas McKinney,140+,Open,M,,,,,,,,225,,,,225,B,Multi-ply,4
Joaquin Diaz de Leon,140+,Open,M,,,,,,,,217.5,,,,217.5,B,Multi-ply,5
William Baker,140+,Open,M,,,,,,,,207.5,,,,207.5,B,Multi-ply,6
Jon Shapiro,60,Special Olympian,M,,,,,,,,125,,,,125,B,Multi-ply,1
Chad McFarland,67.5,Special Olympian,M,,,,,,,,87.5,,,,87.5,B,Multi-ply,1
Eric Janvier,67.5,Special Olympian,M,,,,,,,,65,,,,65,B,Multi-ply,2
Mike Sirard,67.5,Special Olympian,M,,,,,,,,50,,,,50,B,Multi-ply,3
Michael Bailey,75,Special Olympian,M,,,,,,,,72.5,,,,72.5,B,Multi-ply,1
Sean Coawrd,75,Special Olympian,M,,,,,,,,62.5,,,,62.5,B,Multi-ply,2
Brent Ruth,82.5,Special Olympian,M,,,,,,,,92.5,,,,92.5,B,Multi-ply,1
Michael McHugh #3,82.5,Special Olympian,M,,,,,,,,87.5,,,,87.5,B,Multi-ply,2
Antwon Belfils,82.5,Special Olympian,M,,,,,,,,70,,,,70,B,Multi-ply,3
Andrew Bixler,90,Special Olympian,M,,,,,,,,85,,,,85,B,Multi-ply,1
Adam Markham,90,Special Olympian,M,,,,,,,,80,,,,80,B,Multi-ply,2
Aaron Szoke,90,Special Olympian,M,,,,,,,,60,,,,60,B,Multi-ply,3
Scott Cortez,100,Special Olympian,M,,,,,,,,72.5,,,,72.5,B,Multi-ply,4
Kasey Dean,100,Special Olympian,M,,,,,,,,90,,,,90,B,Multi-ply,2
Jeff Hybl,100,Special Olympian,M,,,,,,,,90,,,,90,B,Multi-ply,3
Anthony Johnson,100,Special Olympian,M,,,,,,,,120,,,,120,B,Multi-ply,1
Trevor Irwin,100,Special Olympian,M,,,,,,,,55,,,,55,B,Multi-ply,5
L. Henderson,110,Special Olympian,M,,,,,,,,80,,,,80,B,Multi-ply,1
Brian Jonasson,110,Special Olympian,M,,,,,,,,80,,,,80,B,Multi-ply,2
Troy Hubbard,125,Special Olympian,M,,,,,,,,75,,,,75,B,Multi-ply,1
Soledad Rosas,48,Special Olympian,F,,,,,,,,47.5,,,,47.5,B,Multi-ply,1
Emily Matlack,82.5,Special Olympian,F,,,,,,,,42.5,,,,42.5,B,Multi-ply,1
Lauren Dare,82.5,Special Olympian,F,,,,,,,,40,,,,40,B,Multi-ply,2
Holley Matlack,90,Special Olympian,F,,,,,,,,45,,,,45,B,Multi-ply,1
Gerardo Merino Jaramilio,48,Submasters 34-39,M,34-39,,,Ecuador,,,,125,127.5,,,125,B,Multi-ply,1
Brian Crocker,67.5,Submasters 34-39,M,34-39,,,,,,,160,,,,160,B,Multi-ply,1
AJ Agamao,75,Submasters 34-39,M,34-39,,,,,,,200,,,,200,B,Multi-ply,1
Michael Haynes,75,Submasters 34-39,M,34-39,,,,,,,137.5,,,,137.5,B,Multi-ply,2
Greg Buffington,82.5,Submasters 34-39,M,34-39,,,,,,,162.5,,,,162.5,B,Multi-ply,1
Darren Carr,82.5,Submasters 34-39,M,34-39,,,,,,,160,,,,160,B,Multi-ply,2
Don Moser,82.5,Submasters 34-39,M,34-39,,,,,,,152.5,,,,152.5,B,Multi-ply,3
Brain Johnston,82.5,Submasters 34-39,M,34-39,,,Canada,,,,142.5,,,,142.5,B,Multi-ply,4
Matt Taylor,82.5,Submasters 34-39,M,34-39,,,,,,,135,,,,135,B,Multi-ply,5
Richard Anderson,82.5,Submasters 34-39,M,34-39,,,,,,,107.5,,,,107.5,B,Multi-ply,6
Bill Shalkowski,90,Submasters 34-39,M,34-39,,,,,,,227.5,,,,227.5,B,Multi-ply,1
Allen Berry,90,Submasters 34-39,M,34-39,,,,,,,200,,,,200,B,Multi-ply,2
Jason Frickey,90,Submasters 34-39,M,34-39,,,,,,,182.5,,,,182.5,B,Multi-ply,3
Andre Planehon,90,Submasters 34-39,M,34-39,,,,,,,182.5,,,,182.5,B,Multi-ply,4
Dennis Sugimoto,90,Submasters 34-39,M,34-39,,,,,,,170,,,,170,B,Multi-ply,5
Mike Dees,90,Submasters 34-39,M,34-39,,,,,,,132.5,,,,132.5,B,Multi-ply,6
Joe Raynor,100,Submasters 34-39,M,34-39,,,,,,,247.5,,,,247.5,B,Multi-ply,1
Harry Woods,100,Submasters 34-39,M,34-39,,,,,,,245,,,,245,B,Multi-ply,2
Kenneth Millrany,100,Submasters 34-39,M,34-39,,,,,,,212.5,,,,212.5,B,Multi-ply,3
David Bradshaw,100,Submasters 34-39,M,34-39,,,,,,,187.5,,,,187.5,B,Multi-ply,4
Russ Kitani,110,Submasters 34-39,M,34-39,,,,,,,272.5,,,,272.5,B,Multi-ply,1
Cody Colchado,110,Submasters 34-39,M,34-39,,,,,,,215,,,,215,B,Multi-ply,2
Danny Dorado,110,Submasters 34-39,M,34-39,,,,,,,200,,,,200,B,Multi-ply,3
Bob Vessels,110,Submasters 34-39,M,34-39,,,,,,,200,,,,200,B,Multi-ply,4
Allen Leavitt,110,Submasters 34-39,M,34-39,,,,,,,192.5,,,,192.5,B,Multi-ply,5
Terry Putman,110,Submasters 34-39,M,34-39,,,,,,,175,,,,175,B,Multi-ply,6
Ismyanto Soekardi,110,Submasters 34-39,M,34-39,,,,,,,,,,,,B,Multi-ply,DQ
John Stewart,125,Submasters 34-39,M,34-39,,,,,,,295,,,,295,B,Multi-ply,1
Carl Rogers #2,125,Submasters 34-39,M,34-39,,,,,,,250,,,,250,B,Multi-ply,2
Darren Thompson,125,Submasters 34-39,M,34-39,,,,,,,222.5,,,,222.5,B,Multi-ply,3
Joseph McMurray,125,Submasters 34-39,M,34-39,,,,,,,172.5,,,,172.5,B,Multi-ply,4
Steve Wong,140,Submasters 34-39,M,34-39,,,,,,,287.5,,,,287.5,B,Raw,1
Jim Schermerhorn,140,Submasters 34-39,M,34-39,,,,,,,272.5,,,,272.5,B,Multi-ply,2
John Barada,140,Submasters 34-39,M,34-39,,,,,,,267.5,,,,267.5,B,Multi-ply,2
Carmela Baqui,48,Submasters 34-39,F,34-39,,47.17,,,,,55,,,,55,B,Multi-ply,1
Lori Watson,52,Submasters 34-39,F,34-39,,,,,,,75,,,,75,B,Multi-ply,1
Carol Richardson,52,Submasters 34-39,F,34-39,,,,,,,70,,,,70,B,Multi-ply,2
Shelley Ellis,52,Submasters 34-39,F,34-39,,,,,,,55,,,,55,B,Multi-ply,3
Julie Green #2,56,Submasters 34-39,F,34-39,,,,,,,77.5,80,,,77.5,B,Multi-ply,1
Jennifer Souders,56,Submasters 34-39,F,34-39,,,,,,,65,,,,65,B,Multi-ply,2
Michael Lemes,56,Submasters 34-39,F,34-39,,,,,,,57.5,,,,57.5,B,Multi-ply,3
Elodia Womack,60,Submasters 34-39,F,34-39,,,,,,,55,,,,55,B,Multi-ply,1
Jenn Martindale,60,Submasters 34-39,F,34-39,,,,,,,47.5,,,,47.5,B,Multi-ply,2
Latasia Anzai,67.5,Submasters 34-39,F,34-39,,,,,,,72.5,,,,72.5,B,Multi-ply,1
Jeanne Watts,67.5,Submasters 34-39,F,34-39,,,,,,,70,,,,70,B,Multi-ply,2
Kelly Mahoney,75,Submasters 34-39,F,34-39,,,,,,,80,,,,80,B,Multi-ply,2
Gaye England,75,Submasters 34-39,F,34-39,,,,,,,70,,,,70,B,Multi-ply,4
Kelli Sandoval,75,Submasters 34-39,F,34-39,,,,,,,82.5,,,,82.5,B,Multi-ply,1
Brendakay Brown,75,Submasters 34-39,F,34-39,,,,,,,72.5,,,,72.5,B,Multi-ply,3
Cheryl Williams #3,75,Submasters 34-39,F,34-39,,,,,,,67.5,,,,67.5,B,Multi-ply,5
Kelly Franklin,90+,Submasters 34-39,F,34-39,,,,,,,155,,,,155,B,Single-ply,1
Sheri Wyatt,90+,Submasters 34-39,F,34-39,,,,,,,107.5,,,,107.5,B,Multi-ply,2
Carrie Novikoff,90+,Submasters 34-39,F,34-39,,,,,,,97.5,,,,97.5,B,Multi-ply,3
Trent Corey,48,Teen 13-15,M,13-15,,,,,,,60,,,,60,B,Multi-ply,1
Mitchell Ellis,56,Teen 13-15,M,13-15,,,,,,,72.5,,,,72.5,B,Multi-ply,1
Jared Vogel,56,Teen 13-15,M,13-15,,,,,,,60,,,,60,B,Multi-ply,2
Travis Edwards,60,Teen 13-15,M,13-15,,,,,,,52.5,,,,52.5,B,Multi-ply,1
Steffan Parodi,67.5,Teen 13-15,M,13-15,,,,,,,117.5,120,,,117.5,B,Multi-ply,1
Coty Hargett,67.5,Teen 13-15,M,13-15,,,,,,,107.5,,,,107.5,B,Multi-ply,2
Adam Castleman,67.5,Teen 13-15,M,13-15,,,,,,,75,,,,75,B,Multi-ply,3
Pat Ward,67.5,Teen 13-15,M,13-15,,,,,,,65,,,,65,B,Multi-ply,4
Justin Berman,67.5,Teen 13-15,M,13-15,,,,,,,52.5,,,,52.5,B,Multi-ply,5
Bryan Huffer,67.5,Teen 13-15,M,13-15,,,,,,,35,,,,35,B,Multi-ply,6
Zach O'Quinn,75,Teen 13-15,M,13-15,,,,,,,120,,,,120,B,Multi-ply,1
Andy Hedman,75,Teen 13-15,M,13-15,,,,,,,92.5,,,,92.5,B,Multi-ply,2
Jeremy Fairchild,75,Teen 13-15,M,13-15,,,,,,,77.5,,,,77.5,B,Multi-ply,3
Josh Devereux,82.5,Teen 13-15,M,13-15,,,,,,,100,,,,100,B,Multi-ply,1
Andy Munsey,82.5,Teen 13-15,M,13-15,,,,,,,97.5,,,,97.5,B,Multi-ply,2
Adam Contreras #1,82.5,Teen 13-15,M,13-15,,,,,,,95,,,,95,B,Multi-ply,3
Du Juan Calvo,90,Teen 13-15,M,13-15,,,,,,,100,,,,100,B,Multi-ply,1
C. Gillespie,100,Teen 13-15,M,13-15,,,,,,,120,,,,120,B,Multi-ply,1
Christian Benvin,100,Teen 13-15,M,13-15,,,,,,,72.5,,,,72.5,B,Multi-ply,2
Randall Griggs,48,Teen 16-19,M,16-19,,,,,,,,,,,,B,Multi-ply,DQ
Stefen Hudson,48,Teen 16-19,M,16-19,,,,,,,42.5,,,,42.5,B,Multi-ply,1
Chuckie Snider,60,Teen 16-19,M,16-19,,,,,,,115,,,,115,B,Multi-ply,1
Cory Johnson,60,Teen 16-19,M,16-19,,,,,,,85,,,,85,B,Multi-ply,2
Kyle Herzik,67.5,Teen 16-19,M,16-19,,,,,,,105,,,,105,B,Multi-ply,1
Thomas Jackson,67.5,Teen 16-19,M,16-19,,,,,,,92.5,,,,92.5,B,Multi-ply,2
Trevor Stewart,67.5,Teen 16-19,M,16-19,,,,,,,87.5,,,,87.5,B,Multi-ply,3
Robert Gernert,75,Teen 16-19,M,16-19,,,,,,,165,,,,165,B,Multi-ply,1
Andrew Scherer,75,Teen 16-19,M,16-19,,,,,,,152.5,,,,152.5,B,Multi-ply,2
Michael Minahan,75,Teen 16-19,M,16-19,,,,,,,115,,,,115,B,Multi-ply,3
Jason McWalter,75,Teen 16-19,M,16-19,,,,,,,90,,,,90,B,Multi-ply,4
Bobby Hackett,82.5,Teen 16-19,M,16-19,,,,,,,170,,,,170,B,Multi-ply,1
Damon Fabacher,82.5,Teen 16-19,M,16-19,,,,,,,142.5,,,,142.5,B,Multi-ply,2
Charlie Cook,82.5,Teen 16-19,M,16-19,,,,,,,102.5,,,,102.5,B,Multi-ply,3
Mike Bennett,90,Teen 16-19,M,16-19,,,,,,,132.5,,,,132.5,B,Multi-ply,1
Dustin McFarland,90,Teen 16-19,M,16-19,,,,,,,110,,,,110,B,Multi-ply,2
Kevin Bowen,90,Teen 16-19,M,16-19,,,,,,,102.5,,,,102.5,B,Multi-ply,3
Brandon Faulk,100,Teen 16-19,M,16-19,,,,,,,220,,,,220,B,Multi-ply,1
Adam Hix,100,Teen 16-19,M,16-19,,,,,,,182.5,,,,182.5,B,Multi-ply,2
Kaleb Crafts,100,Teen 16-19,M,16-19,,,,,,,165,,,,165,B,Multi-ply,3
Kevin Adams,100,Teen 16-19,M,16-19,,,,,,,90,,,,90,B,Multi-ply,4
Jim Pritchett,110,Teen 16-19,M,16-19,,,,,,,127.5,,,,127.5,B,Multi-ply,1
Max Higgins,125,Teen 16-19,M,16-19,,,,,,,200,,,,200,B,Multi-ply,1
Terry Corwin,140,Teen 16-19,M,16-19,,,,,,,182.5,,,,182.5,B,Multi-ply,1
Katherine Todd,44,Teen 13-15,F,13-15,,,,,,,25,,,,25,B,Multi-ply,1
Kaila Fairchild,60,Teen 13-15,F,13-15,14,,,,,,67.5,,,,67.5,B,Multi-ply,1
Amanda Proctor,67.5,Teen 13-15,F,13-15,,,,,,,57.5,,,,57.5,B,Multi-ply,1
Nikki Williams,75,Teen 13-15,F,13-15,,,,,,,67.5,70,,,67.5,B,Multi-ply,1
Margot O'Halloran,75,Teen 13-15,F,13-15,,,,,,,47.5,,,,47.5,B,Multi-ply,2
Bridggett Brown,90,Teen 13-15,F,13-15,,,,,,,52.5,,,,52.5,B,Multi-ply,1
Lisa Marie Garcia,44,Teen 16-19,F,16-19,,,,,,,37.5,,,,37.5,B,Multi-ply,1
Emily Pritchett,67.5,Teen 16-19,F,16-19,,,,,,,52.5,,,,52.5,B,Multi-ply,1
Kelly Womack,82.5,Teen 16-19,F,16-19,,,,,,,100,105,,,100,B,Multi-ply,1
Debra Anderson,82.5,Teen 16-19,F,16-19,,,,,,,55,,,,55,B,Multi-ply,2
Alexandria Calvo,90,Teen 16-19,F,16-19,,,,,,,65,,,,65,B,Multi-ply,1
Antonia Maurer,90,Teen 16-19,F,16-19,,,,,,,60,,,,60,B,Multi-ply,2
Jana Prothman,90+,Teen 16-19,F,16-19,,,,,,,87.5,,,,87.5,B,Multi-ply,1
Alyxa Conlee,90+,Teen 16-19,F,16-19,,,,,,,35,,,,35,B,Multi-ply,2
Ana Cordova de Merino,44,Open,F,,,,Ecuador,,,,50,,,,50,B,Multi-ply,1
Malia Weinress,44,Open,F,,,,,,,,47.5,,,,47.5,B,Multi-ply,2
Betty Lafferty,48,Open,F,,,,,,,,57.5,,,,57.5,B,Multi-ply,1
Patricia Loera,48,Open,F,,,,,,,,52.5,,,,52.5,B,Multi-ply,2
Mary Pederson,48,Open,F,,,,,,,,40,,,,40,B,Multi-ply,3
Jenny Macy,52,Open,F,,,,,,,,90,,,,90,B,Multi-ply,1
Donna Arndt,52,Open,F,,,,,,,,87.5,,,,87.5,B,Multi-ply,2
Carol Richardson,52,Open,F,,,,,,,,70,,,,70,B,Multi-ply,3
Jenn MacQuarrie,52,Open,F,,,,,,,,55,,,,55,B,Multi-ply,4
Carol Ann Myers,56,Open,F,,,,,,,,87.5,,,,87.5,B,Multi-ply,1
Karen Gordon,56,Open,F,,,55.34,,,,,77.5,,,,77.5,B,Multi-ply,2
Laci Livingston,56,Open,F,,,,,,,,75,,,,75,B,Multi-ply,3
Drusilla Amos,56,Open,F,,,,,,,,67.5,,,,67.5,B,Multi-ply,4
Tiffany Dean,56,Open,F,,,,,,,,65,,,,65,B,Multi-ply,5
Danna Snow,56,Open,F,,,,,,,,62.5,,,,62.5,B,Multi-ply,6
Victoria Reese,60,Open,F,,,,,,,,115,,,,115,B,Multi-ply,1
Mary Jacobson,60,Open,F,,,,,,,,107.5,,,,107.5,B,Multi-ply,2
Gael Okicich,60,Open,F,,57,,,,,,47.5,,,,47.5,B,Multi-ply,3
Lyn Silbert,75,Open,F,,,,,,,,125,,,,125,B,Multi-ply,1
Nicole Rodalos,75,Open,F,,,,,,,,57.5,,,,57.5,B,Multi-ply,2
Maguena Aragon de Cabelleros,90,Open,F,,,,Guatemala,,,,127.5,,,,127.5,B,Multi-ply,1
Michelle Ichiyama,90,Open,F,,,,,,,,92.5,,,,92.5,B,Multi-ply,2
Susan Adkinson,90,Open,F,,,,,,,,85,,,,85,B,Multi-ply,3
Atalie Garrish,90,Open,F,,,,,,,,65,,,,65,B,Multi-ply,4
Kelly Franklin,90+,Open,F,,,,,,,,155,,,,155,B,Single-ply,1
Kireen Ellis,90+,Open,F,,,97.52,,,,,107.5,,,,107.5,B,Multi-ply,2
Amy van der Pol,90+,Open,F,,,,,,,,97.5,,,,97.5,B,Multi-ply,3
Carrie Novikoff,90+,Open,F,,,,,,,,92.5,,,,92.5,B,Multi-ply,4
Donna Arndt,52,Masters 40-46,F,40-46,,,,,,,87.5,,,,87.5,B,Multi-ply,1
Carol Ann Myers,56,Masters 40-46,F,40-46,,,,,,,87.5,,,,87.5,B,Multi-ply,1
Leticia Rosales-Buie,56,Masters 40-46,F,40-46,,,,,,,72.5,,,,72.5,B,Multi-ply,2
Denise Ruff,56,Masters 40-46,F,40-46,,,,,,,70,,,,70,B,Multi-ply,3
Drusilla Amos,56,Masters 40-46,F,40-46,,,,,,,70,,,,70,B,Multi-ply,4
Tiffany Dean,56,Masters 40-46,F,40-46,,,,,,,65,,,,65,B,Multi-ply,5
Ruth Kirby,56,Masters 40-46,F,40-46,,,,,,,50,,,,50,B,Multi-ply,6
Alene Brisbane,60,Masters 40-46,F,40-46,,,,,,,70,,,,70,B,Multi-ply,1
Jill Deuser,60,Masters 40-46,F,40-46,,,,,,,70,,,,70,B,Multi-ply,2
Toni Jones,60,Masters 40-46,F,40-46,,,,,,,67.5,,,,67.5,B,Multi-ply,3
KC Inlow,60,Masters 40-46,F,40-46,,,,,,,67.5,,,,67.5,B,Multi-ply,4
Robbin Finnerty,67.5,Masters 40-46,F,40-46,,,,,,,72.5,,,,72.5,B,Multi-ply,1
Bonita Betz,67.5,Masters 40-46,F,40-46,,,,,,,57.5,,,,57.5,B,Multi-ply,2
Sheri Klocke,75,Masters 40-46,F,40-46,,,,,,,82.5,,,,82.5,B,Multi-ply,1
Maguena Aragon de Cabelleros,90,Masters 40-46,F,40-46,,,Ecuador,,,,127.5,,,,127.5,B,Multi-ply,1
Laura Feusi,90,Masters 40-46,F,40-46,,,,,,,97.5,,,,97.5,B,Multi-ply,2
Susan Adkison,90,Masters 40-46,F,40-46,,,,,,,85,,,,85,B,Multi-ply,3
Margie Huston,90,Masters 40-46,F,40-46,,,,,,,62.5,,,,62.5,B,Multi-ply,4
Heidi Rodriguez,52,Masters 47-53,F,47-53,,,Guatemala,,,,67.5,70,,,67.5,B,Multi-ply,1
Lizabeth Darling,52,Masters 47-53,F,47-53,,,,,,,57.5,,,,57.5,B,Multi-ply,2
Glenda Egan,52,Masters 47-53,F,47-53,,,,,,,40,,,,40,B,Multi-ply,3
Laura Mullen,52,Masters 47-53,F,47-53,,,,,,,32.5,,,,32.5,B,Multi-ply,4
Gerrie Shapiro,60,Masters 47-53,F,47-53,,,,,,,75,,,,75,B,Multi-ply,1
Margaret Morris,60,Masters 47-53,F,47-53,,,,,,,42.5,,,,42.5,B,Multi-ply,2
Mary Jacobson,67.5,Masters 47-53,F,47-53,,,,,,,107.5,,,,107.5,B,Multi-ply,1
Julie Orr,75,Masters 47-53,F,47-53,,,,,,,82.5,,,,82.5,B,Multi-ply,1
Lynda Strand,82.5,Masters 47-53,F,47-53,,,,,,,65,,,,65,B,Multi-ply,1
Wilma Cadavona,90,Masters 47-53,F,47-53,,,,,,,80,,,,80,B,Multi-ply,1
Carolyn Fay,90+,Masters 47-53,F,47-53,,,,,,,45,,,,45,B,Multi-ply,1
Mary Pederson,48,Masters 54-60,F,54-60,,,,,,,40,,,,40,B,Multi-ply,1
Barbara Anderson,67.5,Masters 54-60,F,54-60,,,,,,,65,,,,65,B,Multi-ply,1
Claire Heckatho,67.5,Masters 54-60,F,54-60,,,,,,,55,,,,55,B,Multi-ply,2
Gael Okicich,67.5,Masters 54-60,F,54-60,57,,,,,,47.5,,,,47.5,B,Multi-ply,3
Ellie Cary,67.5,Masters 54-60,F,54-60,,,,,,,35,,,,35,B,Multi-ply,4
Dawn Ivey-Vick,90,Masters 54-60,F,54-60,,,,,,,42.5,,,,42.5,B,Multi-ply,3
Karen Polansky,90,Masters 54-60,F,54-60,,,,,,,72.5,,,,72.5,B,Multi-ply,1
Pat Robey,90,Masters 54-60,F,54-60,,,,,,,65,,,,65,B,Multi-ply,2
Leilah Watson,90+,Masters 54-60,F,54-60,,,,,,,85,,,,85,B,Multi-ply,1
Jane Honeycutt,56,Masters 61-67,F,61-67,61,,,,,,32.5,,,,32.5,B,Multi-ply,3
Nancy Goldstein,56,Masters 61-67,F,61-67,,,,,,,40,40.5,,,40,B,Multi-ply,1
Martha Hopkins,56,Masters 61-67,F,61-67,,,,,,,35,,,,35,B,Multi-ply,2
Sue Clark,67.5,Masters 61-67,F,61-67,,,,,,,45,,,,45,B,Multi-ply,1
Malvina Basso,56,Masters 68-74,F,68-74,72,,Brazil,,,,32.5,,,,32.5,B,Multi-ply,1
Marcia Turner,67.5,Masters 68-74,F,68-74,,,,,,,60,,,,60,B,Multi-ply,1
Melicent Whinston,60,Masters 75-79,F,75-79,,,,,,,30,30.5,,,30,B,Multi-ply,1
Ryan Kennelly,140,Open,M,,,,,325,347.5,-365,347.5,-365,,,347.5,B,Multi-ply,G
Jason Imamaura,60,Class 1,M,,,,,,,,,,182.5,,182.5,D,Single-ply,1
Jon Shapiro,60,Class 1,M,,,,,,,,,,162.5,,162.5,D,Single-ply,2
Shawn Hildesheim,67.5,Class 1,M,,,,,,,,,,207.5,,207.5,D,Single-ply,1
Eric Nahomiak,67.5,Class 1,M,,,,,,,,,,205,,205,D,Single-ply,2
Garette Langmead,67.5,Class 1,M,,,,,,,,,,195,,195,D,Single-ply,3
Amadeo Fernandez,67.5,Class 1,M,,,,,,,,,,182.5,,182.5,D,Single-ply,4
Curt Cannistraci,67.5,Class 1,M,,,,,,,,,,165,,165,D,Single-ply,5
David Brinegar,67.5,Class 1,M,,,,,,,,,,137.5,,137.5,D,Single-ply,6
Ronnie High,75,Class 1,M,,,,,,,,,,222.5,,222.5,D,Single-ply,1
Martin Garry,75,Class 1,M,,70,,,,,,,,200,,200,D,Single-ply,2
Curtis Stranghoener,75,Class 1,M,,,,,,,,,,185,,185,D,Single-ply,3
Tom Swisher,75,Class 1,M,,,,,,,,,,147.5,,147.5,D,Single-ply,4
Pablo Arriaga,82.5,Class 1,M,,,,,,,,,,237.5,,237.5,D,Single-ply,1
Jon Yoshimura,82.5,Class 1,M,,,,,,,,,,215,,215,D,Single-ply,2
Sean Olsen,90,Class 1,M,,,,,,,,,,285,,285,D,Single-ply,1
Steve Ughe,90,Class 1,M,,,,,,,,,,262.5,,262.5,D,Single-ply,2
Brant Bishop,90,Class 1,M,,,,,,,,,,262.5,,262.5,D,Single-ply,3
Nathan Nelson,90,Class 1,M,,,,,,,,,,255,,255,D,Single-ply,4
Mark Pearce,90,Class 1,M,,,,,,,,,,250,,250,D,Single-ply,5
Bobby Myers,90,Class 1,M,,,,,,,,,,247.5,,247.5,D,Single-ply,6
Rick MacQuarrie,90,Class 1,M,,,,,,,,,,247.5,,247.5,D,Single-ply,7
Vice Lujan,90,Class 1,M,,,,,,,,,,237.5,,237.5,D,Single-ply,8
Matthew Christie,90,Class 1,M,,,,,,,,,,237.5,,237.5,D,Single-ply,9
Michael Choate,90,Class 1,M,,,,,,,,,,230,,230,D,Single-ply,10
John Herbein,90,Class 1,M,,,,,,,,,,227.5,,227.5,D,Single-ply,11
Frank Powell,90,Class 1,M,,,,,,,,,,215,,215,D,Single-ply,12
Mike Dees,90,Class 1,M,,,,,,,,,,185,,185,D,Single-ply,13
Brett Blausey,100,Class 1,M,,,,,,,,,,280,,280,D,Single-ply,1
Jason Gibson,100,Class 1,M,,,,,,,,,,255,,255,D,Single-ply,2
Michael Rainey,100,Class 1,M,,,,,,,,,,250,,250,D,Single-ply,3
Al Tortorelli,100,Class 1,M,,,,,,,,,,247.5,,247.5,D,Single-ply,4
Harland Barrett,100,Class 1,M,,,,,,,,,,242.5,,242.5,D,Single-ply,5
George Phipps,100,Class 1,M,,,,,,,,,,240,,240,D,Single-ply,6
Robert Budd,100,Class 1,M,,,,,,,,,,237.5,,237.5,D,Single-ply,7
Thomas Reiher,100,Class 1,M,,,,,,,,,,215,,215,D,Single-ply,8
Dale Lindsey,100,Class 1,M,,,,,,,,,,207.5,,207.5,D,Single-ply,9
Terry Putman,110,Class 1,M,,,,,,,,,,280,,280,D,Single-ply,1
Buddy McKee,110,Class 1,M,,,,,,,,,,280,,280,D,Single-ply,2
Ed Barnes,110,Class 1,M,,,,,,,,,,267.5,,267.5,D,Single-ply,3
Michael Smyser,110,Class 1,M,,,,,,,,,,260,,260,D,Single-ply,4
Tim Prince,110,Class 1,M,,,,,,,,,,237.5,,237.5,D,Single-ply,5
Henry Higgins,110,Class 1,M,,,,,,,,,,230,,230,D,Single-ply,6
Bobby Blackmon,110,Class 1,M,,,,,,,,,,225,,225,D,Single-ply,7
Gregg Ramsdell,110,Class 1,M,,,,,,,,,,217.5,,217.5,D,Single-ply,8
Mike Murphy,110,Class 1,M,,,,,,,,,,210,,210,D,Single-ply,9
Kevin Lockett,110,Class 1,M,,,,,,,,,,210,,210,D,Single-ply,10
Norman Rial,125,Class 1,M,,,,,,,,,,262.5,,262.5,D,Single-ply,1
Ted Stewart,125,Class 1,M,,,,,,,,,,260,,260,D,Single-ply,2
Carl Wimmer,125,Class 1,M,,,,,,,,,,237.5,,237.5,D,Single-ply,3
Jeff McGrath,125,Class 1,M,,,,,,,,,,230,,230,D,Single-ply,4
Mario Cravea,125,Class 1,M,,,,,,,,,,227.5,,227.5,D,Single-ply,5
Leo Contreras,125,Class 1,M,,,,,,,,,,205,,205,D,Single-ply,6
Tom Ekenberg,140,Class 1,M,,,,,,,,,,290,,290,D,Single-ply,1
Brett Fleak,140,Class 1,M,,,,,,,,,,290,,290,D,Single-ply,2
John Newman,140,Class 1,M,,,,,,,,,,262.5,,262.5,D,Single-ply,3
Bubba McConnell,140,Class 1,M,,,,,,,,,,250,,250,D,Single-ply,4
Bill Carpenter,140,Class 1,M,,,,,,,,,,250,,250,D,Single-ply,5
Alan Valentin,140+,Class 1,M,,,,,,,,,,255,,255,D,Single-ply,1
Bryan Huffer,67.5,Disabled,M,,,,,,,,,,77.5,,77.5,D,Single-ply,1
Matthew Taylor,75,Disabled,M,,,,,,,,,,222.5,,222.5,D,Single-ply,1
Nick Sinardi,90,Disabled,M,,,,,,,,,,232.5,,232.5,D,Single-ply,1
Steve Peña #1,100,Disabled,M,,,,,,,,,,255,,255,D,Single-ply,1
Michael Elliot,100,Disabled,M,,,,,,,,,,195,,195,D,Single-ply,2
Cody Cochado,110,Disabled,M,,,,,,,,,,272.5,,272.5,D,Single-ply,1
Bobby Blackmon,110,Disabled,M,,,,,,,,,,227.5,,227.5,D,Single-ply,2
Omar Sanchez,140,Disabled,M,,,,,,,,,,240,,240,D,Single-ply,1
Lisa Marie Garcia,44,Disabled,F,,,,,,,,,,70,75.5,70,D,Single-ply,1
Katherine Todd,44,Disabled,F,,,,,,,,,,67.5,,67.5,D,Single-ply,2
Alyxa Conlee,90+,Disabled,F,,,,,,,,,,77.5,,77.5,D,Single-ply,1
Ammon Stephens,75,Juniors 20-25,M,20-25,,,,,,,,,227.5,,227.5,D,Single-ply,1
Michael Aultman,75,Juniors 20-25,M,20-25,,,,,,,,,195,,195,D,Single-ply,2
Jake Scheid,75,Juniors 20-25,M,20-25,,,,,,,,,187.5,,187.5,D,Single-ply,3
Peter Alfredsson,82.5,Juniors 20-25,M,20-25,,,Sweden,,,,,,242.5,,242.5,D,Single-ply,1
Casey Dunaway,82.5,Juniors 20-25,M,20-25,,,,,,,,,235,,235,D,Single-ply,2
Jackson Smith,82.5,Juniors 20-25,M,20-25,,,,,,,,,205,,205,D,Single-ply,3
Ryan LaPlace,82.5,Juniors 20-25,M,20-25,,,,,,,,,192.5,,192.5,D,Single-ply,4
Tony Caprari,90,Juniors 20-25,M,20-25,21,,,,,,,,347.5,,347.5,D,Single-ply,1
Chad Matthews,90,Juniors 20-25,M,20-25,,,,,,,,,295,,295,D,Single-ply,2
Matthew Christie,90,Juniors 20-25,M,20-25,,,,,,,,,237.5,,237.5,D,Single-ply,3
Vice Lujan,90,Juniors 20-25,M,20-25,,,,,,,,,237.5,,237.5,D,Single-ply,4
Chris Duffin,100,Juniors 20-25,M,20-25,,,,,,,,,277.5,,277.5,D,Single-ply,1
Brandon Chamras,100,Juniors 20-25,M,20-25,,,,,,,,,262.5,,262.5,D,Single-ply,2
William Hamilton,100,Juniors 20-25,M,20-25,,,,,,,,,247.5,,247.5,D,Single-ply,3
Jamie Bennett,100,Juniors 20-25,M,20-25,,,,,,,,,192.5,,192.5,D,Single-ply,4
Don Goldsworthy,110,Juniors 20-25,M,20-25,,,,,,,,,277.5,,277.5,D,Single-ply,1
Tony Arterburn,110,Juniors 20-25,M,20-25,,,,,,,,,275,,275,D,Single-ply,2
Jerry Pritchett,125,Juniors 20-25,M,20-25,,,,,,,,,332.5,,332.5,D,Single-ply,1
Chad Shiel,125,Juniors 20-25,M,20-25,,,Canada,,,,,,260,,260,D,Single-ply,2
Bobby Snyder,125,Juniors 20-25,M,20-25,,,,,,,,,245,,245,D,Single-ply,3
Toby Levers,140,Juniors 20-25,M,20-25,,,,,,,,,332.5,,332.5,D,Single-ply,1
Leonetta Richardson,75,Juniors 20-25,F,20-25,,,,,,,,,165,,165,D,Single-ply,1
Stacey Hammar,75,Juniors 20-25,F,20-25,,,,,,,,,160,,160,D,Single-ply,2
David Edmondson,67.5,Law-Fire 40-47,M,40-47,,,,,,,,,210,,210,D,Single-ply,1
Terry Wilson #1,90,Law-Fire 40-47,M,40-47,,,,,,,,,247.5,,247.5,D,Single-ply,1
Zachary Clark,100,Law-Fire 40-47,M,40-47,,,,,,,,,305,,305,D,Single-ply,1
Ronald England,100,Law-Fire 40-47,M,40-47,,,,,,,,,245,,245,D,Single-ply,2
Tyler Kopta,110,Law-Fire 40-47,M,40-47,,,,,,,,,267.5,,267.5,D,Single-ply,1
Michael Irwin,110,Law-Fire 40-47,M,40-47,,,,,,,,,262.5,,262.5,D,Single-ply,2
Walt Faulkner,125,Law-Fire 40-47,M,40-47,,,,,,,,,320,,320,D,Single-ply,1
John Minahan,125,Law-Fire 40-47,M,40-47,,,,,,,,,255,,255,D,Single-ply,2
David Marchant,140+,Law-Fire 40-47,M,40-47,,,,,,,,,272.5,,272.5,D,Single-ply,1
Charles McFarland,90,Law-Fire 48+,M,48-999,,,,,,,,,257.5,,257.5,D,Single-ply,1
Tommy Green,90,Law-Fire 48+,M,48-999,,,,,,,,,215,,215,D,Single-ply,2
Patrick Fay,125,Law-Fire 48+,M,48-999,,,,,,,,,267.5,,267.5,D,Single-ply,1
Leticia Rosales-Buie,56,Law-Fire 40-47,F,40-47,,,,,,,,,142.5,147.5,142.5,D,Single-ply,1
Camellia Luprete,75,Law-Fire 40-47,F,40-47,,,,,,,,,117.5,,117.5,D,Single-ply,1
Carolyn Fay,90+,Law-Fire 40-47,F,40-47,,,,,,,,,112.5,,112.5,D,Single-ply,1
David Edmondson,67.5,Law-Fire Open,M,,,,,,,,,,210,,210,D,Single-ply,1
Pablo Arriaga,82.5,Law-Fire Open,M,,,,,,,,,,237.5,,237.5,D,Single-ply,1
William Rivord,90,Law-Fire Open,M,,,,,,,,,,287.5,,287.5,D,Single-ply,1
Zachary Clark,100,Law-Fire Open,M,,,,,,,,,,305,,305,D,Single-ply,1
Brent Howard,110,Law-Fire Open,M,,,,,,,,,,342.5,,342.5,D,Single-ply,1
Tony Arterburn,110,Law-Fire Open,M,,,,,,,,,,275,,275,D,Single-ply,2
Carl Wimmer,125,Law-Fire Open,M,,,,,,,,,,237.5,,237.5,D,Single-ply,1
Gordon Crisp,125,Law-Fire Open,M,,,,,,,,,,227.5,,227.5,D,Single-ply,2
Karen Gordon,56,Law-Fire Open,F,,,55.34,,,,,,,165,,165,D,Single-ply,1
Camellia Luprete,75,Law-Fire Open,F,,,,,,,,,,117.5,,117.5,D,Single-ply,1
Andy Ellis,82.5,Law-Fire Submasters,M,34-39,,,,,,,,,237.5,,237.5,D,Single-ply,1
Eric Fox,82.5,Law-Fire Submasters,M,34-39,,,,,,,,,237.5,,237.5,D,Single-ply,2
Darren Carr,82.5,Law-Fire Submasters,M,34-39,,,,,,,,,185,,185,D,Single-ply,3
Rodger Broome,100,Law-Fire Submasters,M,34-39,,,,,,,,,257.5,,257.5,D,Single-ply,1
Kevin Eller,100,Law-Fire Submasters,M,34-39,,,,,,,,,235,,235,D,Single-ply,2
Doug Tracy,110,Law-Fire Submasters,M,34-39,,,,,,,,,272.5,,272.5,D,Single-ply,1
Michael Smyser,110,Law-Fire Submasters,M,34-39,,,,,,,,,260,,260,D,Single-ply,2
Lance Davis,110,Law-Fire Submasters,M,34-39,,,,,,,,,240,,240,D,Single-ply,3
Michael Lemes,56,Law-Fire Submasters,F,34-39,,,,,,,,,122.5,,122.5,D,Single-ply,1
Cathy Bramanli,56,Law-Fire Submasters,F,34-39,,,,,,,,,105,,105,D,Single-ply,2
Latasia Anzai,67.5,Law-Fire Submasters,F,34-39,,,,,,,,,120,,120,D,Single-ply,1
Bobby Sanders,56,Masters 40-46,M,40-46,,,,,,,,,217.5,227.5,217.5,D,Single-ply,1
Curt Cannistraci,75,Masters 40-46,M,40-46,,,,,,,,,165,,165,D,Single-ply,4
Danny Winslow,75,Masters 40-46,M,40-46,,,,,,,,,,,,D,Single-ply,DQ
Leo Mattoni,75,Masters 40-46,M,40-46,,,,,,,,,235,,235,D,Single-ply,1
Ronnie High,75,Masters 40-46,M,40-46,,,,,,,,,222.5,,222.5,D,Single-ply,2
Marine Mosley,75,Masters 40-46,M,40-46,,,,,,,,,205,,205,D,Single-ply,3
Leamon Woodley,82.5,Masters 40-46,M,40-46,46,,,,,,,,305,,305,D,Single-ply,1
Gary Flamer,82.5,Masters 40-46,M,40-46,,,,,,,,,220,,220,D,Single-ply,2
George Herring #1,90,Masters 40-46,M,40-46,,,,,,,,,305,,305,D,Single-ply,1
David Bertier,90,Masters 40-46,M,40-46,,,,,,,,,252.5,,252.5,D,Single-ply,2
Mike McCormack,90,Masters 40-46,M,40-46,,,,,,,,,215,,215,D,Single-ply,3
Duane Burlingame,100,Masters 40-46,M,40-46,,,,,,,,,260,,260,D,Single-ply,1
Ray Whatley,100,Masters 40-46,M,40-46,,,,,,,,,255,,255,D,Single-ply,2
Larry Benner,100,Masters 40-46,M,40-46,,,,,,,,,250,,250,D,Single-ply,3
Ronald England,100,Masters 40-46,M,40-46,,,,,,,,,245,,245,D,Single-ply,4
Paul Wondra,100,Masters 40-46,M,40-46,,,,,,,,,227.5,,227.5,D,Single-ply,5
Michael Elliott,100,Masters 40-46,M,40-46,,,,,,,,,195,,195,D,Single-ply,6
Jerry Capello,110,Masters 40-46,M,40-46,,,,,,,,,320,,320,D,Single-ply,1
Pete Jackson,110,Masters 40-46,M,40-46,,,,,,,,,312.5,,312.5,D,Single-ply,2
AJ Dawson,110,Masters 40-46,M,40-46,,,,,,,,,290,,290,D,Single-ply,3
Bobby Driskill,110,Masters 40-46,M,40-46,,,,,,,,,290,,290,D,Single-ply,4
Buddy McKee,110,Masters 40-46,M,40-46,,,,,,,,,280,,280,D,Single-ply,5
Michael Irwin,110,Masters 40-46,M,40-46,,,,,,,,,262.5,,262.5,D,Single-ply,6
Steve Gaytan,110,Masters 40-46,M,40-46,,,,,,,,,237.5,,237.5,D,Single-ply,7
Brad Stewart,110,Masters 40-46,M,40-46,,,,,,,,,230,,230,D,Single-ply,8
Daivd Machado,110,Masters 40-46,M,40-46,,,,,,,,,227.5,,227.5,D,Single-ply,9
Dan Davidson,110,Masters 40-46,M,40-46,,,,,,,,,,,,D,Single-ply,DQ
Walt Faulkner,125,Masters 40-46,M,40-46,,,,,,,,,320,,320,D,Single-ply,1
Bob Smith,125,Masters 40-46,M,40-46,,,,,,,,,282.5,,282.5,D,Single-ply,2
Ken Eyre,125,Masters 40-46,M,40-46,,,,,,,,,245,,245,D,Single-ply,3
Cyril Lewis,140,Masters 40-46,M,40-46,,,,,,,,,327.5,,327.5,D,Single-ply,1
Andy Medak,140,Masters 40-46,M,40-46,,,,,,,,,317.5,,317.5,D,Single-ply,2
Steve Khader,140,Masters 40-46,M,40-46,,,,,,,,,287.5,,287.5,D,Single-ply,3
John Newman,140,Masters 40-46,M,40-46,,,,,,,,,262.5,,262.5,D,Single-ply,4
Joe Mickelson,140,Masters 40-46,M,40-46,,,,,,,,,257.5,,257.5,D,Single-ply,5
Paul Ratsch,140,Masters 40-46,M,40-46,,,,,,,,,,,,D,Single-ply,DQ
James Young,140+,Masters 40-46,M,40-46,,,,,,,,,297.5,,297.5,D,Single-ply,1
Brian Rehberg,140+,Masters 40-46,M,40-46,,,,,,,,,297.5,,297.5,D,Single-ply,2
David Chase,140+,Masters 40-46,M,40-46,,,,,,,,,260,,260,D,Single-ply,3
Alan Valentin,140+,Masters 40-46,M,40-46,,,,,,,,,255,,255,D,Single-ply,4
Homi Shivaie,60,Masters 47-53,M,47-53,,,,,,,,,192.5,,192.5,D,Single-ply,1
Gary Bobrovitz,60,Masters 47-53,M,47-53,,,Canada,,,,,,137.5,,137.5,D,Single-ply,2
Dean Kaneshiro,67.5,Masters 47-53,M,47-53,47,,,,,,,,250,,250,D,Single-ply,1
David Higgins,67.5,Masters 47-53,M,47-53,,,,,,,,,190,,190,D,Single-ply,2
Clotario Ortiz Portugal,67.5,Masters 47-53,M,47-53,,,Brazil,,,,,,135,,135,D,Single-ply,3
Richard Cirigliano,75,Masters 47-53,M,47-53,48,,,,,,,,280,,280,D,Single-ply,1
John Tyree,82.5,Masters 47-53,M,47-53,,,,,,,,,267.5,,267.5,D,Single-ply,1
Perry Plush,82.5,Masters 47-53,M,47-53,,,,,,,,,252.5,,252.5,D,Single-ply,2
Ron McNeely,82.5,Masters 47-53,M,47-53,,,,,,,,,250,,250,D,Single-ply,3
John Clay #2,82.5,Masters 47-53,M,47-53,,,,,,,,,237.5,,237.5,D,Single-ply,4
Fred Martichuski,82.5,Masters 47-53,M,47-53,,,,,,,,,182.5,,182.5,D,Single-ply,5
Eric Ansbery,82.5,Masters 47-53,M,47-53,,,,,,,,,160,,160,D,Single-ply,6
Richard Hagedorn,90,Masters 47-53,M,47-53,,,,,,,,,272.5,280.5,272.5,D,Single-ply,1
Ronald Proctor,90,Masters 47-53,M,47-53,,,,,,,,,225,,225,D,Single-ply,2
Mark Jamey Mauldin,90,Masters 47-53,M,47-53,,,,,,,,,217.5,,217.5,D,Single-ply,3
Cecil Wood,90,Masters 47-53,M,47-53,,,,,,,,,205,,205,D,Single-ply,4
David Stratton,100,Masters 47-53,M,47-53,49,,,,,,,,307.5,,307.5,D,Single-ply,1
Kevin Fisher,100,Masters 47-53,M,47-53,,,,,,,,,292.5,,292.5,D,Single-ply,2
Raul Lopez,100,Masters 47-53,M,47-53,,,,,,,,,237.5,,237.5,D,Single-ply,3
Donn Imrie,100,Masters 47-53,M,47-53,,,,,,,,,227.5,,227.5,D,Single-ply,4
Cliff Sandberg,110,Masters 47-53,M,47-53,,,,,,,,,287.5,,287.5,D,Single-ply,1
Gary Stevens,110,Masters 47-53,M,47-53,,,,,,,,,252.5,,252.5,D,Single-ply,2
Bill Anderberg,110,Masters 47-53,M,47-53,,,,,,,,,247.5,,247.5,D,Single-ply,3
Mike Murphy,110,Masters 47-53,M,47-53,,,,,,,,,210,,210,D,Single-ply,4
Phil Andrews,125,Masters 47-53,M,47-53,,,,,,,,,355,,355,D,Single-ply,1
Sam Pecktol,125,Masters 47-53,M,47-53,,,,,,,,,325,,325,D,Single-ply,2
Steve Brown #8,125,Masters 47-53,M,47-53,,,,,,,,,272.5,,272.5,D,Single-ply,3
Patrick Fay,125,Masters 47-53,M,47-53,,,,,,,,,267.5,,267.5,D,Single-ply,4
Keith Huffer,125,Masters 47-53,M,47-53,,,,,,,,,245,,245,D,Single-ply,5
Leo Contreras,125,Masters 47-53,M,47-53,,,,,,,,,205,,205,D,Single-ply,6
Tom Ekenberg,140,Masters 47-53,M,47-53,,,,,,,,,290,,290,D,Single-ply,1
Theodore Feight,67.5,Masters 54-60,M,54-60,,,,,,,,,165,,165,D,Single-ply,1
James Christian #1,75,Masters 54-60,M,54-60,,,,,,,,,210,,210,D,Single-ply,1
Christian Brenol,75,Masters 54-60,M,54-60,,,France,,,,,,170,,170,D,Single-ply,2
Roberto Contreras,82.5,Masters 54-60,M,54-60,,,,,,,,,247.5,,247.5,D,Single-ply,1
Gene Alexander,82.5,Masters 54-60,M,54-60,,,,,,,,,247.5,,247.5,D,Single-ply,2
Bob Hochstein,82.5,Masters 54-60,M,54-60,,,,,,,,,245,,245,D,Single-ply,3
Frank Isernio,82.5,Masters 54-60,M,54-60,,,,,,,,,205,,205,D,Single-ply,4
Al Dalton,82.5,Masters 54-60,M,54-60,,,,,,,,,160,,160,D,Single-ply,5
Olício dos Santos Filho,90,Masters 54-60,M,54-60,58,,Brazil,,,,,,310,,310,D,Single-ply,1
Tom Haggenmiller,90,Masters 54-60,M,54-60,,,,,,,,,240,,240,D,Single-ply,2
Chet Lundy,90,Masters 54-60,M,54-60,,,,,,,,,237.5,,237.5,D,Single-ply,3
Godfrey Holzinger,90,Masters 54-60,M,54-60,,,,,,,,,210,,210,D,Single-ply,4
Jim Snodgrass,90,Masters 54-60,M,54-60,,,,,,,,,202.5,,202.5,D,Single-ply,5
J. Skip Hall,100,Masters 54-60,M,54-60,57,,,,,,,,260,,260,D,Single-ply,2
Onnie Jordan,100,Masters 54-60,M,54-60,,,,,,,,,270,,270,D,Single-ply,1
Dave Cheek,100,Masters 54-60,M,54-60,,,,,,,,,210,,210,D,Single-ply,3
McElvin Pope,110,Masters 54-60,M,54-60,,,,,,,,,257.5,,257.5,D,Single-ply,1
Burt Merriman,110,Masters 54-60,M,54-60,,,Canada,,,,,,230,,230,D,Single-ply,2
Bud Davis,125,Masters 54-60,M,54-60,59,,,,,,,,295,,295,D,Single-ply,1
Ronnell Spikes,125,Masters 54-60,M,54-60,,,,,,,,,275,,275,D,Single-ply,2
Mike Fryar,125,Masters 54-60,M,54-60,,,,,,,,,270,,270,D,Single-ply,3
Bobby Dodd,125,Masters 54-60,M,54-60,,,,,,,,,197.5,,197.5,D,Single-ply,4
Richard Hamilton,140,Masters 54-60,M,54-60,,,,,,,,,220,,220,D,Single-ply,1
Precious McKenzie,67.5,Masters 61-67,M,61-67,,61.69,New Zealand,,,,,,200,,200,D,Raw,1
Richard Gidcumb,75,Masters 61-67,M,61-67,,,,,,,,,175,,175,D,Single-ply,1
John Scott #4,82.5,Masters 61-67,M,61-67,,,,,,,,,190,,190,D,Single-ply,1
John Herbein,90,Masters 61-67,M,61-67,,,,,,,,,227.5,,227.5,D,Single-ply,1
Bob Bassman,100,Masters 61-67,M,61-67,,,,,,,,,210,,210,D,Single-ply,1
Robert Andre,110,Masters 61-67,M,61-67,,,,,,,,,217.5,,217.5,D,Single-ply,1
Jimmy Duckett,125,Masters 61-67,M,61-67,,,,,,,,,175,,175,D,Single-ply,1
Gary Johnson,140,Masters 61-67,M,61-67,,,,,,,,,147.5,,147.5,D,Single-ply,1
Robert Cortes,67.5,Masters 68-74,M,68-74,,,,,,,,,217.5,222.5,217.5,D,Single-ply,1
Martin Garry,75,Masters 68-74,M,68-74,70,,,,,,,,200,,200,D,Single-ply,1
Earl Colton,90,Masters 68-74,M,68-74,,,,,,,,,200,,200,D,Single-ply,1
Al Cardwell,90,Masters 68-74,M,68-74,,,,,,,,,157.5,,157.5,D,Single-ply,2
Arthur Whinston,67.5,Masters 75-79,M,75-79,,,,,,,,,77.5,,77.5,D,Single-ply,1
Jim Schall,75,Masters 75-79,M,75-79,,,,,,,,,155,,155,D,Single-ply,1
Herbert Brandt,110,Masters 75-79,M,75-79,,,,,,,,,162.5,,162.5,D,Single-ply,1
Donald Dreyer,82.5,Masters 80+,M,80-999,,,,,,,,,95,,95,D,Single-ply,1
Richard Hawthorne,60,Open,M,,18,,,,,,,,260,,260,D,Single-ply,1
Jason Imamura,67.5,Open,M,,,,,,,,,,182.5,,182.5,D,Single-ply,4
Adrian Brooks,67.5,Open,M,,,,,,,,,,155,,155,D,Single-ply,6
Dean Kaneshiro,67.5,Open,M,,47,,,,,,,,250,,250,D,Single-ply,1
Brad Montague,67.5,Open,M,,,,,,,,,,222.5,,222.5,D,Single-ply,2
Garrett Landmead,67.5,Open,M,,,,,,,,,,195,,195,D,Single-ply,3
Juan Monoz,67.5,Open,M,,,,,,,,,,180,,180,D,Single-ply,5
Richard Cirigliano,75,Open,M,,48,,,,,,,,280,,280,D,Single-ply,1
Monte Hokoana,75,Open,M,,,,,,,,,,247.5,,247.5,D,Single-ply,2
Kenny Rothe,75,Open,M,,,,,,,,,,225,,225,D,Single-ply,3
Matthew Taylor,75,Open,M,,,,,,,,,,222.5,,222.5,D,Single-ply,4
Michael Haynes,75,Open,M,,,,,,,,,,192.5,,192.5,D,Single-ply,5
Leamon Woodley,82.5,Open,M,,46,,,,,,,,305,,305,D,Single-ply,1
Perry Plush,82.5,Open,M,,,,,,,,,,252.5,,252.5,D,Single-ply,2
Matt Taylor,82.5,Open,M,,,,,,,,,,205,,205,D,Single-ply,3
Tony Caprari,90,Open,M,,21,,,,,,,,347.5,,347.5,D,Single-ply,1
George Herring #1,90,Open,M,,,,,,,,,,305,,305,D,Single-ply,2
Chad Matthews,90,Open,M,,,,,,,,,,295,,295,D,Single-ply,3
Jeff Ray,90,Open,M,,,,,,,,,,292.5,,292.5,D,Single-ply,4
Ernie Mil-Homens,90,Open,M,,,,,,,,,,282.5,,282.5,D,Single-ply,5
Richard Hagedorn,90,Open,M,,,,,,,,,,272.5,280.5,272.5,D,Single-ply,6
Cecil Wood,90,Open,M,,,,,,,,,,205,,205,D,Single-ply,7
Randall Henderson,100,Open,M,,,,,,,,,,347.5,,347.5,D,Single-ply,1
Scott Deal,100,Open,M,,,,,,,,,,312.5,,312.5,D,Single-ply,2
Niclas Friberg,100,Open,M,,,,Sweden,,,,,,295,,295,D,Single-ply,3
Chris Duffin,100,Open,M,,,,,,,,,,277.5,,277.5,D,Single-ply,4
Willis Smith,100,Open,M,,,,,,,,,,262.5,,262.5,D,Single-ply,5
Jason Gibson,100,Open,M,,,,,,,,,,255,,255,D,Single-ply,6
Steve Peña #1,100,Open,M,,,,,,,,,,255,,255,D,Single-ply,7
William Hamilton,100,Open,M,,,,,,,,,,247.5,,247.5,D,Single-ply,8
Harry Woods,100,Open,M,,,,,,,,,,237.5,,237.5,D,Single-ply,9
Paul Wondra,100,Open,M,,,,,,,,,,227.5,,227.5,D,Single-ply,10
Thomas Reiher,100,Open,M,,,,,,,,,,215,,215,D,Single-ply,11
Dan Tubridy,100,Open,M,,,,,,,,,,207.5,,207.5,D,Single-ply,12
Brent Howard,110,Open,M,,,,,,,,,,342.5,,342.5,D,Single-ply,1
Ben Matheson,110,Open,M,,,,,,,,,,340,,340,D,Single-ply,2
Bob Vessels,110,Open,M,,,,,,,,,,340,,340,D,Single-ply,3
Jerry Capello,110,Open,M,,,,,,,,,,330,,330,D,Single-ply,4
Bobby Driskill,110,Open,M,,,,,,,,,,290,,290,D,Single-ply,5
Al Dawson,110,Open,M,,,,,,,,,,282.5,,282.5,D,Single-ply,6
Dan Davidson,110,Open,M,,,,,,,,,,,,,D,Single-ply,DQ
Jerry Pritchett,125,Open,M,,,,,,,,,,332.5,,332.5,D,Single-ply,1
Noah Chambreau,125,Open,M,,,,,,,,,,325,,325,D,Single-ply,2
Joe Thompson,125,Open,M,,,,,,,,,,315,,315,D,Single-ply,3
Cyril Lewis,140,Open,M,,,,,,,,,,327.5,,327.5,D,Single-ply,1
Andy Medak,140,Open,M,,,,,,,,,,317.5,,317.5,D,Single-ply,2
Steve Khader,140,Open,M,,,,,,,,,,287.5,,287.5,D,Single-ply,3
Dean Munsey,140,Open,M,,,,,,,,,,285,,285,D,Single-ply,4
Brian Oldham,140+,Open,M,,,174.63,,,,,,,340,,340,D,Single-ply,1
Chad Aichs,140+,Open,M,,,,,,,,,,327.5,,327.5,D,Single-ply,2
Vincent Eldridge,140+,Open,M,,,185.97,,,,,,,325,,325,D,Single-ply,3
Joaquin Diaz de Leon,140+,Open,M,,,,,,,,,,272.5,,272.5,D,Single-ply,4
William Baker,140+,Open,M,,,,,,,,,,250,,250,D,Single-ply,5
Jon Shapiro,60,Special Olympian,M,,,,,,,,,,160,,160,D,Single-ply,1
Chad McFarland,67.5,Special Olympian,M,,,,,,,,,,177.5,,177.5,D,Single-ply,1
Eric Janvier,67.5,Special Olympian,M,,,,,,,,,,110,,110,D,Single-ply,2
Mike Sirard,67.5,Special Olympian,M,,,,,,,,,,95,,95,D,Single-ply,3
Sean Coward,75,Special Olympian,M,,,,,,,,,,127.5,,127.5,D,Single-ply,1
Michael Bailey,75,Special Olympian,M,,,,,,,,,,102.5,,102.5,D,Single-ply,2
Antwon Belfils,82.5,Special Olympian,M,,,,,,,,,,160,,160,D,Single-ply,1
Brent Ruth,82.5,Special Olympian,M,,,,,,,,,,147.5,,147.5,D,Single-ply,2
Michael McHugh #3,82.5,Special Olympian,M,,,,,,,,,,145,,145,D,Single-ply,3
Andrew Bixler,90,Special Olympian,M,,,,,,,,,,165,,165,D,Single-ply,1
Adam Markham,90,Special Olympian,M,,,,,,,,,,137.5,,137.5,D,Single-ply,2
Aaron Szoke,90,Special Olympian,M,,,,,,,,,,107.5,,107.5,D,Single-ply,3
Scott Cortez,100,Special Olympian,M,,,,,,,,,,172.5,,172.5,D,Single-ply,2
Kasey Dean,100,Special Olympian,M,,,,,,,,,,110,,110,D,Single-ply,3
Jeff Hybl,100,Special Olympian,M,,,,,,,,,,92.5,,92.5,D,Single-ply,5
Anthony Johnson,100,Special Olympian,M,,,,,,,,,,215,,215,D,Single-ply,1
Trevor Irwin,100,Special Olympian,M,,,,,,,,,,95,,95,D,Single-ply,4
L. Henderson,110,Special Olympian,M,,,,,,,,,,147.5,,147.5,D,Single-ply,1
Brian Jonasson,110,Special Olympian,M,,,,,,,,,,142.5,,142.5,D,Single-ply,2
Troy Hubbard,125,Special Olympian,M,,,,,,,,,,87.5,,87.5,D,Single-ply,1
Soledad Rosas,48,Special Olympian,F,,,,,,,,,,55,,55,D,Single-ply,1
Lauren Dare,82.5,Special Olympian,F,,,,,,,,,,107.5,,107.5,D,Single-ply,1
Emily Matlack,82.5,Special Olympian,F,,,,,,,,,,90,,90,D,Single-ply,2
Holley Matlack,90,Special Olympian,F,,,,,,,,,,102.5,,102.5,D,Single-ply,1
Michael Haynes,72,Submasters 34-39,M,34-39,,,,,,,,,192.5,,192.5,D,Single-ply,1
Brian Johnston,82.5,Submasters 34-39,M,34-39,,,Canada,,,,,,260,,260,D,Single-ply,1
Don Moser,82.5,Submasters 34-39,M,34-39,,,,,,,,,227.5,,227.5,D,Single-ply,2
Mall Taylor,82.5,Submasters 34-39,M,34-39,,,,,,,,,205,,205,D,Single-ply,3
Richard Anderson,82.5,Submasters 34-39,M,34-39,,,,,,,,,182.5,,182.5,D,Single-ply,4
Jeff Ray,90,Submasters 34-39,M,34-39,,,,,,,,,292.5,,292.5,D,Single-ply,1
Randy Green,90,Submasters 34-39,M,34-39,,,,,,,,,287.5,,287.5,D,Single-ply,2
Mark Pearce,90,Submasters 34-39,M,34-39,,,,,,,,,250,,250,D,Single-ply,3
Bobby Myers,90,Submasters 34-39,M,34-39,,,,,,,,,247.5,,247.5,D,Single-ply,4
Randall Henderson,100,Submasters 34-39,M,34-39,,,,,,,,,347.5,,347.5,D,Single-ply,1
Scott Deal,100,Submasters 34-39,M,34-39,,,,,,,,,312.5,,312.5,D,Single-ply,2
Harry Woods,100,Submasters 34-39,M,34-39,,,,,,,,,237.5,,237.5,D,Single-ply,3
Bob Vessels,110,Submasters 34-39,M,34-39,,,,,,,,,340,,340,D,Single-ply,1
Ronald Harlow,110,Submasters 34-39,M,34-39,,,,,,,,,292.5,,292.5,D,Single-ply,2
Terry Putman,110,Submasters 34-39,M,34-39,,,,,,,,,280,,280,D,Single-ply,3
Cody Colchado,110,Submasters 34-39,M,34-39,,,,,,,,,272.5,,272.5,D,Single-ply,4
Lance Davis,110,Submasters 34-39,M,34-39,,,,,,,,,240,,240,D,Single-ply,5
Joe Thompson,125,Submasters 34-39,M,34-39,,,,,,,,,315,,315,D,Single-ply,1
Carl Rogers #2,125,Submasters 34-39,M,34-39,,,,,,,,,285,,285,D,Single-ply,2
Mark Phillips,140,Submasters 34-39,M,34-39,,,,,,,,,300,,300,D,Single-ply,1
Vincent Eldridge,140+,Submasters 34-39,M,34-39,,185.97,,,,,,,325,,325,D,Single-ply,1
Rick McClung,140+,Submasters 34-39,M,34-39,,,,,,,,,285,,285,D,Single-ply,2
Carmela Baqui,48,Submasters 34-39,F,34-39,,47.17,,,,,,,155,,155,D,Single-ply,1
Tara Rivers,52,Submasters 34-39,F,34-39,,,,,,,,,82.5,,82.5,D,Single-ply,1
Julie Green #2,56,Submasters 34-39,F,34-39,,,,,,,,,137.5,,137.5,D,Single-ply,1
Michael Lemes,56,Submasters 34-39,F,34-39,,,,,,,,,122.5,,122.5,D,Single-ply,2
Cathy Bramanti,60,Submasters 34-39,F,34-39,,,,,,,,,105,,105,D,Single-ply,2
Jenn Martindale,60,Submasters 34-39,F,34-39,,,,,,,,,112.5,,112.5,D,Single-ply,1
Elodia Womack,67.5,Submasters 34-39,F,34-39,,,,,,,,,110,,110,D,Single-ply,3
Jeanne Watts,67.5,Submasters 34-39,F,34-39,,,,,,,,,130,,130,D,Single-ply,1
Josie Jackson,67.5,Submasters 34-39,F,34-39,,,,,,,,,120,,120,D,Single-ply,2
Latasia Anzai,75,Submasters 34-39,F,34-39,,,,,,,,,120,,120,D,Single-ply,2
Kelley Mahoney,75,Submasters 34-39,F,34-39,,,,,,,,,137.5,,137.5,D,Single-ply,1
Jennifer Taylor,82.5,Submasters 34-39,F,34-39,,,,,,,,,170,,170,D,Single-ply,1
Kelli Sandoval,90,Submasters 34-39,F,34-39,,,,,,,,,,,,D,Single-ply,DQ
B. Brown,90,Submasters 34-39,F,34-39,,,,,,,,,130,,130,D,Single-ply,1
Sheri Wyatt,90+,Submasters 34-39,F,34-39,,,,,,,,,182.5,,182.5,D,Single-ply,1
Daria Cal,90+,Submasters 34-39,F,34-39,,,,,,,,,182.5,,182.5,D,Single-ply,2
Carrie Novikoff,90+,Submasters 34-39,F,34-39,,,,,,,,,160,,160,D,Single-ply,3
Kristin LaMonica,90+,Submasters 34-39,F,34-39,,,,,,,,,142.5,,142.5,D,Single-ply,4
Mitchell Ellis,56,Teen 13-15,M,13-15,,,,,,,,,140,,140,D,Single-ply,1
Adrian Brooks,60,Teen 13-15,M,13-15,,,,,,,,,155,,155,D,Single-ply,1
Coty Hargett,67.5,Teen 13-15,M,13-15,,,,,,,,,192.5,,192.5,D,Single-ply,1
Justin Berman,67.5,Teen 13-15,M,13-15,,,,,,,,,150,,150,D,Single-ply,2
Adam Castleman,67.5,Teen 13-15,M,13-15,,,,,,,,,147.5,,147.5,D,Single-ply,3
Bryan Huffer,67.5,Teen 13-15,M,13-15,,,,,,,,,82.5,,82.5,D,Single-ply,4
Daniel Winslow,75,Teen 13-15,M,13-15,,,,,,,,,217.5,,217.5,D,Single-ply,1
Micah Poppell,75,Teen 13-15,M,13-15,,,,,,,,,175,,175,D,Single-ply,2
Jeremy Fairchild,75,Teen 13-15,M,13-15,,,,,,,,,160,,160,D,Single-ply,3
Zach O'Quinn,75,Teen 13-15,M,13-15,,,,,,,,,160,,160,D,Single-ply,4
Andy Munsey,82.5,Teen 13-15,M,13-15,,,,,,,,,200,,200,D,Single-ply,1
Josh Devereuz,82.5,Teen 13-15,M,13-15,,,,,,,,,182.5,,182.5,D,Single-ply,2
Adam Contreras #1,82.5,Teen 13-15,M,13-15,,,,,,,,,157.5,,157.5,D,Single-ply,3
Christian Benvin,100,Teen 13-15,M,13-15,,,,,,,,,142.5,,142.5,D,Single-ply,1
Randall Griggs,48,Teen 16-19,M,16-19,,,,,,,,,145,152.5,145,D,Single-ply,1
Hector Perez,48,Teen 16-19,M,16-19,,,,,,,,,142.5,,142.5,D,Single-ply,2
Stefen Hudson,48,Teen 16-19,M,16-19,,,,,,,,,82.5,,82.5,D,Single-ply,3
George Jackson,52,Teen 16-19,M,16-19,,,,,,,,,195,,195,D,Single-ply,1
Richard Hawthorne,60,Teen 16-19,M,16-19,18,,,,,,,,260,,260,D,Single-ply,1
Cory Johnson,60,Teen 16-19,M,16-19,,,,,,,,,165,,165,D,Single-ply,2
Michael Brown #3,60,Teen 16-19,M,16-19,,,,,,,,,150,,150,D,Single-ply,3
Dean Harter,60,Teen 16-19,M,16-19,,,,,,,,,147.5,,147.5,D,Single-ply,4
Ryan Caprari,67.5,Teen 16-19,M,16-19,16,,,,,,,,217.5,,217.5,D,Single-ply,1
Thomas Jackson,67.5,Teen 16-19,M,16-19,,,,,,,,,215,,215,D,Single-ply,2
Kyle Herzik,67.5,Teen 16-19,M,16-19,,,,,,,,,172.5,,172.5,D,Single-ply,3
Trevor Stewart,67.5,Teen 16-19,M,16-19,,,,,,,,,170,,170,D,Single-ply,4
C. McCormack,67.5,Teen 16-19,M,16-19,,,,,,,,,150,,150,D,Single-ply,5
Jason McWalter,75,Teen 16-19,M,16-19,,,,,,,,,185,,185,D,Single-ply,1
Kyle Durr,75,Teen 16-19,M,16-19,,,,,,,,,182.5,,182.5,D,Single-ply,2
Michael Minahan,75,Teen 16-19,M,16-19,,,,,,,,,182.5,,182.5,D,Single-ply,3
Nick Luiz,82.5,Teen 16-19,M,16-19,,,,,,,,,252.5,,252.5,D,Single-ply,1
Philip Boozer,82.5,Teen 16-19,M,16-19,,,,,,,,,192.5,,192.5,D,Single-ply,2
Kevin Knack,82.5,Teen 16-19,M,16-19,,,,,,,,,192.5,,192.5,D,Single-ply,3
Osman Zecena,82.5,Teen 16-19,M,16-19,,,,,,,,,185,,185,D,Single-ply,4
Kevin Bowen,90,Teen 16-19,M,16-19,,,,,,,,,227.5,,227.5,D,Single-ply,1
Nicholas Poppell,90,Teen 16-19,M,16-19,,,,,,,,,217.5,,217.5,D,Single-ply,2
Dustin McFarland,90,Teen 16-19,M,16-19,,,,,,,,,210,,210,D,Single-ply,3
Mike Bennett,90,Teen 16-19,M,16-19,,,,,,,,,190,,190,D,Single-ply,4
Kaleb Crafts,100,Teen 16-19,M,16-19,,,,,,,,,237.5,,237.5,D,Single-ply,1
Kevin Adams,100,Teen 16-19,M,16-19,,,,,,,,,167.5,,167.5,D,Single-ply,2
Brandon Huffer,110,Teen 16-19,M,16-19,,,,,,,,,237.5,,237.5,D,Single-ply,1
Jim Pritchett,110,Teen 16-19,M,16-19,,,,,,,,,195,,195,D,Single-ply,2
Charlie Proctor,110,Teen 16-19,M,16-19,,,,,,,,,172.5,,172.5,D,Single-ply,3
Zakary Smith,140,Teen 16-19,M,16-19,,,,,,,,,232.5,,232.5,D,Single-ply,1
Andrew Jacoby,140+,Teen 16-19,M,16-19,,,,,,,,,200,,200,D,Single-ply,1
Katherine Todd,44,Teen 13-15,F,13-15,,,,,,,,,67.5,,67.5,D,Single-ply,1
Kaila Fairchild,60,Teen 13-15,F,13-15,14,,,,,,,,137.5,139.5,137.5,D,Single-ply,1
Jessica Miller,60,Teen 13-15,F,13-15,,,,,,,,,117.5,,117.5,D,Single-ply,2
Amanda Proctor,67.5,Teen 13-15,F,13-15,,,,,,,,,137.5,,137.5,D,Single-ply,1
Nikki Williams,75,Teen 13-15,F,13-15,,,,,,,,,127.5,,127.5,D,Single-ply,1
Margot O'Halloran,75,Teen 13-15,F,13-15,,,,,,,,,80,,80,D,Single-ply,2
Lisa Marie Garcia,44,Teen 16-19,F,16-19,,,,,,,,,70,75.5,70,D,Single-ply,1
Abigail Guenzi,48,Teen 16-19,F,16-19,,,,,,,,,92.5,,92.5,D,Single-ply,1
Erica Ansberry,60,Teen 16-19,F,16-19,,,,,,,,,112.5,,112.5,D,Single-ply,1
Emily Pritchett,67.5,Teen 16-19,F,16-19,,,,,,,,,117.5,,117.5,D,Single-ply,1
Kelly Womack,82.5,Teen 16-19,F,16-19,,,,,,,,,150,,150,D,Single-ply,1
Debra Anderson,82.5,Teen 16-19,F,16-19,,,,,,,,,145,,145,D,Single-ply,2
Antonia Maurer,90,Teen 16-19,F,16-19,,,,,,,,,95,,95,D,Single-ply,1
Jana Prothman,90+,Teen 16-19,F,16-19,,,,,,,,,162.5,,162.5,D,Single-ply,1
Alyxa Conlee,90+,Teen 16-19,F,16-19,,,,,,,,,70,,70,D,Single-ply,2
Malia Weinress,44,Open,F,,,,,,,,,,112.5,,112.5,D,Single-ply,1
Kelly LaCour,48,Open,F,,,,,,,,,,110,,110,D,Single-ply,1
Patricia Loera,48,Open,F,,,,,,,,,,97.5,,97.5,D,Single-ply,2
Mary Pederson,48,Open,F,,,,,,,,,,77.5,,77.5,D,Single-ply,3
Jenny Macy,52,Open,F,,,,,,,,,,140,,140,D,Single-ply,1
Carol Ann Myers,56,Open,F,,,,,,,,,,182.5,,182.5,D,Single-ply,1
Karen Gordon,56,Open,F,,,55.34,,,,,,,162.5,164.5,162.5,D,Single-ply,2
Laci Livingston,56,Open,F,,,,,,,,,,162.5,,162.5,D,Single-ply,3
Drusilla Amos,56,Open,F,,,,,,,,,,145,,145,D,Single-ply,4
Nikki Buchanan,56,Open,F,,,,,,,,,,137.5,,137.5,D,Single-ply,5
Danna Snow,56,Open,F,,,,,,,,,,115,,115,D,Single-ply,6
Jo Walker,60,Open,F,,59,58.97,,,,,,,182.5,,182.5,D,Single-ply,1
Victoria Reese,67.5,Open,F,,,,,,,,,,185,,185,D,Single-ply,1
Mary Jacobson,67.5,Open,F,,,,,,,,,,82.5,,82.5,D,Single-ply,3
Gael Okicich,67.5,Open,F,,57,,,,,,,,140,,140,D,Single-ply,2
Lyn Silbert,75,Open,F,,,,,,,,,,182.5,,182.5,D,Single-ply,1
Nicole Rodalos,75,Open,F,,,,,,,,,,135,,135,D,Single-ply,2
Susan Adkison,90,Open,F,,,,,,,,,,182.5,,182.5,D,Single-ply,1
Atalie Garrish,90,Open,F,,,,,,,,,,137.5,,137.5,D,Single-ply,2
Kirern Ellis,90+,Open,F,,,97.52,,,,,,,212.5,,212.5,D,Single-ply,1
Daria Cal,90+,Open,F,,,,,,,,,,182.5,,182.5,D,Single-ply,2
Amy van der Pol,90+,Open,F,,,,,,,,,,152.5,,152.5,D,Single-ply,3
Carri Novikoff,90+,Open,F,,,,,,,,,,150,,150,D,Single-ply,4
Carol Ann Myers,56,Masters 40-46,F,40-46,,,,,,,,,182.5,,182.5,D,Single-ply,1
Drusilla Amos,56,Masters 40-46,F,40-46,,,,,,,,,147.5,,147.5,D,Single-ply,2
Leticia Rosales-Buie,56,Masters 40-46,F,40-46,,,,,,,,,142.5,,142.5,D,Single-ply,3
Denise Ruff,56,Masters 40-46,F,40-46,,,,,,,,,130,,130,D,Single-ply,4
C. Nicholson,56,Masters 40-46,F,40-46,,,,,,,,,125,,125,D,Single-ply,5
Ruth Kirby,56,Masters 40-46,F,40-46,,,,,,,,,112.5,,112.5,D,Single-ply,6
Alene Brisbane,60,Masters 40-46,F,40-46,,,,,,,,,147.5,,147.5,D,Single-ply,1
KC Inlow,60,Masters 40-46,F,40-46,,,,,,,,,145,,145,D,Single-ply,2
Jill Deuser,60,Masters 40-46,F,40-46,,,,,,,,,120,,120,D,Single-ply,3
Mary Lee,60,Masters 40-46,F,40-46,,,,,,,,,107.5,,107.5,D,Single-ply,4
Robin Finnerty,67.5,Masters 40-46,F,40-46,,,,,,,,,140,,140,D,Single-ply,1
Bonita Betz,67.5,Masters 40-46,F,40-46,,,,,,,,,102.5,,102.5,D,Single-ply,2
Alicia Valenzuela,82.5,Masters 40-46,F,40-46,,,Guatemala,,,,,,137.5,,137.5,D,Single-ply,1
Susan Adkison,90,Masters 40-46,F,40-46,,,,,,,,,182.5,,182.5,D,Single-ply,1
Margie Huston,90+,Masters 40-46,F,40-46,,,,,,,,,120,,120,D,Single-ply,1
Glenda Egan,52,Masters 47-53,F,47-53,,,,,,,,,115,,115,D,Single-ply,1
Heidi Rodriguez,52,Masters 47-53,F,47-53,,,Guatemala,,,,,,115,,115,D,Single-ply,2
Carolyn Schwarz,56,Masters 47-53,F,47-53,,,,,,,,,102.5,,102.5,D,Single-ply,1
Patty Pendergast,60,Masters 47-53,F,47-53,,,,,,,,,145,,145,D,Single-ply,1
Patti Ehmen,60,Masters 47-53,F,47-53,,,,,,,,,140,,140,D,Single-ply,2
Margaret Morris,60,Masters 47-53,F,47-53,,,,,,,,,107.5,,107.5,D,Single-ply,3
Mary Jacobson,67.5,Masters 47-53,F,47-53,,,,,,,,,172.5,,172.5,D,Single-ply,1
Denise Connors,67.5,Masters 47-53,F,47-53,,,,,,,,,92.5,,92.5,D,Single-ply,2
Wilma Cadavona,90,Masters 47-53,F,47-53,,,,,,,,,152.5,,152.5,D,Single-ply,1
Carolyn Fay,90+,Masters 47-53,F,47-53,,,,,,,,,112.5,,112.5,D,Single-ply,1
Mary Pederson,48,Masters 54-60,F,54-60,,,,,,,,,77.5,,77.5,D,Single-ply,1
Crish Lydon,56,Masters 54-60,F,54-60,,,,,,,,,117.5,119.5,117.5,D,Single-ply,1
Jo Walker,60,Masters 54-60,F,54-60,59,58.97,,,,,,,182.5,,182.5,D,Single-ply,1
Gael Okicich,67.5,Masters 54-60,F,54-60,57,,,,,,,,140,142.5,140,D,Single-ply,1
Barbara Anderson,67.5,Masters 54-60,F,54-60,,,,,,,,,132.5,,132.5,D,Single-ply,2
Claire Heckathor,67.5,Masters 54-60,F,54-60,,,,,,,,,112.5,,112.5,D,Single-ply,3
Karen Polansky,90,Masters 54-60,F,54-60,,,,,,,,,155,,155,D,Single-ply,1
Dawn Ivey-Vick,90,Masters 54-60,F,54-60,,,,,,,,,110,,110,D,Single-ply,2
Pat Robey,90,Masters 54-60,F,54-60,,,,,,,,,105,,105,D,Single-ply,3
Leilah Watson,90+,Masters 54-60,F,54-60,,,,,,,,,167.5,,167.5,D,Single-ply,1
Jane Honeycutt,56,Masters 61-67,F,61-67,61,,,,,,,,97.5,,97.5,D,Single-ply,1
Martha Hopkins,60,Masters 61-67,F,61-67,,,,,,,,,82.5,90,82.5,D,Single-ply,1
Sue Clark,67.5,Masters 61-67,F,61-67,,,,,,,,,100,,100,D,Single-ply,1
Malvina Basso,56,Masters 68-74,F,68-74,72,,Brazil,,,,,,80,82,80,D,Single-ply,1
Melicent Whinston,60,Masters 75-79,F,75-79,76,,,,,,,,60,65,60,D,Single-ply,1
