Division,WeightClassKg,Place,Name,Team,BodyweightKg,Best3SquatKg,Best3BenchKg,Best3DeadliftKg,TotalKg,Equipment,Event,Sex,BirthDate
Boys,59.87,1,Brennan Riker,Post,59.24,201.85,108.86,172.37,483.08,Single-ply,SBD,M,
Boys,59.87,2,Dillon Bruington,Floydada,59.65,151.95,81.65,142.88,376.48,Single-ply,SBD,M,
Boys,74.84,1,Alex Carmona,Floydada,74.21,249.48,154.22,226.8,630.49,Single-ply,SBD,M,
Boys,74.84,2,Landon Pevey,Post,74.03,183.7,97.52,176.9,458.13,Single-ply,SBD,M,
Boys,74.84,3,Cristian Hernandez,Floydada,68.95,127.01,70.31,122.47,319.78,Single-ply,SBD,M,
Boys,82.1,1,Andrew Suarez,Floydada,76.66,170.1,111.13,188.24,469.47,Single-ply,SBD,M,
Boys,82.1,2,Nick Quintana,Post,79.02,176.9,102.06,190.51,469.47,Single-ply,SBD,M,
Boys,89.81,1,Alejandro Rodriguez,Post,83.01,181.44,108.86,172.37,462.66,Single-ply,SBD,M,
Boys,99.79,1,Cole Boren,Post,95.07,265.35,165.56,215.46,646.37,Single-ply,SBD,M,
Boys,109.77,1,Knoah Escobedo,Post,107.23,208.65,115.67,185.97,510.29,Single-ply,SBD,M,
Boys,109.77,2,Marcus Collins #3,Floydada,107.27,199.58,102.06,197.31,498.95,Single-ply,SBD,M,
Boys,124.74,1,Chris Jackson #5,Post,120.11,231.33,154.22,238.14,623.69,Single-ply,SBD,M,
Boys,139.71,1,Taye Perez,Post,127.55,258.55,176.9,263.08,698.53,Single-ply,SBD,M,
Boys,139.71,2,Javen Diaz,Post,137.53,272.16,149.69,219.99,641.83,Single-ply,SBD,M,
