year,naic_max,naic_scalar
2022,0.0600,0.8000
2023,0.0400,0.8000
2024,0.0400,0.8000
2025,0.0400,0.8000
2026,0.0200,1.0000
2027,0.0200,1.0000
2028,0.0200,1.0000
2029,0.0200,1.0000
2030,0.0200,1.0000
2031,0.0200,1.0000
2032,0.0200,1.0000
2033,0.0200,1.0000
2034,0.0200,1.0000
2035,0.0200,1.0000
2036,0.0200,1.0000
2037,0.0200,1.0000
2038,0.0200,1.0000
2039,0.0200,1.0000
2040,0.0200,1.0000
2041,0.0200,1.0000
2042,0.0200,1.0000
2043,0.0200,1.0000
2044,0.0200,1.0000
2045,0.0200,1.0000
2046,0.0200,1.0000
2047,0.0200,1.0000
2048,0.0200,1.0000
2049,0.0200,1.0000
2050,0.0200,1.0000
2051,0.0200,1.0000
2052,0.0200,1.0000
2053,0.0200,1.0000
2054,0.0200,1.0000
2055,0.0200,1.0000
2056,0.0200,1.0000
2057,0.0200,1.0000
2058,0.0200,1.0000
2059,0.0200,1.0000
2060,0.0200,1.0000
2061,0.0200,1.0000
2062,0.0200,1.0000
2063,0.0200,1.0000
2064,0.0200,1.0000
2065,0.0200,1.0000
2066,0.0200,1.0000
2067,0.0200,1.0000
2068,0.0200,1.0000
2069,0.0200,1.0000
2070,0.0200,1.0000
2071,0.0200,1.0000
2072,0.0200,1.0000
2073,0.0200,1.0000
2074,0.0200,1.0000
2075,0.0200,1.0000
2076,0.0200,1.0000
2077,0.0200,1.0000
2078,0.0200,1.0000
2079,0.0200,1.0000
2080,0.0200,1.0000
2081,0.0200,1.0000