attained_age,male,female
1,0.000083,0.000047
2,0.000083,0.000047
3,0.000083,0.000047
4,0.000083,0.000047
5,0.000083,0.000047
6,0.000081,0.000044
7,0.000076,0.000040
8,0.000068,0.000036
9,0.000061,0.000034
10,0.000056,0.000033
11,0.000061,0.000035
12,0.000076,0.000040
13,0.000095,0.000047
14,0.000117,0.000056
15,0.000137,0.000065
16,0.000155,0.000074
17,0.000172,0.000079
18,0.000187,0.000084
19,0.000200,0.000087
20,0.000214,0.000090
21,0.000229,0.000092
22,0.000247,0.000094
23,0.000267,0.000096
24,0.000289,0.000097
25,0.000315,0.000098
26,0.000336,0.000100
27,0.000350,0.000103
28,0.000360,0.000107
29,0.000367,0.000113
30,0.000373,0.000121
31,0.000376,0.000128
32,0.000375,0.000134
33,0.000368,0.000139
34,0.000360,0.000145
35,0.000354,0.000153
36,0.000356,0.000162
37,0.000369,0.000173
38,0.000388,0.000188
39,0.000415,0.000205
40,0.000446,0.000224
41,0.000482,0.000243
42,0.000517,0.000262
43,0.000553,0.000280
44,0.000590,0.000296
45,0.000635,0.000312
46,0.000693,0.000333
47,0.000770,0.000360
48,0.000864,0.000392
49,0.000972,0.000430
50,0.001089,0.000480
51,0.001212,0.000538
52,0.001331,0.000597
53,0.001448,0.000659
54,0.001566,0.000724
55,0.001696,0.000798
56,0.001844,0.000886
57,0.002015,0.000992
58,0.002211,0.001119
59,0.002432,0.001267
60,0.002678,0.001434
61,0.002946,0.001688
62,0.003232,0.001973
63,0.003539,0.002291
64,0.003876,0.002654
65,0.004233,0.002998
66,0.004626,0.003322
67,0.005088,0.003687
68,0.005631,0.004073
69,0.006364,0.004516
70,0.007331,0.005010
71,0.008481,0.005559
72,0.009849,0.006170
73,0.011382,0.006858
74,0.012882,0.007647
75,0.014388,0.008565
76,0.016095,0.009635
77,0.018025,0.010882
78,0.020203,0.012350
79,0.022680,0.014103
80,0.025555,0.016247
81,0.028815,0.018597
82,0.032393,0.021340
83,0.036355,0.024493
84,0.040838,0.028058
85,0.045994,0.032014
86,0.051947,0.036335
87,0.058763,0.041007
88,0.066453,0.046008
89,0.074976,0.051297
90,0.084180,0.056793
91,0.093993,0.062566
92,0.104484,0.068894
93,0.115687,0.076135
94,0.127636,0.084767
95,0.138155,0.094832
96,0.148805,0.104990
97,0.161510,0.114842
98,0.174382,0.125065
99,0.187418,0.135628
100,0.202170,0.148544
101,0.217036,0.161842
102,0.230368,0.173397
103,0.243560,0.185008
104,0.255055,0.196579
105,0.260000,0.207764
106,0.260000,0.216592
107,0.260000,0.220000
108,0.260000,0.220000
109,0.260000,0.220000
110,0.260000,0.220000
111,0.260000,0.220000
112,0.260000,0.220000
113,0.260000,0.220000
114,0.260000,0.220000
115,0.260000,0.220000
116,0.260000,0.220000
117,0.260000,0.220000
118,0.260000,0.220000
119,0.260000,0.220000
120,1.000000,1.000000