attained_age,female,male
1,,
2,,
3,,
4,,
5,,
6,,
7,,
8,,
9,,
10,,
11,,
12,,
13,,
14,,
15,0.00000,0.00000
16,0.00000,0.00000
17,0.00000,0.00000
18,0.00000,0.00000
19,0.00000,0.00000
20,0.00000,0.00000
21,0.00000,0.00000
22,0.00000,0.00000
23,0.00000,0.00000
24,0.00000,0.00000
25,0.00000,0.00000
26,0.00000,0.00000
27,0.00000,0.00100
28,0.00000,0.00100
29,0.00000,0.00100
30,0.00000,0.00100
31,0.00000,0.00100
32,0.00000,0.00100
33,0.00000,0.00100
34,0.00000,0.00100
35,0.00000,0.00100
36,0.00100,0.00100
37,0.00100,0.00100
38,0.00100,0.00100
39,0.00100,0.00100
40,0.00100,0.00100
41,0.00100,0.00100
42,0.00100,0.00200
43,0.00100,0.00200
44,0.00100,0.00200
45,0.00100,0.00200
46,0.00100,0.00200
47,0.00100,0.00300
48,0.00100,0.00300
49,0.00200,0.00400
50,0.00200,0.00400
51,0.00200,0.00400
52,0.00200,0.00500
53,0.00200,0.00500
54,0.00200,0.00600
55,0.00300,0.00600
56,0.00300,0.00700
57,0.00300,0.00700
58,0.00300,0.00800
59,0.00400,0.00800
60,0.00400,0.00900
61,0.00500,0.01000
62,0.00500,0.01100
63,0.00600,0.01200
64,0.00600,0.01400
65,0.00700,0.01600
66,0.00800,0.01800
67,0.00900,0.02000
68,0.01000,0.02200
69,0.01100,0.02500
70,0.01200,0.02800
71,0.01400,0.03000
72,0.01600,0.03300
73,0.01800,0.03700
74,0.02100,0.04000
75,0.02400,0.04500
76,0.02700,0.04900
77,0.03100,0.05500
78,0.03400,0.06100
79,0.03900,0.06700
80,0.04300,0.07400
81,0.04800,0.08100
82,0.05300,0.08900
83,0.05800,0.09800
84,0.06400,0.10600
85,0.07000,0.11500
86,0.07700,0.12400
87,0.08400,0.13400
88,0.09200,0.14400
89,0.10100,0.15500
90,0.11200,0.16600
91,0.12300,0.17800
92,0.13600,0.19000
93,0.15000,0.20300
94,0.16500,0.21800
95,0.18200,0.23400
96,0.20200,0.24800
97,0.22200,0.26400
98,0.24400,0.28100
99,0.26800,0.29900
100,0.29500,0.31900
101,0.32500,0.34100
102,0.35900,0.36500
103,0.39600,0.39300
104,0.43800,0.42700
105,0.48800,0.47000
106,0.54600,0.52200
107,0.61400,0.58700
108,0.69500,0.66500
109,0.78900,0.76000
110,1.00000,1.00000
111,1.00000,1.00000
112,1.00000,1.00000
113,1.00000,1.00000
114,1.00000,1.00000
115,1.00000,1.00000