[gd_scene load_steps=5 format=3 uid="uid://cbdgasfotdvad"]

[ext_resource type="Script" path="res://GameScene/Prefab/Plot/Plot.gd" id="1_nitan"]
[ext_resource type="Texture2D" uid="uid://csdkpcgbvt3s7" path="res://plot.png" id="1_w5wmo"]

[sub_resource type="RectangleShape2D" id="RectangleShape2D_xr86t"]

[sub_resource type="SceneReplicationConfig" id="SceneReplicationConfig_s52s2"]
properties/0/path = NodePath(".:position")
properties/0/spawn = true
properties/0/replication_mode = 1
properties/1/path = NodePath("PlotSprite2D:self_modulate")
properties/1/spawn = true
properties/1/replication_mode = 1
properties/2/path = NodePath(".:visible")
properties/2/spawn = true
properties/2/replication_mode = 1

[node name="Plot" type="Area2D"]
visible = false
script = ExtResource("1_nitan")

[node name="PlotCollisionShape2D" type="CollisionShape2D" parent="."]
shape = SubResource("RectangleShape2D_xr86t")

[node name="PlotSprite2D" type="Sprite2D" parent="."]
texture = ExtResource("1_w5wmo")

[node name="MultiplayerSynchronizer" type="MultiplayerSynchronizer" parent="."]
replication_config = SubResource("SceneReplicationConfig_s52s2")
