[gd_scene load_steps=2 format=3 uid="uid://dm1rwty5ac685"]

[ext_resource type="Script" path="res://Widget/ColorSelector/ColorSelection.gd" id="1_vfbnw"]

[node name="ColorSelector" type="ColorRect"]
offset_left = 327.0
offset_top = 193.0
offset_right = 367.0
offset_bottom = 233.0
size_flags_vertical = 4
mouse_filter = 2
color = Color(1, 0, 0, 1)
script = ExtResource("1_vfbnw")

[node name="SelectionRect2" type="ColorRect" parent="."]
visible = false
z_index = -1
layout_mode = 1
anchors_preset = 8
anchor_left = 0.5
anchor_top = 0.5
anchor_right = 0.5
anchor_bottom = 0.5
offset_left = -23.0
offset_top = -23.0
offset_right = 23.0
offset_bottom = 23.0
grow_horizontal = 2
grow_vertical = 2
mouse_filter = 2
mouse_force_pass_scroll_events = false
color = Color(0, 1, 1, 1)
