@startuml

class Selectable {
    - selected: bool
    - selector_nodes: Array

    + set_selection(selected: bool)
    + is_selected() -> bool
    + get_selection_info() -> Dictionary
    + invert_selection()
}

class ShipSelectable extends Selectable {
    - player_ship: PlayerShip

    + _init(player_ship: PlayerShip)
}

class ColorSelectable extends Selectable {
    - color_selection: ColorSelection

    + _init(color_selection: ColorSelection)
}

class PlayerShip {
    - selectable: Selectable
}

PlayerShip *-- ShipSelectable

class ColorSelection {
    - selectable: Selectable
}

ColorSelection *-- ColorSelectable

class SelectorManager {
    - lastSelection: Selectable

    + select(newSelection: Selectable)
    // Signal are represented as protected (yellow)
    # object_selected(selectable: Selectable)
}

note top of SelectorManager
    Singleton, autoload
end note

SelectorManager <-- Selectable : use

@enduml