[
  {
    "id": "land_tasmania",
    "path": "M254.51559934318556,-454.78160919540227L261.9047619047619,-450.67651888341544L266.83087027914615,-452.3185550082102L272.5779967159277,-453.9605911330049L277.504105090312,-453.1395730706075L278.32512315270935,-440.8243021346469L275.04105090311987,-437.54022988505744L274.22003284072247,-428.50903119868633L271.7569786535304,-431.7931034482758L266.00985221674875,-423.5829228243021L264.367816091954,-424.4039408866995L259.4417077175698,-425.22495894909684L254.51559934318556,-434.25615763546796L253.69458128078819,-441.6453201970443L248.76847290640393,-450.67651888341544L249.5894909688013,-455.60262725779967L254.51559934318556,-454.78160919540227",
    "color": "#ffcc99"
  },
  {
    "id": "land_nz_south",
    "path": "M474.54844006568146,-453.1395730706075L476.1904761904762,-449.0344827586207L481.9376026272578,-453.1395730706075L484.4006568144499,-448.2134646962233L484.4006568144499,-444.1083743842364L481.9376026272578,-439.1822660098522L476.1904761904762,-430.9720853858785L472.0853858784893,-426.8669950738916L475.3694581280788,-421.11986863711L468.80131362889983,-421.11986863711L462.23316912972086,-417.01477832512313L459.7701149425287,-409.62561576354676L455.6650246305419,-398.13136288998356L449.09688013136287,-393.20525451559934L444.99178981937604,-389.92118226600985L438.42364532019707,-389.92118226600985L432.67651888341544,-394.0262725779967L424.4663382594417,-394.8472906403941L422.824302134647,-398.9523809523809L426.9293924466338,-407.1625615763547L436.7816091954023,-418.6568144499179L442.5287356321839,-420.2988505747126L448.2758620689655,-424.4039408866995L454.8440065681445,-430.1510673234811L459.7701149425287,-435.8981937602627L463.0541871921182,-444.1083743842364L466.3382594417077,-446.57142857142856L467.1592775041051,-452.3185550082102L472.9064039408867,-457.2446633825944L474.54844006568146,-453.1395730706075",
    "color": "#ffcc99"
  },
  {
    "id": "land_nz_north",
    "path": "M487.6847290640394,-501.5796387520525L493.43185550082103,-490.90640394088666L493.43185550082103,-497.4745484400657L496.7159277504105,-495.01149425287355L498.35796387520526,-487.6223316912972L504.9261083743842,-484.3382594417077L509.85221674876846,-483.51724137931035L514.7783251231527,-487.6223316912972L518.8834154351396,-485.98029556650243L516.4203612479474,-476.9490968801313L513.9573070607553,-471.20197044334975L508.2101806239737,-471.20197044334975L505.7471264367816,-468.7389162561576L506.56814449917897,-463.8128078817734L505.7471264367816,-462.17077175697864L502.46305418719214,-456.423645320197L498.35796387520526,-449.0344827586207L492.61083743842363,-444.9293924466338L490.9688013136289,-447.3924466338259L487.6847290640394,-449.0344827586207L492.61083743842363,-458.06568144499175L490.14778325123154,-463.8128078817734L481.11658456486043,-467.91789819376027L481.11658456486043,-471.20197044334975L486.86371100164206,-475.3070607553366L488.5057471264368,-482.69622331691295L488.5057471264368,-489.2643678160919L485.2216748768473,-495.8325123152709L485.2216748768473,-497.4745484400657L481.11658456486043,-501.5796387520525L475.3694581280788,-510.61083743842363L472.0853858784893,-517.1789819376027L474.54844006568146,-518L478.6535303776683,-513.0738916256157L485.2216748768473,-509.78981937602623L487.6847290640394,-501.5796387520525",
    "color": "#ffcc99"
  },
  {
    "id": "land_nc",
    "path": "M427.7504105090312,-628.8374384236453L424.4663382594417,-627.1954022988506L420.36124794745484,-629.6584564860427L414.6141215106732,-632.9425287356322L409.688013136289,-637.8686371100164L403.94088669950736,-643.615763546798L403.11986863711,-646.8998357963875L406.4039408866995,-646.0788177339901L411.33004926108373,-643.615763546798L414.6141215106732,-640.3316912972085L417.07717569786536,-638.6896551724137L423.6453201970443,-632.9425287356322L427.7504105090312,-628.8374384236453",
    "color": "#ffcc99"
  },
  {
    "id": "land_vu1",
    "path": "M433.4975369458128,-677.2775041050903L431.0344827586207,-675.6354679802955L428.57142857142856,-679.7405582922825L428.57142857142856,-681.3825944170771L433.4975369458128,-677.2775041050903",
    "color": "#ffcc99"
  },
  {
    "id": "land_vu2",
    "path": "M427.7504105090312,-689.5927750410509L428.57142857142856,-683.0246305418719L426.9293924466338,-683.8456486042693L425.28735632183907,-683.8456486042693L423.6453201970443,-685.487684729064L423.6453201970443,-692.055829228243L427.7504105090312,-689.5927750410509",
    "color": "#ffcc99"
  },
  {
    "id": "land_au",
    "path": "M239.73727422003284,-699.4449917898194L243.02134646962233,-692.8768472906404L247.94745484400656,-696.1609195402299L250.41050903119867,-692.055829228243L254.51559934318556,-688.7717569786535L253.69458128078819,-685.487684729064L255.33661740558293,-678.0985221674877L256.1576354679803,-673.9934318555008L258.6206896551724,-673.1724137931034L260.2627257799672,-666.6042692939244L260.2627257799672,-661.6781609195402L262.72577996715927,-655.9310344827586L270.935960591133,-651.8259441707718L276.6830870279146,-647.7208538587848L282.43021346469624,-644.4367816091954L280.7881773399015,-641.9737274220032L285.7142857142857,-637.047619047619L288.9983579638752,-627.1954022988506L291.46141215106735,-629.6584564860427L294.74548440065684,-625.5533661740558L297.2085385878489,-627.1954022988506L298.0295566502463,-618.1642036124795L303.7766830870279,-612.4170771756978L307.8817733990148,-609.1330049261084L313.6288998357964,-602.5648604269294L316.0919540229885,-595.1756978653531L316.0919540229885,-590.2495894909688L316.0919540229885,-584.5024630541872L319.376026272578,-577.1133004926108L319.376026272578,-568.9031198686371L317.73399014778323,-564.7980295566502L316.0919540229885,-556.5878489326765L316.0919540229885,-551.6617405582923L314.44991789819375,-544.2725779967159L311.16584564860426,-536.0623973727422L304.5977011494253,-531.1362889983579L302.13464696223315,-523.7471264367816L299.67159277504106,-519.6420361247947L297.2085385878489,-511.431855500821L293.92446633825944,-506.50574712643675L291.46141215106735,-499.11658456486043L290.64039408866995,-491.72742200328406L291.46141215106735,-489.2643678160919L286.53530377668307,-485.1592775041051L277.504105090312,-485.1592775041051L270.11494252873564,-481.0541871921182L266.83087027914615,-476.9490968801313L261.9047619047619,-472.8440065681445L255.33661740558293,-476.9490968801313L250.41050903119867,-478.59113300492606L251.23152709359607,-484.3382594417077L247.1264367816092,-481.8752052545156L240.55829228243022,-475.3070607553366L233.16912972085385,-477.7701149425287L229.064039408867,-479.41215106732346L224.13793103448276,-480.2331691297208L216.7487684729064,-482.69622331691295L211.82266009852216,-489.2643678160919L210.18062397372742,-496.6535303776683L207.7175697865353,-501.5796387520525L204.43349753694582,-505.6847290640394L196.22331691297208,-506.50574712643675L199.50738916256157,-511.431855500821L197.04433497536945,-518.8210180623973L192.9392446633826,-512.2528735632184L186.37110016420363,-510.61083743842363L190.47619047619048,-515.5369458128079L191.29720853858785,-521.2840722495895L194.58128078817734,-526.2101806239737L193.76026272577997,-532.7783251231527L187.192118226601,-524.568144499179L182.26600985221674,-521.2840722495895L179.80295566502463,-513.8949096880132L173.23481116584566,-518L173.23481116584566,-522.9261083743842L168.3087027914614,-529.4942528735633L164.20361247947454,-533.5993431855501L165.8456486042693,-535.2413793103448L155.99343185550083,-540.9885057471264L150.2463054187192,-541.8095238095237L142.0361247947455,-545.9146141215107L128.07881773399015,-545.0935960591132L117.40558292282431,-541.8095238095237L108.3743842364532,-538.5254515599343L101.80623973727423,-539.3464696223317L93.5960591133005,-534.4203612479474L86.20689655172414,-531.9573070607553L85.38587848932677,-527.0311986863711L82.10180623973727,-523.7471264367816L75.53366174055829,-522.9261083743842L70.60755336617406,-522.1050903119868L63.2183908045977,-523.7471264367816L57.47126436781609,-522.9261083743842L51.724137931034484,-522.9261083743842L47.61904761904762,-517.1789819376027L45.1559934318555,-518L41.050903119868636,-515.5369458128079L36.94581280788177,-512.2528735632184L31.198686371100163,-512.2528735632184L26.272577996715928,-512.2528735632184L17.24137931034483,-518.8210180623973L13.136288998357964,-520.4630541871921L13.136288998357964,-526.2101806239737L17.24137931034483,-527.0311986863711L18.88341543513957,-529.4942528735633L18.0623973727422,-532.7783251231527L19.704433497536947,-539.3464696223317L18.88341543513957,-545.0935960591132L13.957307060755337,-554.1247947454843L13.136288998357964,-559.871921182266L13.136288998357964,-564.7980295566502L9.852216748768473,-570.5451559934319L9.852216748768473,-573.0082101806239L6.568144499178982,-577.1133004926108L5.747126436781609,-583.6814449917898L0.8210180623973727,-591.0706075533661L0,-594.3546798029556L3.284072249589491,-591.0706075533661L0.8210180623973727,-599.2807881773399L4.926108374384237,-596.8177339901478L6.568144499178982,-592.7126436781609L6.568144499178982,-597.6387520525451L2.4630541871921183,-604.2068965517241L1.6420361247947455,-607.4909688013136L0,-609.9540229885057L0.8210180623973727,-614.88013136289L2.4630541871921183,-617.3431855500821L4.105090311986864,-621.448275862069L3.284072249589491,-626.3743842364531L6.568144499178982,-632.9425287356322L6.568144499178982,-626.3743842364531L9.852216748768473,-632.1215106732348L16.420361247947454,-634.5845648604269L20.525451559934318,-638.6896551724137L26.272577996715928,-641.1527093596059L30.37766830870279,-641.9737274220032L32.84072249589491,-641.1527093596059L38.58784893267652,-644.4367816091954L43.51395730706076,-645.2577996715928L45.1559934318555,-646.8998357963875L46.79802955665025,-647.7208538587848L50.90311986863711,-647.7208538587848L59.93431855500821,-650.183908045977L64.03940886699507,-653.4679802955665L65.68144499178982,-658.3940886699507L70.60755336617406,-662.4991789819376L71.42857142857143,-665.7832512315271L71.42857142857143,-670.7093596059113L77.17569786535304,-677.2775041050903L80.45977011494253,-670.7093596059113L83.74384236453201,-672.351395730706L80.45977011494253,-675.6354679802955L82.92282430213464,-679.7405582922825L87.02791461412151,-678.0985221674877L87.84893267651888,-684.6666666666666L91.95402298850574,-688.7717569786535L94.41707717569787,-691.2348111658456L97.70114942528735,-692.8768472906404L98.52216748768473,-695.3399014778325L101.80623973727423,-694.5188834154351L101.80623973727423,-696.1609195402299L105.09031198686371,-697.8029556650246L108.3743842364532,-698.623973727422L114.12151067323481,-695.3399014778325L119.04761904761905,-690.4137931034483L123.97372742200328,-690.4137931034483L128.89983579638752,-689.5927750410509L127.25779967159278,-693.6978653530377L130.54187192118226,-700.2660098522167L134.64696223316912,-702.7290640394089L133.00492610837438,-704.3711001642035L136.28899835796386,-709.2972085385878L141.21510673234812,-711.76026272578L145.32019704433498,-710.9392446633826L152.70935960591132,-712.5812807881773L151.88834154351395,-716.6863711001641L146.14121510673235,-719.1494252873563L150.2463054187192,-720.7914614121511L155.99343185550083,-718.3284072249589L160.0985221674877,-715.0443349753695L166.66666666666666,-713.4022988505747L169.12972085385877,-714.2233169129721L174.05582922824303,-711.76026272578L178.98193760262726,-713.4022988505747L181.44499178981937,-713.4022988505747L183.90804597701148,-714.2233169129721L187.192118226601,-710.9392446633826L184.72906403940885,-706.0131362889983L182.26600985221674,-702.7290640394089L178.98193760262726,-702.7290640394089L180.623973727422,-699.4449917898194L178.16091954022988,-695.3399014778325L174.8768472906404,-691.2348111658456L175.69786535303777,-688.7717569786535L182.26600985221674,-684.6666666666666L188.01313628899837,-682.2036124794745L192.11822660098522,-678.919540229885L197.86535303776682,-673.9934318555008L200.32840722495894,-673.9934318555008L204.43349753694582,-672.351395730706L205.2545155993432,-669.0673234811165L213.4646962233169,-666.6042692939244L218.39080459770116,-669.0673234811165L220.0328407224959,-673.9934318555008L221.67487684729065,-677.2775041050903L222.49589490968802,-682.2036124794745L224.95894909688013,-688.7717569786535L224.13793103448276,-692.8768472906404L224.13793103448276,-695.3399014778325L223.3169129720854,-699.4449917898194L224.95894909688013,-706.0131362889983L226.60098522167488,-707.6551724137931L224.95894909688013,-710.1182266009852L226.60098522167488,-714.2233169129721L228.24302134646962,-719.1494252873563L228.24302134646962,-721.6124794745484L231.5270935960591,-724.0755336617406L233.99014778325122,-719.9704433497536L233.99014778325122,-715.0443349753695L236.45320197044336,-714.2233169129721L236.45320197044336,-710.9392446633826L239.73727422003284,-706.8341543513957L240.55829228243022,-701.9080459770115L239.73727422003284,-699.4449917898194",
    "color": "#ffcc99"
  },
  {
    "id": "land_sb1",
    "path": "M387.52052545155993,-725.7175697865353L389.9835796387521,-723.2545155993431L384.23645320197045,-723.2545155993431L381.7733990147783,-728.1806239737274L385.8784893267652,-725.7175697865353L387.52052545155993,-725.7175697865353",
    "color": "#ffcc99"
  },
  {
    "id": "land_sb2",
    "path": "M377.6683087027915,-730.6436781609195L374.384236453202,-730.6436781609195L369.4581280788177,-731.4646962233169L367.81609195402297,-732.2857142857142L368.63711001642037,-735.5697865353037L373.5632183908046,-734.7487684729064L376.8472906403941,-733.1067323481117L377.6683087027915,-730.6436781609195",
    "color": "#ffcc99"
  },
  {
    "id": "land_sb3",
    "path": "M384.23645320197045,-733.1067323481117L383.41543513957305,-731.4646962233169L377.6683087027915,-738.0328407224958L375.20525451559934,-742.9589490968801L378.4893267651888,-742.9589490968801L380.95238095238096,-736.3908045977012L384.23645320197045,-733.1067323481117",
    "color": "#ffcc99"
  },
  {
    "id": "land_timor",
    "path": "M87.84893267651888,-728.1806239737274L81.2807881773399,-726.5385878489327L80.45977011494253,-727.35960591133L81.2807881773399,-730.6436781609195L84.56486042692939,-735.5697865353037L92.77504105090311,-738.8538587848932L93.5960591133005,-740.495894909688L100.16420361247947,-742.1379310344828L105.91133004926108,-742.1379310344828L107.55336617405582,-743.7799671592775L110.83743842364532,-742.1379310344828L107.55336617405582,-740.495894909688L100.16420361247947,-736.3908045977012L93.5960591133005,-734.7487684729064L87.84893267651888,-728.1806239737274",
    "color": "#ffcc99"
  },
  {
    "id": "land_sb4",
    "path":	"M370.2791461412151,-742.9589490968801L370.2791461412151,-741.3169129720853L363.71100164203614,-744.6009852216748L359.60591133004925,-747.8850574712643L356.32183908045977,-750.3481116584564L357.9638752052545,-751.1691297208538L361.247947454844,-749.5270935960591L367.81609195402297,-745.4220032840723L370.2791461412151,-742.9589490968801",
    "color": "#ffcc99"
  },
  {
    "id": "land_sb5",
    "path":	"M351.39573070607554,-751.1691297208538L349.7536945812808,-750.3481116584564L346.4696223316913,-751.9901477832512L343.1855500821018,-755.2742200328407L343.1855500821018,-756.9162561576354L348.11165845648605,-753.6321839080459L351.39573070607554,-751.1691297208538",
    "color": "#ffcc99"
  },
  {
    "id": "land_trangan",
    "path":	"M169.12972085385877,-760.2003284072249L165.02463054187191,-754.4532019704433L164.20361247947454,-760.2003284072249L165.8456486042693,-763.4844006568144L167.48768472906403,-765.9474548440065L169.12972085385877,-763.4844006568144L169.12972085385877,-760.2003284072249",
    "color": "#ffcc99"
  },
  {
    "id": "land_png_bougainville",
    "path":	"M338.25944170771754,-755.2742200328407L335.79638752052546,-754.4532019704433L332.51231527093597,-757.7372742200329L329.2282430213465,-762.663382594417L327.58620689655174,-768.4105090311987L328.4072249589491,-769.231527093596L329.2282430213465,-766.7684729064039L331.6912972085386,-765.1264367816092L335.79638752052546,-760.2003284072249L339.08045977011494,-756.9162561576354L338.25944170771754,-755.2742200328407",
    "color": "#ffcc99"
  },
  {
    "id": "land_png_new_britain",
    "path":	
    	"M307.0607553366174,-765.9474548440065L302.95566502463055,-765.1264367816092L301.3136288998358,-762.663382594417L297.2085385878489,-761.0213464696224L293.1034482758621,-759.3793103448276L288.9983579638752,-759.3793103448276L282.43021346469624,-761.0213464696224L277.504105090312,-763.4844006568144L278.32512315270935,-765.9474548440065L285.7142857142857,-765.1264367816092L289.81937602627255,-765.9474548440065L291.46141215106735,-769.231527093596L292.2824302134647,-769.231527093596L293.1034482758621,-765.1264367816092L298.0295566502463,-765.9474548440065L299.67159277504106,-768.4105090311987L304.5977011494253,-771.6945812807882L303.7766830870279,-775.799671592775L307.8817733990148,-776.6206896551724L309.5238095238095,-774.9786535303776L309.5238095238095,-770.8735632183908L307.0607553366174,-765.9474548440065",
    	"color": "#ffcc99"
  },
  {
    "id": "land_indo_buru",
    "path":	"M110.01642036124795,-781.5467980295566L107.55336617405582,-779.0837438423645L101.80623973727423,-780.7257799671593L100.98522167487684,-784.0098522167488L107.55336617405582,-784.8308702791461L110.01642036124795,-781.5467980295566",
    "color": "#ffcc99"
  },
  {
    "id": "land_indo_maluku",
    "path":	"M135.4679802955665,-784.8308702791461L138.752052545156,-778.2627257799671L131.36288998357963,-781.5467980295566L124.79474548440065,-782.367816091954L120.6896551724138,-782.367816091954L114.94252873563218,-782.367816091954L116.58456486042692,-786.4729064039409L126.4367816091954,-787.2939244663382L135.4679802955665,-784.8308702791461",
    "color": "#ffcc99"
  },
  {
    "id": "land_png_new_irland",
    "path":	"M316.0919540229885,-773.336617405583L313.6288998357964,-771.6945812807882L311.98686371100166,-775.799671592775L310.3448275862069,-779.0837438423645L307.0607553366174,-781.5467980295566L302.13464696223315,-784.8308702791461L296.3875205254516,-787.2939244663382L298.85057471264366,-789.7569786535304L302.95566502463055,-787.2939244663382L305.41871921182263,-785.6518883415434L308.7027914614122,-783.1888341543514L311.98686371100166,-779.9047619047619L315.27093596059115,-777.4417077175698L316.0919540229885,-773.336617405583",
    "color": "#ffcc99"
  },
  {
    "id": "land_png_indo",
    "path":	"M165.02463054187191,-800.4302134646962L166.66666666666666,-787.2939244663382L175.69786535303777,-782.367816091954L182.26600985221674,-790.5779967159277L191.29720853858785,-795.504105090312L197.86535303776682,-795.504105090312L205.2545155993432,-793.0410509031199L211.0016420361248,-789.7569786535304L219.21182266009853,-788.935960591133L233.16912972085385,-783.1888341543514L247.94745484400656,-778.2627257799671L253.69458128078819,-774.1576354679803L257.79967159277504,-770.8735632183908L259.4417077175698,-765.9474548440065L272.5779967159277,-761.0213464696224L274.22003284072247,-756.9162561576354L266.83087027914615,-756.0952380952381L268.4729064039409,-750.3481116584564L275.86206896551727,-745.4220032840723L280.7881773399015,-737.2118226600985L285.7142857142857,-737.2118226600985L285.7142857142857,-733.1067323481117L291.46141215106735,-732.2857142857142L288.9983579638752,-730.6436781609195L298.0295566502463,-727.35960591133L296.3875205254516,-724.8965517241379L291.46141215106735,-724.0755336617406L289.81937602627255,-726.5385878489327L282.43021346469624,-727.35960591133L274.22003284072247,-728.1806239737274L268.4729064039409,-733.927750410509L263.54679802955667,-738.0328407224958L259.4417077175698,-745.4220032840723L249.5894909688013,-748.7060755336618L242.20032840722496,-746.2430213464696L238.0952380952381,-743.7799671592775L238.91625615763547,-738.0328407224958L232.34811165845647,-734.7487684729064L228.24302134646962,-736.3908045977012L220.0328407224959,-736.3908045977012L212.64367816091954,-742.9589490968801L204.43349753694582,-744.6009852216748L202.79146141215108,-742.9589490968801L192.11822660098522,-742.1379310344828L196.22331691297208,-748.7060755336618L201.1494252873563,-751.1691297208538L198.6863711001642,-759.3793103448276L194.58128078817734,-766.7684729064039L179.80295566502463,-773.336617405583L173.23481116584566,-774.1576354679803L160.91954022988506,-781.5467980295566L158.45648604269294,-777.4417077175698L155.17241379310346,-776.6206896551724L153.5303776683087,-779.9047619047619L153.5303776683087,-783.1888341543514L147.7832512315271,-786.4729064039409L155.99343185550083,-789.7569786535304L161.74055829228243,-789.7569786535304L160.91954022988506,-791.3990147783251L149.42528735632183,-791.3990147783251L146.14121510673235,-796.3251231527094L139.57307060755338,-797.967159277504L136.28899835796386,-802.072249589491L146.96223316912972,-803.7142857142857L151.06732348111657,-806.1773399014778L163.38259441707717,-802.8932676518883L165.02463054187191,-800.4302134646962",
    "color": "#ffcc99"
  },
  {
    "id": "land_indo_north_malaku",
    "path":	"M121.51067323481116,-818.4926108374384L120.6896551724138,-811.1034482758621L116.58456486042692,-811.9244663382594L115.76354679802955,-806.9983579638752L119.04761904761905,-802.8932676518883L116.58456486042692,-802.072249589491L113.30049261083744,-806.9983579638752L110.83743842364532,-816.8505747126436L112.47947454844007,-823.4187192118227L114.94252873563218,-826.7027914614122L115.76354679802955,-821.7766830870279L120.6896551724138,-821.7766830870279L121.51067323481116,-818.4926108374384",
    "color": "#ffcc99"
  },
  {
    "id": "land_hawaii_1",
    "path":	"M725.7799671592775,-962.991789819376L724.1379310344828,-962.1707717569786L722.495894909688,-962.991789819376L722.495894909688,-965.4548440065681L720.8538587848933,-968.7389162561576L721.6748768472906,-969.559934318555L723.3169129720853,-971.2019704433498L722.495894909688,-972.8440065681444L723.3169129720853,-972.8440065681444L726.6009852216748,-972.0229885057471L728.2430213464696,-971.2019704433498L729.064039408867,-969.559934318555L731.5270935960591,-967.0968801313629L731.5270935960591,-966.2758620689655L728.2430213464696,-964.6338259441708L725.7799671592775,-962.991789819376",
    "color": "#ffcc99"
  },
  {
    "id": "land_hawaii_2",
    "path":	"M720.8538587848933,-976.1280788177339L718.3908045977012,-976.1280788177339L716.7487684729064,-977.7701149425287L715.927750410509,-978.5911330049261L716.7487684729064,-979.4121510673234L720.0328407224958,-978.5911330049261L721.6748768472906,-977.7701149425287L720.8538587848933,-976.1280788177339",
    "color": "#ffcc99"
  },
  {
    "id": "land_hawaii_3",
    "path":	"M715.927750410509,-981.0541871921182L715.1067323481117,-980.2331691297209L711.0016420361247,-980.2331691297209L711.8226600985222,-981.0541871921182L715.927750410509,-981.0541871921182"
  },
  {
    "id": "land_hawaii_4",
    "path":	"M708.5385878489327,-981.8752052545155L707.7175697865353,-981.8752052545155L705.2545155993432,-981.8752052545155L703.6124794745484,-984.3382594417077L705.2545155993432,-985.159277504105L706.0755336617406,-985.159277504105L708.5385878489327,-981.8752052545155"
  },
  {
    "id": "land_hawaii_5",
    "path":	"M695.4022988505748,-987.6223316912972L694.5812807881773,-986.8013136288998L691.2972085385878,-988.4433497536945L692.1182266009852,-989.264367816092L692.9392446633826,-990.0853858784893L694.5812807881773,-990.0853858784893L695.4022988505748,-987.6223316912972",
   	"color": "#ffcc99"
  },
  {
    "id": "AS",
    "code2": "AS",
    "label": "Am. Samoa",
    "name": "American Samoa",
    "path": "M599.3431855500821,-673.9934318555008L595.2380952380952,-682.2036124794745L607.5533661740558,-708.4761904761905L600.1642036124795,-709.2972085385878L580.4597701149426,-721.6124794745484L595.2380952380952,-727.35960591133L622.3316912972085,-729.8226600985222L622.3316912972085,-715.8653530377668L645.3201970443349,-696.9819376026272L648.6042692939245,-683.8456486042693L637.1100164203613,-668.2463054187192L615.7635467980296,-675.6354679802955L610.8374384236453,-675.6354679802955L599.3431855500821,-673.9934318555008",
    "color": "rgba(51,125,201,.09)",
    "dataLabels": {
      "x": 5,
      "y": 15
    }
  },
  {
    "id": "CK",
    "code2": "CK",
    "label": "Cook Islands",
    "dataLabels": {
      "y": -30
    },
    "name": "Cook Islands",
    "path": "M705.2545155993432,-682.2036124794745L711.8226600985222,-669.8883415435139L731.5270935960591,-653.4679802955665L719.2118226600985,-635.4055829228242L720.8538587848933,-605.8489326765189L708.5385878489327,-601.743842364532L695.4022988505748,-603.3858784893267L688.0131362889983,-608.311986863711L681.4449917898194,-609.9540229885057L674.8768472906404,-613.2380952380952L665.8456486042693,-623.0903119868636L663.3825944170771,-628.8374384236453L662.5615763546798,-635.4055829228242L651.888341543514,-638.6896551724137L646.1412151067324,-641.9737274220032L641.2151067323481,-647.7208538587848L639.5730706075534,-650.183908045977L637.1100164203613,-668.2463054187192L648.6042692939245,-683.8456486042693L645.3201970443349,-696.9819376026272L622.3316912972085,-715.8653530377668L622.3316912972085,-729.8226600985222L626.4367816091954,-743.7799671592775L631.3628899835796,-747.064039408867L641.2151067323481,-749.5270935960591L650.2463054187192,-748.7060755336618L659.2775041050903,-744.6009852216748L663.3825944170771,-750.3481116584564L669.9507389162561,-753.6321839080459L677.3399014778325,-756.0952380952381L685.5500821018062,-756.0952380952381L691.2972085385878,-761.0213464696224L695.4022988505748,-762.663382594417L729.8850574712644,-742.1379310344828L725.7799671592775,-718.3284072249589L716.7487684729064,-711.76026272578L703.6124794745484,-710.1182266009852L697.8653530377668,-704.3711001642035L692.9392446633826,-701.087027914614L690.4761904761905,-691.2348111658456L686.3711001642037,-684.6666666666666L694.5812807881773,-685.487684729064L705.2545155993432,-682.2036124794745",
    "color": "rgba(51,125,201,.09)"
  },
  {
    "id": "FM",
    "code2": "FM",
    "label": "Federated States Micronesia",
    "name": "Federated States of Micronesia",
    "path": "M378.4893267651888,-872.679802955665L391.6256157635468,-871.8587848932676L395.73070607553365,-873.5008210180624L413.7931034482759,-861.1855500821018L414.6141215106732,-860.3645320197044L415.4351395730706,-834.0919540229885L406.4039408866995,-827.5238095238095L395.73070607553365,-824.23973727422L385.8784893267652,-825.8817733990147L376.02627257799674,-831.6288998357963L366.1740558292282,-834.0919540229885L355.50082101806237,-829.1658456486042L354.679802955665,-826.7027914614122L356.32183908045977,-819.3136288998357L355.50082101806237,-811.9244663382594L353.0377668308703,-806.1773399014778L348.9326765188834,-800.4302134646962L322.66009852216746,-801.2512315270935L312.807881773399,-806.9983579638752L302.95566502463055,-821.7766830870279L305.41871921182263,-829.1658456486042L296.3875205254516,-838.1970443349753L288.1773399014778,-835.7339901477832L283.2512315270936,-835.7339901477832L275.86206896551727,-838.1970443349753L269.29392446633824,-841.4811165845648L257.79967159277504,-841.4811165845648L243.02134646962233,-836.5550082101806L233.16912972085385,-835.7339901477832L221.67487684729065,-839.8390804597701L213.4646962233169,-847.2282430213464L201.97044334975368,-850.5123152709359L194.58128078817734,-848.8702791461412L187.192118226601,-848.8702791461412L180.623973727422,-869.3957307060755L178.16091954022988,-890.7422003284072L174.05582922824303,-899.7733990147783L178.98193760262726,-905.5205254515599L185.55008210180623,-910.4466338259441L207.7175697865353,-916.1937602627257L215.10673234811165,-916.1937602627257L220.85385878489328,-913.7307060755336L236.45320197044336,-895.6683087027915L274.22003284072247,-900.5944170771756L279.14614121510675,-904.6995073891626L288.9983579638752,-907.1625615763546L297.2085385878489,-907.1625615763546L302.95566502463055,-905.5205254515599L311.98686371100166,-905.5205254515599L320.1970443349754,-903.8784893267651L324.30213464696226,-901.4154351395731L334.1543513957307,-899.7733990147783L348.11165845648605,-891.5632183908045L350.57471264367814,-892.384236453202L366.1740558292282,-876.7848932676519L378.4893267651888,-872.679802955665",
    "color": "rgba(51,125,201,.09)"
  },
  {
    "id": "FJ",
    "code2": "FJ",
    "label": "Fiji",
    "name": "Fiji",
    "path": "M537.7668308702791,-609.9540229885057L553.3661740558292,-637.8686371100164L554.1871921182266,-639.5106732348112L559.9343185550082,-668.2463054187192L555.008210180624,-673.9934318555008L551.7241379310345,-681.3825944170771L536.1247947454845,-690.4137931034483L533.6617405582923,-693.6978653530377L526.2725779967159,-702.7290640394089L516.4203612479474,-718.3284072249589L508.2101806239737,-729.0016420361247L500.82101806239734,-730.6436781609195L490.14778325123154,-731.4646962233169L483.5796387520525,-724.0755336617406L479.4745484400657,-715.0443349753695L478.6535303776683,-708.4761904761905L479.4745484400657,-705.192118226601L479.4745484400657,-702.7290640394089L479.4745484400657,-701.9080459770115L480.29556650246303,-701.9080459770115L486.04269293924466,-690.4137931034483L481.9376026272578,-685.487684729064L478.6535303776683,-678.919540229885L477.83251231527095,-669.8883415435139L479.4745484400657,-660.8571428571429L472.9064039408867,-646.8998357963875L484.4006568144499,-604.2068965517241L493.43185550082103,-605.0279146141215L504.1050903119869,-609.9540229885057L505.7471264367816,-610.7750410509032L506.56814449917897,-611.5960591133005L507.38916256157637,-612.4170771756978L508.2101806239737,-613.2380952380952L509.0311986863711,-614.0591133004926L511.4942528735632,-618.1642036124795L514.7783251231527,-624.7323481116584L521.3464696223317,-616.5221674876847L530.3776683087028,-611.5960591133005L537.7668308702791,-609.9540229885057",
    "color": "rgba(51,125,201,.09)"
  },
  {
    "id": "GU",
    "code2": "GU",
    "label": "Guam",
    "name": "Guam",
    "path": "M228.24302134646962,-934.256157635468L275.86206896551727,-906.3415435139573L273.3990147783251,-901.4154351395731L236.45320197044336,-895.6683087027915L220.85385878489328,-912.9096880131362L222.49589490968802,-923.5829228243022L228.24302134646962,-934.256157635468",
    "color": "rgba(51,125,201,.09)"
  },
  {
    "id": "KI",
    "code2": "KI",
    "label": "Kiribati",
    "name": "Kiribati",
    "path": "M607.5533661740558,-811.9244663382594L614.9425287356322,-807.8193760262726L620.6896551724138,-802.8932676518883L623.9737274220033,-799.6091954022988L624.7947454844007,-797.1461412151067L625.615763546798,-796.3251231527094L628.0788177339901,-791.3990147783251L630.5418719211823,-785.6518883415434L631.3628899835796,-781.5467980295566L631.3628899835796,-779.9047619047619L631.3628899835796,-779.0837438423645L629.7208538587848,-770.8735632183908L621.5106732348112,-757.7372742200329L619.047619047619,-754.4532019704433L605.0903119868638,-754.4532019704433L597.7011494252873,-756.9162561576354L584.5648604269294,-757.7372742200329L564.039408866995,-747.064039408867L558.2922824302135,-750.3481116584564L551.7241379310345,-757.7372742200329L547.6190476190476,-766.7684729064039L547.6190476190476,-777.4417077175698L548.4400656814449,-779.0837438423645L548.4400656814449,-779.9047619047619L549.2610837438424,-783.1888341543514L550.9031198686371,-785.6518883415434L554.1871921182266,-786.4729064039409L580.4597701149426,-804.5353037766831L584.5648604269294,-811.1034482758621L587.0279146141215,-811.9244663382594L597.7011494252873,-813.5665024630541L607.5533661740558,-811.9244663382594M494.2528735632184,-853.7963875205254L458.128078817734,-842.3021346469623L453.20197044334975,-828.3448275862069L449.91789819376027,-825.0607553366174L439.2446633825944,-823.4187192118227L433.4975369458128,-779.0837438423645L441.70771756978655,-776.6206896551724L450.7389162561576,-775.799671592775L458.9490968801314,-778.2627257799671L459.7701149425287,-779.0837438423645L461.41215106732346,-779.9047619047619L463.0541871921182,-781.5467980295566L466.3382594417077,-784.0098522167488L468.80131362889983,-780.7257799671593L469.62233169129723,-779.9047619047619L470.4433497536946,-779.0837438423645L474.54844006568146,-774.9786535303776L500,-776.6206896551724L509.0311986863711,-774.9786535303776L529.5566502463054,-777.4417077175698L530.3776683087028,-779.0837438423645L530.3776683087028,-779.9047619047619L532.0197044334975,-788.1149425287356L530.3776683087028,-796.3251231527094L530.3776683087028,-797.1461412151067L527.0935960591133,-809.4614121510673L522.167487684729,-816.0295566502463L513.9573070607553,-822.5977011494252L505.7471264367816,-825.0607553366174L503.2840722495895,-828.3448275862069L499.1789819376026,-845.5862068965517L494.2528735632184,-853.7963875205254M738.9162561576354,-827.5238095238095L738.9162561576354,-820.9556650246305L737.2742200328407,-813.5665024630541L731.5270935960591,-803.7142857142857L742.2003284072249,-801.2512315270935L748.768472906404,-797.1461412151067L749.5894909688013,-796.3251231527094L751.231527093596,-794.6830870279146L752.0525451559935,-793.0410509031199L753.6945812807882,-789.7569786535304L756.9786535303776,-779.9047619047619L756.9786535303776,-777.4417077175698L756.9786535303776,-774.1576354679803L756.1576354679803,-769.231527093596L747.9474548440065,-755.2742200328407L756.9786535303776,-754.4532019704433L767.6518883415436,-756.9162561576354L779.1461412151067,-754.4532019704433L784.8932676518883,-751.1691297208538L789.8193760262726,-746.2430213464696L794.7454844006568,-733.927750410509L794.7454844006568,-727.35960591133L793.1034482758621,-719.9704433497536L785.7142857142857,-713.4022988505747L774.2200328407225,-710.1182266009852L761.0837438423646,-698.623973727422L746.3054187192118,-698.623973727422L729.8850574712644,-709.2972085385878L725.7799671592775,-718.3284072249589L729.8850574712644,-742.1379310344828L695.4022988505748,-762.663382594417L697.0443349753695,-773.336617405583L699.5073891625616,-778.2627257799671L703.6124794745484,-784.0098522167488L713.4646962233169,-797.1461412151067L693.76026272578,-822.5977011494252L670.7717569786536,-825.0607553366174L665.0246305418719,-830.807881773399L694.5812807881773,-871.8587848932676L701.1494252873563,-869.3957307060755L711.0016420361247,-862.0065681444992L715.927750410509,-857.0804597701149L720.8538587848933,-849.6912972085386L730.7060755336618,-843.1231527093596L735.6321839080459,-835.7339901477832L738.9162561576354,-827.5238095238095",
    "color": "rgba(51,125,201,.09)",
    "dataLabels": {
      "x": -20
    }
  },
  {
    "id": "MH",
    "code2": "MH",
    "label": "Marshall Islands",
    "name": "Marshall Islands",
    "path": "M439.2446633825944,-823.4187192118227L417.8981937602627,-830.807881773399L416.25615763546796,-834.9129720853858L413.7931034482759,-861.1855500821018L395.73070607553365,-873.5008210180624L391.6256157635468,-871.8587848932676L378.4893267651888,-872.679802955665L366.1740558292282,-876.7848932676519L350.57471264367814,-892.384236453202L354.679802955665,-902.2364532019704L362.0689655172414,-909.6256157635468L367.81609195402297,-919.4778325123152L373.5632183908046,-925.2249589490968L380.95238095238096,-928.5090311986863L386.69950738916253,-929.3300492610837L393.26765188834156,-929.3300492610837L400.6568144499179,-926.8669950738916L407.2249589490969,-929.3300492610837L415.4351395730706,-929.3300492610837L417.8981937602627,-938.3612479474548L449.09688013136287,-953.1395730706075L458.9490968801314,-949.0344827586207L467.1592775041051,-938.3612479474548L470.4433497536946,-926.8669950738916L476.1904761904762,-919.4778325123152L478.6535303776683,-907.1625615763546L483.5796387520525,-899.7733990147783L486.86371100164206,-881.7110016420361L491.7898193760263,-873.5008210180624L495.0738916256158,-855.4384236453202L494.2528735632184,-853.7963875205254L458.128078817734,-842.3021346469623L453.20197044334975,-828.3448275862069L449.91789819376027,-825.0607553366174L439.2446633825944,-823.4187192118227",
    "color": "rgba(51,125,201,.09)"
  },
  {
    "id": "MP",
    "code2": "MP",
    "label": "Mariana Islands",
    "name": "Northern Mariana Islands",
    "path": "M228.24302134646962,-934.256157635468L230.70607553366173,-949.855500821018L223.3169129720854,-970.3809523809524L223.3169129720854,-977.7701149425287L252.05254515599344,-1003.2216748768473L259.4417077175698,-1002.4006568144499L266.00985221674875,-999.1165845648604L273.3990147783251,-992.5484400656815L277.504105090312,-986.8013136288998L283.2512315270936,-974.4860426929392L284.8932676518883,-965.4548440065681L284.072249589491,-960.5287356321838L286.53530377668307,-951.4975369458128L284.8932676518883,-936.7192118226601L286.53530377668307,-928.5090311986863L277.504105090312,-908.8045977011494L275.86206896551727,-906.3415435139573L228.24302134646962,-934.256157635468",
    "color": "rgba(51,125,201,.09)"
  },
  {
    "id": "NC",
    "code2": "NC",
    "label": "New Caledonia",
    "name": "New Caledonia",
    "path": "M359.60591133004925,-603.3858784893267L353.0377668308703,-619.8062397372742L349.7536945812808,-625.5533661740558L347.29064039408865,-642.7947454844007L340.7224958949097,-653.4679802955665L346.4696223316913,-660.0361247947454L361.247947454844,-683.0246305418719L372.74220032840725,-679.7405582922825L397.3727422003284,-691.2348111658456L408.04597701149424,-672.351395730706L446.6338259441708,-634.5845648604269L450.7389162561576,-633.7635467980296L449.09688013136287,-601.743842364532L443.3497536945813,-597.6387520525451L422.0032840722496,-596.8177339901478L402.2988505747126,-606.6699507389162L391.6256157635468,-614.88013136289L385.8784893267652,-621.448275862069L379.3103448275862,-614.0591133004926L359.60591133004925,-603.3858784893267",
    "color": "rgba(51,125,201,.09)"
  },
  {
    "id": "NU",
    "code2": "NU",
    "label": "Niue",
    "name": "Niue",
    "path": "M597.7011494252873,-633.7635467980296L593.5960591133005,-643.615763546798L595.2380952380952,-669.0673234811165L600.1642036124795,-673.9934318555008L610.8374384236453,-675.6354679802955L615.7635467980296,-675.6354679802955L637.1100164203613,-668.2463054187192L639.5730706075534,-649.3628899835796L636.2889983579639,-640.3316912972085L629.7208538587848,-632.9425287356322L621.5106732348112,-628.0164203612479L610.8374384236453,-626.3743842364531L599.3431855500821,-628.8374384236453L597.7011494252873,-633.7635467980296",
    "color": "rgba(51,125,201,.09)"
  },
  {
    "id": "NR",
    "code2": "NR",
    "label": "Nauru",
    "name": "Nauru",
    "path": "M433.4975369458128,-779.0837438423645L422.824302134647,-778.2627257799671L412.9720853858785,-781.5467980295566L405.58292282430216,-788.1149425287356L400.6568144499179,-797.1461412151067L399.83579638752053,-807.8193760262726L402.2988505747126,-817.6715927750411L408.86699507389164,-825.0607553366174L417.8981937602627,-830.807881773399L439.2446633825944,-823.4187192118227L433.4975369458128,-779.0837438423645",
    "color": "rgba(51,125,201,.09)"
  },
  {
    "id": "PF",
    "code2": "PF",
    "label": "French Polynesia",
    "name": "French Polynesia",
    "path": "M746.3054187192118,-698.623973727422L761.0837438423646,-698.623973727422L774.2200328407225,-710.1182266009852L785.7142857142857,-713.4022988505747L794.7454844006568,-720.7914614121511L800.4926108374384,-721.6124794745484L811.9868637110017,-720.7914614121511L821.8390804597701,-718.3284072249589L824.3021346469623,-719.9704433497536L818.5550082101806,-733.1067323481117L816.9129720853858,-745.4220032840723L817.7339901477833,-752.8111658456486L821.0180623973728,-760.2003284072249L826.7651888341544,-766.7684729064039L837.4384236453202,-771.6945812807882L846.4696223316913,-773.336617405583L857.9638752052546,-770.0525451559934L877.6683087027915,-751.9901477832512L886.6995073891626,-736.3908045977012L888.3415435139573,-728.1806239737274L887.5205254515599,-719.9704433497536L885.8784893267651,-715.8653530377668L879.3103448275862,-707.6551724137931L883.4154351395731,-700.2660098522167L885.0574712643678,-686.3087027914614L893.2676518883416,-683.0246305418719L900.6568144499179,-675.6354679802955L905.5829228243022,-665.7832512315271L905.5829228243022,-654.2889983579638L911.3300492610838,-646.0788177339901L912.9720853858785,-641.1527093596059L911.3300492610838,-638.6896551724137L905.5829228243022,-605.8489326765189L902.2988505747127,-591.0706075533661L894.0886699507389,-589.4285714285714L880.1313628899836,-592.7126436781609L876.0262725779967,-591.8916256157635L866.1740558292282,-591.8916256157635L856.3218390804598,-595.1756978653531L850.5747126436781,-600.1018062397372L843.1855500821018,-603.3858784893267L833.3333333333334,-605.0279146141215L842.3645320197045,-592.7126436781609L844.8275862068965,-583.6814449917898L844.0065681444992,-575.471264367816L840.7224958949097,-566.4400656814449L834.1543513957307,-558.2298850574713L827.5862068965517,-554.1247947454843L820.1970443349753,-551.6617405582923L809.5238095238095,-551.6617405582923L786.5353037766831,-560.6929392446633L779.1461412151067,-566.4400656814449L775.0410509031199,-571.3661740558292L772.5779967159277,-578.7553366174055L770.935960591133,-589.4285714285714L760.2627257799671,-591.8916256157635L753.6945812807882,-596.8177339901478L744.663382594417,-595.9967159277504L734.8111658456486,-598.4597701149426L726.6009852216748,-604.2068965517241L720.8538587848933,-605.8489326765189L719.2118226600985,-635.4055829228242L731.5270935960591,-653.4679802955665L711.8226600985222,-669.8883415435139L705.2545155993432,-682.2036124794745L706.8965517241379,-687.9507389162561L708.5385878489327,-694.5188834154351L713.4646962233169,-700.2660098522167L719.2118226600985,-706.0131362889983L726.6009852216748,-708.4761904761905L729.8850574712644,-709.2972085385878L746.3054187192118,-698.623973727422",
    "color": "rgba(51,125,201,.09)"
  },
  {
    "id": "PG",
    "code2": "PG",
    "label": "Papua New Guinea",
    "name": "Papua New Guinea",
    "path": "M347.29064039408865,-696.9819376026272L325.1231527093596,-691.2348111658456L307.8817733990148,-692.055829228243L275.86206896551727,-703.5500821018062L263.54679802955667,-710.9392446633826L249.5894909688013,-730.6436781609195L242.20032840722496,-734.7487684729064L233.99014778325122,-732.2857142857142L233.99014778325122,-734.7487684729064L228.24302134646962,-736.3908045977012L228.24302134646962,-731.4646962233169L211.82266009852216,-721.6124794745484L206.89655172413794,-719.9704433497536L205.2545155993432,-723.2545155993431L220.0328407224959,-736.3908045977012L220.0328407224959,-752.8111658456486L217.56978653530376,-756.0952380952381L219.21182266009853,-760.2003284072249L220.0328407224959,-792.2200328407225L222.49589490968802,-800.4302134646962L217.56978653530376,-817.6715927750411L226.60098522167488,-822.5977011494252L251.23152709359607,-829.9868637110017L261.9047619047619,-828.3448275862069L274.22003284072247,-821.7766830870279L282.43021346469624,-825.0607553366174L291.46141215106735,-825.0607553366174L302.13464696223315,-821.7766830870279L312.807881773399,-806.9983579638752L322.66009852216746,-801.2512315270935L349.7536945812808,-800.4302134646962L350.57471264367814,-797.967159277504L353.8587848932676,-797.967159277504L361.247947454844,-800.4302134646962L369.4581280788177,-800.4302134646962L377.6683087027915,-797.967159277504L385.0574712643678,-793.0410509031199L390.8045977011494,-785.6518883415434L393.26765188834156,-776.6206896551724L375.20525451559934,-771.6945812807882L357.14285714285717,-770.8735632183908L339.08045977011494,-756.9162561576354L338.25944170771754,-754.4532019704433L331.6912972085386,-751.9901477832512L327.58620689655174,-744.6009852216748L348.11165845648605,-718.3284072249589L352.2167487684729,-710.1182266009852L347.29064039408865,-696.9819376026272",
    "color": "rgba(51,125,201,.09)"
  },
  {
    "id": "PN",
    "code2": "PN",
    "label": "Pitcairn",
    "name": "Pitcairn",
    "path": "M911.3300492610838,-638.6896551724137L916.256157635468,-641.9737274220032L926.9293924466339,-642.7947454844007L940.8866995073892,-638.6896551724137L949.9178981937603,-637.8686371100164L958.9490968801314,-633.7635467980296L972.0853858784893,-636.2266009852217L983.5796387520526,-632.9425287356322L992.6108374384237,-626.3743842364531L998.3579638752052,-616.5221674876847L1000,-604.2068965517241L998.3579638752052,-596.8177339901478L992.6108374384237,-587.7865353037766L987.6847290640394,-583.6814449917898L976.1904761904761,-578.7553366174055L964.696223316913,-578.7553366174055L954.0229885057471,-583.6814449917898L934.3185550082102,-575.471264367816L923.6453201970444,-574.6502463054187L916.256157635468,-577.1133004926108L908.0459770114943,-582.8604269293925L902.2988505747127,-591.0706075533661L905.5829228243022,-605.8489326765189L911.3300492610838,-638.6896551724137",
    "color": "rgba(51,125,201,.09)"
  },
  {
    "id": "PW",
    "code2": "PW",
    "label": "Palau",
    "name": "Palau",
    "path": "M168.3087027914614,-836.5550082101806L163.38259441707717,-833.2709359605911L154.3513957307061,-821.7766830870279L141.21510673234812,-825.0607553366174L132.183908045977,-825.0607553366174L128.07881773399015,-847.2282430213464L128.07881773399015,-862.0065681444992L131.36288998357963,-871.0377668308703L141.21510673234812,-876.7848932676519L146.14121510673235,-886.6371100164204L151.06732348111657,-893.2052545155993L160.91954022988506,-898.952380952381L170.77175697865354,-900.5944170771756L174.05582922824303,-899.7733990147783L178.16091954022988,-890.7422003284072L180.623973727422,-869.3957307060755L187.192118226601,-848.8702791461412L179.80295566502463,-841.4811165845648L168.3087027914614,-836.5550082101806",
    "color": "rgba(51,125,201,.09)"
  },
  {
    "id": "SB",
    "code2": "SB",
    "label": "Solomon Islands",
    "name": "Solomon Islands",
    "path": "M479.4745484400657,-715.0443349753695L478.6535303776683,-706.8341543513957L475.3694581280788,-699.4449917898194L470.4433497536946,-693.6978653530377L463.8752052545156,-689.5927750410509L431.0344827586207,-710.1182266009852L413.7931034482759,-710.9392446633826L403.94088669950736,-708.4761904761905L399.01477832512313,-700.2660098522167L397.3727422003284,-691.2348111658456L372.74220032840725,-679.7405582922825L361.247947454844,-683.0246305418719L347.29064039408865,-696.9819376026272L352.2167487684729,-710.1182266009852L348.11165845648605,-718.3284072249589L327.58620689655174,-744.6009852216748L331.6912972085386,-751.9901477832512L338.25944170771754,-754.4532019704433L339.08045977011494,-756.9162561576354L357.14285714285717,-770.8735632183908L375.20525451559934,-771.6945812807882L393.26765188834156,-776.6206896551724L394.9096880131363,-769.231527093596L401.4778325123153,-768.4105090311987L408.04597701149424,-765.9474548440065L412.9720853858785,-761.8423645320197L417.07717569786536,-756.0952380952381L426.9293924466338,-758.5582922824302L436.7816091954023,-756.9162561576354L444.99178981937604,-751.1691297208538L451.559934318555,-743.7799671592775L458.9490968801314,-742.1379310344828L465.51724137931035,-738.8538587848932L475.3694581280788,-727.35960591133L478.6535303776683,-721.6124794745484L479.4745484400657,-715.0443349753695",
    "color": "rgba(51,125,201,.09)"
  },
  {
    "id": "TK",
    "code2": "TK",
    "label": "Tokelau",
    "name": "Tokelau",
    "path": "M577.9967159277504,-721.6124794745484L576.3546798029556,-721.6124794745484L565.6814449917898,-730.6436781609195L563.2183908045977,-738.8538587848932L564.039408866995,-747.064039408867L584.5648604269294,-757.7372742200329L597.7011494252873,-756.9162561576354L605.0903119868638,-754.4532019704433L619.047619047619,-754.4532019704433L623.9737274220033,-747.8850574712643L626.4367816091954,-743.7799671592775L622.3316912972085,-729.8226600985222L595.2380952380952,-727.35960591133L580.4597701149426,-721.6124794745484L577.9967159277504,-721.6124794745484",
    "color": "rgba(51,125,201,.09)"
  },
  {
    "id": "TO",
    "code2": "TO",
    "label": "Tonga",
    "name": "Tonga",
    "path": "M555.008210180624,-643.615763546798L559.9343185550082,-668.2463054187192L555.008210180624,-673.9934318555008L551.7241379310345,-681.3825944170771L556.6502463054187,-692.055829228243L573.8916256157636,-696.1609195402299L576.3546798029556,-693.6978653530377L580.4597701149426,-692.8768472906404L589.4909688013137,-687.9507389162561L595.2380952380952,-682.2036124794745L599.3431855500821,-673.9934318555008L595.2380952380952,-669.0673234811165L593.5960591133005,-643.615763546798L599.3431855500821,-628.8374384236453L593.5960591133005,-618.1642036124795L577.9967159277504,-604.2068965517241L568.9655172413793,-599.2807881773399L555.8292282430214,-598.4597701149426L544.3349753694581,-603.3858784893267L537.7668308702791,-609.9540229885057L554.1871921182266,-639.5106732348112L555.008210180624,-643.615763546798",
    "color": "rgba(51,125,201,.09)",
    "dataLabels": {
      "x": 5
    }
  },
  {
    "id": "TV",
    "code2": "TV",
    "label": "Tuvalu",
    "name": "Tuvalu",
    "path": "M516.4203612479474,-718.3284072249589L527.0935960591133,-703.5500821018062L532.8407224958949,-707.6551724137931L544.3349753694581,-715.0443349753695L548.4400656814449,-722.4334975369458L556.6502463054187,-730.6436781609195L556.6502463054187,-734.7487684729064L555.8292282430214,-742.1379310344828L551.7241379310345,-750.3481116584564L547.6190476190476,-754.4532019704433L540.2298850574713,-766.7684729064039L531.1986863711002,-775.799671592775L530.3776683087028,-776.6206896551724L529.5566502463054,-777.4417077175698L509.0311986863711,-774.9786535303776L500,-776.6206896551724L476.1904761904762,-775.799671592775L474.54844006568146,-774.9786535303776L472.9064039408867,-771.6945812807882L472.9064039408867,-764.3054187192118L475.3694581280788,-752.8111658456486L480.29556650246303,-742.1379310344828L490.14778325123154,-731.4646962233169L500.82101806239734,-730.6436781609195L508.2101806239737,-729.0016420361247L516.4203612479474,-718.3284072249589",
    "color": "rgba(51,125,201,.09)"
  },
  {
    "id": "VU",
    "code2": "VU",
    "label": "Vanuatu",
    "name": "Vanuatu",
    "path": "M397.3727422003284,-691.2348111658456L399.01477832512313,-700.2660098522167L403.94088669950736,-708.4761904761905L413.7931034482759,-710.9392446633826L431.0344827586207,-710.1182266009852L463.8752052545156,-689.5927750410509L466.3382594417077,-683.8456486042693L466.3382594417077,-673.9934318555008L471.264367816092,-671.5303776683087L479.4745484400657,-660.8571428571429L472.9064039408867,-646.8998357963875L450.7389162561576,-633.7635467980296L446.6338259441708,-634.5845648604269L408.04597701149424,-672.351395730706L397.3727422003284,-691.2348111658456",
    "color": "rgba(51,125,201,.09)"
  },
  {
    "id": "WF",
    "code2": "WF",
    "label": "W&F",
    "name": "Wallis & Futuna",
    "path": "M532.8407224958949,-707.6551724137931L527.0935960591133,-703.5500821018062L526.2725779967159,-702.7290640394089L533.6617405582923,-693.6978653530377L536.1247947454845,-690.4137931034483L551.7241379310345,-681.3825944170771L556.6502463054187,-692.055829228243L573.8916256157636,-696.1609195402299L574.7126436781609,-705.192118226601L575.5336617405583,-712.5812807881773L575.5336617405583,-715.8653530377668L575.5336617405583,-719.9704433497536L576.3546798029556,-721.6124794745484L565.6814449917898,-730.6436781609195L556.6502463054187,-730.6436781609195L548.4400656814449,-722.4334975369458L544.3349753694581,-715.0443349753695L532.8407224958949,-707.6551724137931",
    "color": "rgba(51,125,201,.09)"
  },
  {
    "id": "WS",
    "code2": "WS",
    "label": "Samoa",
    "name": "Samoa",
    "path": "M607.5533661740558,-708.4761904761905L595.2380952380952,-682.2036124794745L589.4909688013137,-687.9507389162561L580.4597701149426,-692.8768472906404L576.3546798029556,-693.6978653530377L573.8916256157636,-696.1609195402299L576.3546798029556,-721.6124794745484L580.4597701149426,-721.6124794745484L600.1642036124795,-709.2972085385878L607.5533661740558,-708.4761904761905",
    "color": "rgba(51,125,201,.09)"
  }
]

