{
  "chart": {
    "type": "bar",
    "backgroundColor": "#fff"
  },
  "xAxis": [{
    "categories": [],
    "opposite": false,
    "reversed": false,
    "labels": {
      "step": 1
    }
  }, {
    "categories": [],
    "opposite": true,
    "reversed": false,
    "linkedTo": 0,
    "labels": {
      "step": 1
    }
  }],
  "yAxis": {
    "title": {
      "text": null
    },
    "labels": {
      "formatter": function() {
        return Math.abs(this.value);
      }
    }
  },
  "plotOptions": {
    "series": {
      "stacking": true,
      "pointPadding": 0,
      "groupPadding": 0,
      "borderWidth": 1
    }
  },
  "tooltip": {
    "formatter": function() {
      return "<b>" + this.series.name + ", Age " + this.point.category + "</b><br/>" +
        "Population: " + Highcharts.numberFormat(Math.abs(this.point.y), 0);
    }
  },
  "legend": {
    "enabled": false
  },
  "exporting": {
    "buttons": {
      "contextButton": {
        "menuItems": ["viewFullscreen","printChart","separator","downloadPNG","downloadPDF","downloadSVG"]
      }
    }
  },
  "credits": {
    "enabled": false 
  },
  "dotStatChartOptions": {
    "rawDataType": "population_pyramid_race",
    "locale": "en-EN",
    "defaultSet": "year",
    "speed": 500
  }
}