{
  chart: {
    type: "pie",
    backgroundColor: "#fff",
    height: 300
  },
  tooltip: {
    pointFormat: "{point.label}: <b>{point.formatted}</b>"
  },                      
  plotOptions: {
    pie: {
      allowPointSelect: true,
      cursor: "pointer",
      dataLabels: {
        enabled: true,
        format: "{point.label}: {point.y:.1f}"
      },
      showInLegend: true
    }
  },
  legend: {
    enabled: false
  },
  credits: {
    enabled: false
  }
}