<?xml version="1.0" encoding="UTF-8" standalone="no"?>
<svg
   width="32"
   height="32"
   id="svg2"
   version="1.1"
   inkscape:version="1.1.2 (0a00cf5339, 2022-02-04)"
   sodipodi:docname="gparted.svg"
   inkscape:export-filename="/home/rober/Software/Fdroid Icon Pack/twelf_icon_template.png"
   inkscape:export-xdpi="640"
   inkscape:export-ydpi="640"
   xmlns:inkscape="http://www.inkscape.org/namespaces/inkscape"
   xmlns:sodipodi="http://sodipodi.sourceforge.net/DTD/sodipodi-0.dtd"
   xmlns:xlink="http://www.w3.org/1999/xlink"
   xmlns="http://www.w3.org/2000/svg"
   xmlns:svg="http://www.w3.org/2000/svg"
   xmlns:rdf="http://www.w3.org/1999/02/22-rdf-syntax-ns#"
   xmlns:cc="http://creativecommons.org/ns#"
   xmlns:dc="http://purl.org/dc/elements/1.1/">
  <title
     id="title8055">Aleta Postre</title>
  <defs
     id="defs4">
    <inkscape:path-effect
       effect="fillet_chamfer"
       id="path-effect2556"
       is_visible="true"
       lpeversion="1"
       satellites_param="F,0,1,1,0,0.46543007,0,1 @ F,0,0,1,0,0.46543007,0,1 @ F,0,1,1,0,0.46543007,0,1 @ F,0,1,1,0,0.46543007,0,1"
       unit="px"
       method="auto"
       mode="F"
       radius="0"
       chamfer_steps="1"
       flexible="false"
       use_knot_distance="true"
       apply_no_radius="true"
       apply_with_radius="true"
       only_selected="false"
       hide_knots="false" />
    <linearGradient
       id="linearGradient8471">
      <stop
         id="stop8467"
         offset="0"
         style="stop-color:#8ae234;stop-opacity:1" />
      <stop
         id="stop8469"
         offset="1"
         style="stop-color:#4e9a06;stop-opacity:1" />
    </linearGradient>
    <linearGradient
       id="linearGradient5306">
      <stop
         style="stop-color:#ffffff;stop-opacity:0.09876543;"
         offset="0"
         id="stop5308" />
      <stop
         style="stop-color:#ffffff;stop-opacity:0;"
         offset="1"
         id="stop5310" />
    </linearGradient>
    <linearGradient
       id="linearGradient5290">
      <stop
         style="stop-color:#00ffff;stop-opacity:0.09803922;"
         offset="0"
         id="stop5292" />
      <stop
         id="stop6740"
         offset="0.5"
         style="stop-color:#00ff7f;stop-opacity:0.04705882;" />
      <stop
         style="stop-color:#00ff00;stop-opacity:0;"
         offset="1"
         id="stop5294" />
    </linearGradient>
    <linearGradient
       id="linearGradient5188">
      <stop
         style="stop-color:#64b5f6;stop-opacity:0.24705882;"
         offset="0"
         id="stop5198" />
      <stop
         style="stop-color:#64b5f6;stop-opacity:0;"
         offset="1"
         id="stop5192" />
    </linearGradient>
    <linearGradient
       id="linearGradient3975"
       inkscape:swatch="solid">
      <stop
         style="stop-color:#ff5555;stop-opacity:1;"
         offset="0"
         id="stop3977" />
    </linearGradient>
    <linearGradient
       id="linearGradient3969"
       inkscape:swatch="solid">
      <stop
         style="stop-color:#87cdde;stop-opacity:1;"
         offset="0"
         id="stop3971" />
    </linearGradient>
    <filter
       id="filter3945"
       inkscape:label="filtro1"
       x="0"
       y="6"
       width="1.2"
       style="color-interpolation-filters:sRGB">
      <feDiffuseLighting
         id="feDiffuseLighting3947"
         lighting-color="#fdfdfd"
         surfaceScale="121.49533081"
         diffuseConstant="28.44827652" />
    </filter>
    <filter
       inkscape:label="Drop Shadow"
       id="filter3979"
       style="color-interpolation-filters:sRGB">
      <feFlood
         flood-opacity="0.2"
         flood-color="rgb(0,0,0)"
         result="flood"
         id="feFlood3981" />
      <feComposite
         in="flood"
         in2="SourceGraphic"
         operator="in"
         result="composite1"
         id="feComposite3983" />
      <feGaussianBlur
         stdDeviation="6"
         result="blur"
         id="feGaussianBlur3985" />
      <feOffset
         dx="0"
         dy="6"
         result="offset"
         id="feOffset3987" />
      <feComposite
         in="SourceGraphic"
         in2="offset"
         operator="over"
         result="fbSourceGraphic"
         id="feComposite3989" />
      <feColorMatrix
         result="fbSourceGraphicAlpha"
         in="fbSourceGraphic"
         values="0 0 0 -1 0 0 0 0 -1 0 0 0 0 -1 0 0 0 0 1 0"
         id="feColorMatrix3991" />
      <feFlood
         id="feFlood3993"
         flood-opacity="0.2"
         flood-color="rgb(0,0,0)"
         result="flood"
         in="fbSourceGraphic" />
      <feComposite
         id="feComposite3995"
         in2="fbSourceGraphic"
         in="flood"
         operator="in"
         result="composite1" />
      <feGaussianBlur
         id="feGaussianBlur3997"
         stdDeviation="6"
         result="blur" />
      <feOffset
         id="feOffset3999"
         dx="0"
         dy="6"
         result="offset" />
      <feComposite
         id="feComposite4001"
         in2="offset"
         in="fbSourceGraphic"
         operator="over"
         result="composite2" />
    </filter>
    <filter
       style="color-interpolation-filters:sRGB"
       inkscape:label="Drop Shadow"
       id="filter3876">
      <feFlood
         flood-opacity="0.2"
         flood-color="rgb(0,0,0)"
         result="flood"
         id="feFlood3878" />
      <feComposite
         in="flood"
         in2="SourceGraphic"
         operator="in"
         result="composite1"
         id="feComposite3880" />
      <feGaussianBlur
         stdDeviation="6"
         result="blur"
         id="feGaussianBlur3882" />
      <feOffset
         dx="0"
         dy="6"
         result="offset"
         id="feOffset3884" />
      <feComposite
         in="SourceGraphic"
         in2="offset"
         operator="over"
         result="fbSourceGraphic"
         id="feComposite3886" />
      <feColorMatrix
         result="fbSourceGraphicAlpha"
         in="fbSourceGraphic"
         values="0 0 0 -1 0 0 0 0 -1 0 0 0 0 -1 0 0 0 0 1 0"
         id="feColorMatrix3888" />
      <feFlood
         id="feFlood3890"
         flood-opacity="0.397"
         flood-color="rgb(0,0,0)"
         result="flood"
         in="fbSourceGraphic" />
      <feComposite
         id="feComposite3892"
         in2="fbSourceGraphic"
         in="flood"
         operator="in"
         result="composite1" />
      <feGaussianBlur
         id="feGaussianBlur3894"
         stdDeviation="19.2"
         result="blur" />
      <feOffset
         id="feOffset3896"
         dx="0"
         dy="6"
         result="offset" />
      <feComposite
         id="feComposite3898"
         in2="offset"
         in="fbSourceGraphic"
         operator="over"
         result="fbSourceGraphic" />
      <feColorMatrix
         result="fbSourceGraphicAlpha"
         in="fbSourceGraphic"
         values="0 0 0 -1 0 0 0 0 -1 0 0 0 0 -1 0 0 0 0 1 0"
         id="feColorMatrix3900" />
      <feFlood
         id="feFlood3902"
         flood-opacity="0.8"
         flood-color="rgb(0,0,0)"
         result="flood"
         in="fbSourceGraphic" />
      <feComposite
         id="feComposite3904"
         in2="fbSourceGraphic"
         in="flood"
         operator="in"
         result="composite1" />
      <feGaussianBlur
         id="feGaussianBlur3906"
         stdDeviation="19.2"
         result="blur" />
      <feOffset
         id="feOffset3908"
         dx="0"
         dy="6"
         result="offset" />
      <feComposite
         id="feComposite3910"
         in2="offset"
         in="fbSourceGraphic"
         operator="over"
         result="fbSourceGraphic" />
      <feColorMatrix
         result="fbSourceGraphicAlpha"
         in="fbSourceGraphic"
         values="0 0 0 -1 0 0 0 0 -1 0 0 0 0 -1 0 0 0 0 1 0"
         id="feColorMatrix3912" />
      <feFlood
         id="feFlood3914"
         flood-opacity="0.8"
         flood-color="rgb(0,0,0)"
         result="flood"
         in="fbSourceGraphic" />
      <feComposite
         id="feComposite3916"
         in2="fbSourceGraphic"
         in="flood"
         operator="in"
         result="composite1" />
      <feGaussianBlur
         id="feGaussianBlur3918"
         stdDeviation="26.1"
         result="blur" />
      <feOffset
         id="feOffset3920"
         dx="0"
         dy="6"
         result="offset" />
      <feComposite
         id="feComposite3922"
         in2="offset"
         in="fbSourceGraphic"
         operator="over"
         result="fbSourceGraphic" />
      <feColorMatrix
         result="fbSourceGraphicAlpha"
         in="fbSourceGraphic"
         values="0 0 0 -1 0 0 0 0 -1 0 0 0 0 -1 0 0 0 0 1 0"
         id="feColorMatrix3924" />
      <feFlood
         id="feFlood3926"
         flood-opacity="0.8"
         flood-color="rgb(0,0,0)"
         result="flood"
         in="fbSourceGraphic" />
      <feComposite
         id="feComposite3928"
         in2="fbSourceGraphic"
         in="flood"
         operator="in"
         result="composite1" />
      <feGaussianBlur
         id="feGaussianBlur3930"
         stdDeviation="35.7"
         result="blur" />
      <feOffset
         id="feOffset3932"
         dx="0"
         dy="6"
         result="offset" />
      <feComposite
         id="feComposite3934"
         in2="offset"
         in="fbSourceGraphic"
         operator="over"
         result="fbSourceGraphic" />
      <feColorMatrix
         result="fbSourceGraphicAlpha"
         in="fbSourceGraphic"
         values="0 0 0 -1 0 0 0 0 -1 0 0 0 0 -1 0 0 0 0 1 0"
         id="feColorMatrix3936" />
      <feFlood
         id="feFlood3938"
         flood-opacity="0.8"
         flood-color="rgb(0,0,0)"
         result="flood"
         in="fbSourceGraphic" />
      <feComposite
         id="feComposite3940"
         in2="fbSourceGraphic"
         in="flood"
         operator="in"
         result="composite1" />
      <feGaussianBlur
         id="feGaussianBlur3942"
         stdDeviation="6"
         result="blur" />
      <feOffset
         id="feOffset3944"
         dx="0"
         dy="6"
         result="offset" />
      <feComposite
         id="feComposite3946"
         in2="offset"
         in="fbSourceGraphic"
         operator="over"
         result="fbSourceGraphic" />
      <feColorMatrix
         result="fbSourceGraphicAlpha"
         in="fbSourceGraphic"
         values="0 0 0 -1 0 0 0 0 -1 0 0 0 0 -1 0 0 0 0 1 0"
         id="feColorMatrix3948" />
      <feFlood
         id="feFlood3950"
         flood-opacity="0.8"
         flood-color="rgb(0,0,0)"
         result="flood"
         in="fbSourceGraphic" />
      <feComposite
         id="feComposite3952"
         in2="fbSourceGraphic"
         in="flood"
         operator="in"
         result="composite1" />
      <feGaussianBlur
         id="feGaussianBlur3954"
         stdDeviation="21.7"
         result="blur" />
      <feOffset
         id="feOffset3956"
         dx="0"
         dy="6"
         result="offset" />
      <feComposite
         id="feComposite3958"
         in2="offset"
         in="fbSourceGraphic"
         operator="over"
         result="fbSourceGraphic" />
      <feColorMatrix
         result="fbSourceGraphicAlpha"
         in="fbSourceGraphic"
         values="0 0 0 -1 0 0 0 0 -1 0 0 0 0 -1 0 0 0 0 1 0"
         id="feColorMatrix3960" />
      <feFlood
         id="feFlood3962"
         flood-opacity="0.8"
         flood-color="rgb(0,0,0)"
         result="flood"
         in="fbSourceGraphic" />
      <feComposite
         id="feComposite3964"
         in2="fbSourceGraphic"
         in="flood"
         operator="in"
         result="composite1" />
      <feGaussianBlur
         id="feGaussianBlur3966"
         stdDeviation="21.7"
         result="blur" />
      <feOffset
         id="feOffset3968"
         dx="0"
         dy="1.9"
         result="offset" />
      <feComposite
         id="feComposite3970"
         in2="offset"
         in="fbSourceGraphic"
         operator="over"
         result="fbSourceGraphic" />
      <feColorMatrix
         result="fbSourceGraphicAlpha"
         in="fbSourceGraphic"
         values="0 0 0 -1 0 0 0 0 -1 0 0 0 0 -1 0 0 0 0 1 0"
         id="feColorMatrix3972" />
      <feFlood
         id="feFlood3974"
         flood-opacity="0.8"
         flood-color="rgb(0,0,0)"
         result="flood"
         in="fbSourceGraphic" />
      <feComposite
         id="feComposite3976"
         in2="fbSourceGraphic"
         in="flood"
         operator="in"
         result="composite1" />
      <feGaussianBlur
         id="feGaussianBlur3978"
         stdDeviation="21.7"
         result="blur" />
      <feOffset
         id="feOffset3980"
         dx="3.6"
         dy="1.9"
         result="offset" />
      <feComposite
         id="feComposite3982"
         in2="offset"
         in="fbSourceGraphic"
         operator="over"
         result="fbSourceGraphic" />
      <feColorMatrix
         result="fbSourceGraphicAlpha"
         in="fbSourceGraphic"
         values="0 0 0 -1 0 0 0 0 -1 0 0 0 0 -1 0 0 0 0 1 0"
         id="feColorMatrix3984" />
      <feFlood
         id="feFlood3986"
         flood-opacity="0.8"
         flood-color="rgb(0,0,0)"
         result="flood"
         in="fbSourceGraphic" />
      <feComposite
         id="feComposite3988"
         in2="fbSourceGraphic"
         in="flood"
         operator="in"
         result="composite1" />
      <feGaussianBlur
         id="feGaussianBlur3990"
         stdDeviation="21.7"
         result="blur" />
      <feOffset
         id="feOffset3992"
         dx="9.6"
         dy="1.9"
         result="offset" />
      <feComposite
         id="feComposite3994"
         in2="offset"
         in="fbSourceGraphic"
         operator="over"
         result="fbSourceGraphic" />
      <feColorMatrix
         result="fbSourceGraphicAlpha"
         in="fbSourceGraphic"
         values="0 0 0 -1 0 0 0 0 -1 0 0 0 0 -1 0 0 0 0 1 0"
         id="feColorMatrix3996" />
      <feFlood
         id="feFlood3998"
         flood-opacity="0.8"
         flood-color="rgb(0,0,0)"
         result="flood"
         in="fbSourceGraphic" />
      <feComposite
         id="feComposite4000"
         in2="fbSourceGraphic"
         in="flood"
         operator="in"
         result="composite1" />
      <feGaussianBlur
         id="feGaussianBlur4002"
         stdDeviation="21.7"
         result="blur" />
      <feOffset
         id="feOffset4004"
         dx="1.2"
         dy="1.9"
         result="offset" />
      <feComposite
         id="feComposite4006"
         in2="offset"
         in="fbSourceGraphic"
         operator="over"
         result="fbSourceGraphic" />
      <feColorMatrix
         result="fbSourceGraphicAlpha"
         in="fbSourceGraphic"
         values="0 0 0 -1 0 0 0 0 -1 0 0 0 0 -1 0 0 0 0 1 0"
         id="feColorMatrix4008" />
      <feFlood
         id="feFlood4010"
         flood-opacity="0.8"
         flood-color="rgb(0,0,0)"
         result="flood"
         in="fbSourceGraphic" />
      <feComposite
         id="feComposite4012"
         in2="fbSourceGraphic"
         in="flood"
         operator="in"
         result="composite1" />
      <feGaussianBlur
         id="feGaussianBlur4014"
         stdDeviation="21.7"
         result="blur" />
      <feOffset
         id="feOffset4016"
         dx="-1.4"
         dy="1.9"
         result="offset" />
      <feComposite
         id="feComposite4018"
         in2="offset"
         in="fbSourceGraphic"
         operator="over"
         result="fbSourceGraphic" />
      <feColorMatrix
         result="fbSourceGraphicAlpha"
         in="fbSourceGraphic"
         values="0 0 0 -1 0 0 0 0 -1 0 0 0 0 -1 0 0 0 0 1 0"
         id="feColorMatrix4020" />
      <feFlood
         id="feFlood4022"
         flood-opacity="0.8"
         flood-color="rgb(0,0,0)"
         result="flood"
         in="fbSourceGraphic" />
      <feComposite
         id="feComposite4024"
         in2="fbSourceGraphic"
         in="flood"
         operator="in"
         result="composite1" />
      <feGaussianBlur
         id="feGaussianBlur4026"
         stdDeviation="21.7"
         result="blur" />
      <feOffset
         id="feOffset4028"
         dx="0.3"
         dy="1.9"
         result="offset" />
      <feComposite
         id="feComposite4030"
         in2="offset"
         in="fbSourceGraphic"
         operator="over"
         result="fbSourceGraphic" />
      <feColorMatrix
         result="fbSourceGraphicAlpha"
         in="fbSourceGraphic"
         values="0 0 0 -1 0 0 0 0 -1 0 0 0 0 -1 0 0 0 0 1 0"
         id="feColorMatrix4032" />
      <feFlood
         id="feFlood4034"
         flood-opacity="0.8"
         flood-color="rgb(0,0,0)"
         result="flood"
         in="fbSourceGraphic" />
      <feComposite
         id="feComposite4036"
         in2="fbSourceGraphic"
         in="flood"
         operator="in"
         result="composite1" />
      <feGaussianBlur
         id="feGaussianBlur4038"
         stdDeviation="21.7"
         result="blur" />
      <feOffset
         id="feOffset4040"
         dx="-8.04912e-16"
         dy="1.9"
         result="offset" />
      <feComposite
         id="feComposite4042"
         in2="offset"
         in="fbSourceGraphic"
         operator="over"
         result="fbSourceGraphic" />
      <feColorMatrix
         result="fbSourceGraphicAlpha"
         in="fbSourceGraphic"
         values="0 0 0 -1 0 0 0 0 -1 0 0 0 0 -1 0 0 0 0 1 0"
         id="feColorMatrix4044" />
      <feFlood
         id="feFlood4046"
         flood-opacity="0.8"
         flood-color="rgb(0,0,0)"
         result="flood"
         in="fbSourceGraphic" />
      <feComposite
         id="feComposite4048"
         in2="fbSourceGraphic"
         in="flood"
         operator="in"
         result="composite1" />
      <feGaussianBlur
         id="feGaussianBlur4050"
         stdDeviation="21.7"
         result="blur" />
      <feOffset
         id="feOffset4052"
         dx="-8.04912e-16"
         dy="3.6"
         result="offset" />
      <feComposite
         id="feComposite4054"
         in2="offset"
         in="fbSourceGraphic"
         operator="over"
         result="fbSourceGraphic" />
      <feColorMatrix
         result="fbSourceGraphicAlpha"
         in="fbSourceGraphic"
         values="0 0 0 -1 0 0 0 0 -1 0 0 0 0 -1 0 0 0 0 1 0"
         id="feColorMatrix4056" />
      <feFlood
         id="feFlood4058"
         flood-opacity="0.8"
         flood-color="rgb(0,0,0)"
         result="flood"
         in="fbSourceGraphic" />
      <feComposite
         id="feComposite4060"
         in2="fbSourceGraphic"
         in="flood"
         operator="in"
         result="composite1" />
      <feGaussianBlur
         id="feGaussianBlur4062"
         stdDeviation="6"
         result="blur" />
      <feOffset
         id="feOffset4064"
         dx="-8.04912e-16"
         dy="3.6"
         result="offset" />
      <feComposite
         id="feComposite4066"
         in2="offset"
         in="fbSourceGraphic"
         operator="over"
         result="fbSourceGraphic" />
      <feColorMatrix
         result="fbSourceGraphicAlpha"
         in="fbSourceGraphic"
         values="0 0 0 -1 0 0 0 0 -1 0 0 0 0 -1 0 0 0 0 1 0"
         id="feColorMatrix4080" />
      <feFlood
         id="feFlood4082"
         flood-opacity="0.8"
         flood-color="rgb(0,0,0)"
         result="flood"
         in="fbSourceGraphic" />
      <feComposite
         id="feComposite4084"
         in2="fbSourceGraphic"
         in="flood"
         operator="in"
         result="composite1" />
      <feGaussianBlur
         id="feGaussianBlur4086"
         stdDeviation="6"
         result="blur" />
      <feOffset
         id="feOffset4088"
         dx="-8.04912e-16"
         dy="3.6"
         result="offset" />
      <feComposite
         id="feComposite4090"
         in2="offset"
         in="fbSourceGraphic"
         operator="over"
         result="fbSourceGraphic" />
      <feColorMatrix
         result="fbSourceGraphicAlpha"
         in="fbSourceGraphic"
         values="0 0 0 -1 0 0 0 0 -1 0 0 0 0 -1 0 0 0 0 1 0"
         id="feColorMatrix4092" />
      <feFlood
         id="feFlood4094"
         flood-opacity="0.8"
         flood-color="rgb(0,0,0)"
         result="flood"
         in="fbSourceGraphic" />
      <feComposite
         id="feComposite4096"
         in2="fbSourceGraphic"
         in="flood"
         operator="in"
         result="composite1" />
      <feGaussianBlur
         id="feGaussianBlur4098"
         stdDeviation="6"
         result="blur" />
      <feOffset
         id="feOffset4100"
         dx="-8.04912e-16"
         dy="7.7"
         result="offset" />
      <feComposite
         id="feComposite4102"
         in2="offset"
         in="fbSourceGraphic"
         operator="over"
         result="fbSourceGraphic" />
      <feColorMatrix
         result="fbSourceGraphicAlpha"
         in="fbSourceGraphic"
         values="0 0 0 -1 0 0 0 0 -1 0 0 0 0 -1 0 0 0 0 1 0"
         id="feColorMatrix4104" />
      <feFlood
         id="feFlood4106"
         flood-opacity="0.8"
         flood-color="rgb(0,0,0)"
         result="flood"
         in="fbSourceGraphic" />
      <feComposite
         id="feComposite4108"
         in2="fbSourceGraphic"
         in="flood"
         operator="in"
         result="composite1" />
      <feGaussianBlur
         id="feGaussianBlur4110"
         stdDeviation="6"
         result="blur" />
      <feOffset
         id="feOffset4112"
         dx="-8.04912e-16"
         dy="11.6"
         result="offset" />
      <feComposite
         id="feComposite4114"
         in2="offset"
         in="fbSourceGraphic"
         operator="over"
         result="fbSourceGraphic" />
      <feColorMatrix
         result="fbSourceGraphicAlpha"
         in="fbSourceGraphic"
         values="0 0 0 -1 0 0 0 0 -1 0 0 0 0 -1 0 0 0 0 1 0"
         id="feColorMatrix4116" />
      <feFlood
         id="feFlood4118"
         flood-opacity="0.5"
         flood-color="rgb(0,0,0)"
         result="flood"
         in="fbSourceGraphic" />
      <feComposite
         id="feComposite4120"
         in2="fbSourceGraphic"
         in="flood"
         operator="in"
         result="composite1" />
      <feGaussianBlur
         id="feGaussianBlur4122"
         stdDeviation="6"
         result="blur" />
      <feOffset
         id="feOffset4124"
         dx="-8.04912e-16"
         dy="11.6"
         result="offset" />
      <feComposite
         id="feComposite4126"
         in2="offset"
         in="fbSourceGraphic"
         operator="over"
         result="fbSourceGraphic" />
      <feColorMatrix
         result="fbSourceGraphicAlpha"
         in="fbSourceGraphic"
         values="0 0 0 -1 0 0 0 0 -1 0 0 0 0 -1 0 0 0 0 1 0"
         id="feColorMatrix4128" />
      <feFlood
         id="feFlood4130"
         flood-opacity="0.3"
         flood-color="rgb(0,0,0)"
         result="flood"
         in="fbSourceGraphic" />
      <feComposite
         id="feComposite4132"
         in2="fbSourceGraphic"
         in="flood"
         operator="in"
         result="composite1" />
      <feGaussianBlur
         id="feGaussianBlur4134"
         stdDeviation="6"
         result="blur" />
      <feOffset
         id="feOffset4136"
         dx="-8.04912e-16"
         dy="11.6"
         result="offset" />
      <feComposite
         id="feComposite4138"
         in2="offset"
         in="fbSourceGraphic"
         operator="over"
         result="fbSourceGraphic" />
      <feColorMatrix
         result="fbSourceGraphicAlpha"
         in="fbSourceGraphic"
         values="0 0 0 -1 0 0 0 0 -1 0 0 0 0 -1 0 0 0 0 1 0"
         id="feColorMatrix4140" />
      <feFlood
         id="feFlood4142"
         flood-opacity="0.2"
         flood-color="rgb(0,0,0)"
         result="flood"
         in="fbSourceGraphic" />
      <feComposite
         id="feComposite4144"
         in2="fbSourceGraphic"
         in="flood"
         operator="in"
         result="composite1" />
      <feGaussianBlur
         id="feGaussianBlur4146"
         stdDeviation="6"
         result="blur" />
      <feOffset
         id="feOffset4148"
         dx="-8.04912e-16"
         dy="11.6"
         result="offset" />
      <feComposite
         id="feComposite4150"
         in2="offset"
         in="fbSourceGraphic"
         operator="over"
         result="fbSourceGraphic" />
      <feColorMatrix
         result="fbSourceGraphicAlpha"
         in="fbSourceGraphic"
         values="0 0 0 -1 0 0 0 0 -1 0 0 0 0 -1 0 0 0 0 1 0"
         id="feColorMatrix4152" />
      <feFlood
         id="feFlood4154"
         flood-opacity="0.2"
         flood-color="rgb(0,0,0)"
         result="flood"
         in="fbSourceGraphic" />
      <feComposite
         id="feComposite4156"
         in2="fbSourceGraphic"
         in="flood"
         operator="in"
         result="composite1" />
      <feGaussianBlur
         id="feGaussianBlur4158"
         stdDeviation="6"
         result="blur" />
      <feOffset
         id="feOffset4160"
         dx="-8.04912e-16"
         dy="11.6"
         result="offset" />
      <feComposite
         id="feComposite4162"
         in2="offset"
         in="fbSourceGraphic"
         operator="over"
         result="fbSourceGraphic" />
      <feColorMatrix
         result="fbSourceGraphicAlpha"
         in="fbSourceGraphic"
         values="0 0 0 -1 0 0 0 0 -1 0 0 0 0 -1 0 0 0 0 1 0"
         id="feColorMatrix4164" />
      <feFlood
         id="feFlood4166"
         flood-opacity="0.2"
         flood-color="rgb(0,0,0)"
         result="flood"
         in="fbSourceGraphic" />
      <feComposite
         id="feComposite4168"
         in2="fbSourceGraphic"
         in="flood"
         operator="in"
         result="composite1" />
      <feGaussianBlur
         id="feGaussianBlur4170"
         stdDeviation="6"
         result="blur" />
      <feOffset
         id="feOffset4172"
         dx="-8.04912e-16"
         dy="6"
         result="offset" />
      <feComposite
         id="feComposite4174"
         in2="offset"
         in="fbSourceGraphic"
         operator="over"
         result="composite2" />
    </filter>
    <filter
       inkscape:label="Cross-smooth"
       inkscape:menu="Blurs"
       inkscape:menu-tooltip="Blur inner borders and intersections"
       id="filter4522"
       style="color-interpolation-filters:sRGB">
      <feGaussianBlur
         stdDeviation="3"
         id="feGaussianBlur4524" />
      <feColorMatrix
         result="fbSourceGraphic"
         values="1 0 0 0 0 0 1 0 0 0 0 0 1 0 0 0 0 0 6 -2.5 "
         id="feColorMatrix4526" />
    </filter>
    <filter
       inkscape:label="Cross-smooth"
       inkscape:menu="Blurs"
       inkscape:menu-tooltip="Blur inner borders and intersections"
       id="filter4576"
       style="color-interpolation-filters:sRGB">
      <feGaussianBlur
         stdDeviation="3"
         id="feGaussianBlur4578" />
      <feColorMatrix
         result="fbSourceGraphic"
         values="1 0 0 0 0 0 1 0 0 0 0 0 1 0 0 0 0 0 6 -2.5 "
         id="feColorMatrix4580" />
    </filter>
    <filter
       inkscape:label="Cross-smooth"
       inkscape:menu="Blurs"
       inkscape:menu-tooltip="Blur inner borders and intersections"
       id="filter4576-0"
       style="color-interpolation-filters:sRGB">
      <feGaussianBlur
         stdDeviation="3"
         id="feGaussianBlur4578-8" />
      <feColorMatrix
         result="fbSourceGraphic"
         values="1 0 0 0 0 0 1 0 0 0 0 0 1 0 0 0 0 0 6 -2.5 "
         id="feColorMatrix4580-0" />
    </filter>
    <filter
       inkscape:label="Cross-smooth"
       inkscape:menu="Blurs"
       inkscape:menu-tooltip="Blur inner borders and intersections"
       id="filter4576-0-0"
       style="color-interpolation-filters:sRGB">
      <feGaussianBlur
         stdDeviation="3"
         id="feGaussianBlur4578-8-5" />
      <feColorMatrix
         result="fbSourceGraphic"
         values="1 0 0 0 0 0 1 0 0 0 0 0 1 0 0 0 0 0 6 -2.5 "
         id="feColorMatrix4580-0-2" />
    </filter>
    <filter
       inkscape:label="Cross-smooth"
       inkscape:menu="Blurs"
       inkscape:menu-tooltip="Blur inner borders and intersections"
       id="filter4576-0-0-4"
       style="color-interpolation-filters:sRGB">
      <feGaussianBlur
         stdDeviation="3"
         id="feGaussianBlur4578-8-5-2" />
      <feColorMatrix
         result="fbSourceGraphic"
         values="1 0 0 0 0 0 1 0 0 0 0 0 1 0 0 0 0 0 6 -2.5 "
         id="feColorMatrix4580-0-2-7" />
    </filter>
    <radialGradient
       inkscape:collect="always"
       xlink:href="#linearGradient5306"
       id="radialGradient5296"
       cx="9"
       cy="1032.1122"
       fx="9"
       fy="1032.1122"
       r="10.125"
       gradientUnits="userSpaceOnUse"
       gradientTransform="matrix(1.9444444,0,0,1.9444474,-13.5625,-977.58811)" />
    <linearGradient
       inkscape:collect="always"
       xlink:href="#linearGradient5306"
       id="linearGradient5312"
       x1="-15.75"
       y1="1029.2997"
       x2="23.625"
       y2="1029.2997"
       gradientUnits="userSpaceOnUse" />
    <linearGradient
       id="linearGradient3783-1">
      <stop
         id="stop3785-2"
         offset="0"
         style="stop-color:#1e94d3;stop-opacity:1;" />
      <stop
         style="stop-color:#1e94d3;stop-opacity:1;"
         offset="1"
         id="stop3803-6" />
    </linearGradient>
    <linearGradient
       gradientUnits="userSpaceOnUse"
       y2="50"
       x2="30"
       y1="90"
       x1="-10"
       id="linearGradient3827-7"
       xlink:href="#linearGradient3783-1"
       inkscape:collect="always" />
    <linearGradient
       gradientUnits="userSpaceOnUse"
       y2="50"
       x2="30"
       y1="90"
       x1="-10"
       id="linearGradient3827"
       xlink:href="#linearGradient3783"
       inkscape:collect="always" />
    <linearGradient
       id="linearGradient3783">
      <stop
         id="stop3785"
         offset="0"
         style="stop-color:#1e94d3;stop-opacity:1;" />
      <stop
         style="stop-color:#1e94d3;stop-opacity:1;"
         offset="1"
         id="stop3803" />
    </linearGradient>
    <linearGradient
       id="linearGradient3821">
      <stop
         id="stop3823"
         offset="0"
         style="stop-color:#37aee2;stop-opacity:1;" />
      <stop
         id="stop3825"
         offset="1"
         style="stop-color:#1e96c8;stop-opacity:1;" />
    </linearGradient>
    <linearGradient
       id="linearGradient3829">
      <stop
         style="stop-color:#1f96d4;stop-opacity:1;"
         offset="0"
         id="stop3831" />
      <stop
         style="stop-color:#37aee2;stop-opacity:1;"
         offset="1"
         id="stop3833" />
    </linearGradient>
    <linearGradient
       id="linearGradient3877">
      <stop
         id="stop3879"
         offset="0"
         style="stop-color:#eff7fc;stop-opacity:1;" />
      <stop
         id="stop3881"
         offset="1"
         style="stop-color:#ffffff;stop-opacity:1;" />
    </linearGradient>
    <linearGradient
       id="linearGradient3689">
      <stop
         id="stop3691"
         offset="0"
         style="stop-color:#f68000;stop-opacity:1;" />
      <stop
         id="stop3693"
         offset="1"
         style="stop-color:#fd9800;stop-opacity:1;" />
    </linearGradient>
    <linearGradient
       id="linearGradient3675">
      <stop
         id="stop3677"
         offset="0"
         style="stop-color:#ffb900;stop-opacity:1;" />
      <stop
         id="stop3679"
         offset="1"
         style="stop-color:#ffd76b;stop-opacity:1;" />
    </linearGradient>
    <linearGradient
       y2="463.26218"
       x2="412.23013"
       y1="461.92139"
       x1="-113.89329"
       gradientUnits="userSpaceOnUse"
       id="linearGradient3840"
       xlink:href="#linearGradient3675"
       inkscape:collect="always" />
    <linearGradient
       id="linearGradient3634">
      <stop
         style="stop-color:#7a8288;stop-opacity:1;"
         offset="0"
         id="stop3636" />
      <stop
         id="stop3638"
         offset="0.07633271"
         style="stop-color:#9fa3a7;stop-opacity:1;" />
      <stop
         style="stop-color:#7d858b;stop-opacity:1;"
         offset="1"
         id="stop3640" />
    </linearGradient>
    <linearGradient
       y2="12.703197"
       x2="151.34604"
       y1="-0.64152896"
       x1="107.20918"
       gradientTransform="matrix(0.28222223,0,0,0.28222223,-0.13983991,-0.01181449)"
       gradientUnits="userSpaceOnUse"
       id="linearGradient3838"
       xlink:href="#linearGradient3634"
       inkscape:collect="always" />
    <linearGradient
       id="linearGradient3712">
      <stop
         id="stop3714"
         offset="0"
         style="stop-color:#a1abb2;stop-opacity:1;" />
      <stop
         style="stop-color:#eaeced;stop-opacity:1;"
         offset="0.14824273"
         id="stop3720" />
      <stop
         id="stop3716"
         offset="1"
         style="stop-color:#c6ccd0;stop-opacity:1;" />
    </linearGradient>
    <linearGradient
       y2="27.389442"
       x2="164.75943"
       y1="12.640625"
       x1="104.88638"
       gradientUnits="userSpaceOnUse"
       id="linearGradient3836"
       xlink:href="#linearGradient3712"
       inkscape:collect="always" />
    <linearGradient
       id="linearGradient3702">
      <stop
         id="stop3704"
         offset="0"
         style="stop-color:#7a8288;stop-opacity:1;" />
      <stop
         style="stop-color:#9fa3a7;stop-opacity:1;"
         offset="0.5288403"
         id="stop3710" />
      <stop
         id="stop3706"
         offset="1"
         style="stop-color:#7d858b;stop-opacity:1;" />
    </linearGradient>
    <linearGradient
       y2="268.41544"
       x2="334.03125"
       y1="252.48438"
       x1="18.875"
       gradientUnits="userSpaceOnUse"
       id="linearGradient3834"
       xlink:href="#linearGradient3702"
       inkscape:collect="always" />
    <linearGradient
       id="linearGradient3626">
      <stop
         style="stop-color:#a1abb2;stop-opacity:1;"
         offset="0"
         id="stop3628" />
      <stop
         id="stop3630"
         offset="0.08297831"
         style="stop-color:#eaeced;stop-opacity:1;" />
      <stop
         style="stop-color:#c6ccd0;stop-opacity:1;"
         offset="1"
         id="stop3632" />
    </linearGradient>
    <linearGradient
       y2="290.6998"
       x2="278.4324"
       y1="228.59993"
       x1="44.103722"
       gradientUnits="userSpaceOnUse"
       id="linearGradient3832"
       xlink:href="#linearGradient3626"
       inkscape:collect="always" />
    <linearGradient
       id="linearGradient3646">
      <stop
         id="stop3648"
         offset="0"
         style="stop-color:#f48200;stop-opacity:0;" />
      <stop
         style="stop-color:#f48200;stop-opacity:0.72784811;"
         offset="0.58887613"
         id="stop3654" />
      <stop
         id="stop3658"
         offset="0.81621653"
         style="stop-color:#cc5f00;stop-opacity:1;" />
      <stop
         id="stop3650"
         offset="1"
         style="stop-color:#a43d00;stop-opacity:1;" />
    </linearGradient>
    <linearGradient
       y2="55.356419"
       x2="261.62219"
       y1="70.105232"
       x1="115.20164"
       gradientUnits="userSpaceOnUse"
       id="linearGradient3830"
       xlink:href="#linearGradient3646"
       inkscape:collect="always" />
    <linearGradient
       id="linearGradient3668">
      <stop
         style="stop-color:#9b4400;stop-opacity:1;"
         offset="0"
         id="stop3670" />
      <stop
         style="stop-color:#e56300;stop-opacity:1;"
         offset="1"
         id="stop3672" />
    </linearGradient>
    <linearGradient
       y2="108.98846"
       x2="93.522026"
       y1="102.28447"
       x1="64.751183"
       gradientUnits="userSpaceOnUse"
       id="linearGradient3828"
       xlink:href="#linearGradient3668"
       inkscape:collect="always" />
    <linearGradient
       id="linearGradient3649">
      <stop
         id="stop3651"
         offset="0"
         style="stop-color:#e26400;stop-opacity:1;" />
      <stop
         id="stop3653"
         offset="1"
         style="stop-color:#ffb900;stop-opacity:1;" />
    </linearGradient>
    <linearGradient
       y2="125.31633"
       x2="44.375881"
       y1="100.34167"
       x1="40.775471"
       gradientTransform="matrix(1,0,0,1.0202334,0,-1.4234613)"
       gradientUnits="userSpaceOnUse"
       id="linearGradient3826"
       xlink:href="#linearGradient3649"
       inkscape:collect="always" />
    <inkscape:perspective
       sodipodi:type="inkscape:persp3d"
       inkscape:vp_x="0 : 3.7866652 : 1"
       inkscape:vp_y="0 : 1066.6667 : 0"
       inkscape:vp_z="1.0666667 : 3.7866652 : 1"
       inkscape:persp3d-origin="0.53333333 : 3.6088882 : 1"
       id="perspective3852" />
    <inkscape:perspective
       id="perspective3924"
       inkscape:persp3d-origin="396.85039 : 377.42655 : 1"
       inkscape:vp_z="793.70078 : 564.51316 : 1"
       inkscape:vp_y="0 : 1066.6667 : 0"
       inkscape:vp_x="0 : 564.51316 : 1"
       sodipodi:type="inkscape:persp3d" />
    <linearGradient
       id="linearGradient3689-2">
      <stop
         id="stop3691-2"
         offset="0"
         style="stop-color:#f68000;stop-opacity:1;" />
      <stop
         id="stop3693-3"
         offset="1"
         style="stop-color:#fd9800;stop-opacity:1;" />
    </linearGradient>
    <linearGradient
       id="linearGradient3675-8">
      <stop
         id="stop3677-4"
         offset="0"
         style="stop-color:#ffb900;stop-opacity:1;" />
      <stop
         id="stop3679-7"
         offset="1"
         style="stop-color:#ffd76b;stop-opacity:1;" />
    </linearGradient>
    <linearGradient
       y2="463.26218"
       x2="412.23013"
       y1="461.92139"
       x1="-113.89329"
       gradientUnits="userSpaceOnUse"
       id="linearGradient3840-4"
       xlink:href="#linearGradient3675-8"
       inkscape:collect="always" />
    <linearGradient
       id="linearGradient3634-7">
      <stop
         style="stop-color:#7a8288;stop-opacity:1;"
         offset="0"
         id="stop3636-4" />
      <stop
         id="stop3638-6"
         offset="0.07633271"
         style="stop-color:#9fa3a7;stop-opacity:1;" />
      <stop
         style="stop-color:#7d858b;stop-opacity:1;"
         offset="1"
         id="stop3640-9" />
    </linearGradient>
    <linearGradient
       y2="12.703197"
       x2="151.34604"
       y1="-0.64152896"
       x1="107.20918"
       gradientTransform="matrix(0.28222223,0,0,0.28222223,-0.13983991,-0.01181449)"
       gradientUnits="userSpaceOnUse"
       id="linearGradient3838-1"
       xlink:href="#linearGradient3634-7"
       inkscape:collect="always" />
    <linearGradient
       id="linearGradient3712-7">
      <stop
         id="stop3714-7"
         offset="0"
         style="stop-color:#a1abb2;stop-opacity:1;" />
      <stop
         style="stop-color:#eaeced;stop-opacity:1;"
         offset="0.14824273"
         id="stop3720-2" />
      <stop
         id="stop3716-3"
         offset="1"
         style="stop-color:#c6ccd0;stop-opacity:1;" />
    </linearGradient>
    <linearGradient
       y2="27.389442"
       x2="164.75943"
       y1="12.640625"
       x1="104.88638"
       gradientUnits="userSpaceOnUse"
       id="linearGradient3836-7"
       xlink:href="#linearGradient3712-7"
       inkscape:collect="always" />
    <linearGradient
       id="linearGradient3702-3">
      <stop
         id="stop3704-5"
         offset="0"
         style="stop-color:#7a8288;stop-opacity:1;" />
      <stop
         style="stop-color:#9fa3a7;stop-opacity:1;"
         offset="0.5288403"
         id="stop3710-4" />
      <stop
         id="stop3706-4"
         offset="1"
         style="stop-color:#7d858b;stop-opacity:1;" />
    </linearGradient>
    <linearGradient
       y2="268.41544"
       x2="334.03125"
       y1="252.48438"
       x1="18.875"
       gradientUnits="userSpaceOnUse"
       id="linearGradient3834-9"
       xlink:href="#linearGradient3702-3"
       inkscape:collect="always" />
    <linearGradient
       id="linearGradient3626-6">
      <stop
         style="stop-color:#a1abb2;stop-opacity:1;"
         offset="0"
         id="stop3628-0" />
      <stop
         id="stop3630-5"
         offset="0.08297831"
         style="stop-color:#eaeced;stop-opacity:1;" />
      <stop
         style="stop-color:#c6ccd0;stop-opacity:1;"
         offset="1"
         id="stop3632-7" />
    </linearGradient>
    <linearGradient
       y2="290.6998"
       x2="278.4324"
       y1="228.59993"
       x1="44.103722"
       gradientUnits="userSpaceOnUse"
       id="linearGradient3832-3"
       xlink:href="#linearGradient3626-6"
       inkscape:collect="always" />
    <linearGradient
       id="linearGradient3646-6">
      <stop
         id="stop3648-6"
         offset="0"
         style="stop-color:#f48200;stop-opacity:0;" />
      <stop
         style="stop-color:#f48200;stop-opacity:0.72784811;"
         offset="0.58887613"
         id="stop3654-6" />
      <stop
         id="stop3658-4"
         offset="0.81621653"
         style="stop-color:#cc5f00;stop-opacity:1;" />
      <stop
         id="stop3650-0"
         offset="1"
         style="stop-color:#a43d00;stop-opacity:1;" />
    </linearGradient>
    <linearGradient
       y2="55.356419"
       x2="261.62219"
       y1="70.105232"
       x1="115.20164"
       gradientUnits="userSpaceOnUse"
       id="linearGradient3830-6"
       xlink:href="#linearGradient3646-6"
       inkscape:collect="always" />
    <linearGradient
       id="linearGradient3668-5">
      <stop
         style="stop-color:#9b4400;stop-opacity:1;"
         offset="0"
         id="stop3670-3" />
      <stop
         style="stop-color:#e56300;stop-opacity:1;"
         offset="1"
         id="stop3672-2" />
    </linearGradient>
    <linearGradient
       y2="108.98846"
       x2="93.522026"
       y1="102.28447"
       x1="64.751183"
       gradientUnits="userSpaceOnUse"
       id="linearGradient3828-1"
       xlink:href="#linearGradient3668-5"
       inkscape:collect="always" />
    <linearGradient
       id="linearGradient3649-3">
      <stop
         id="stop3651-9"
         offset="0"
         style="stop-color:#e26400;stop-opacity:1;" />
      <stop
         id="stop3653-7"
         offset="1"
         style="stop-color:#ffb900;stop-opacity:1;" />
    </linearGradient>
    <linearGradient
       y2="125.31633"
       x2="44.375881"
       y1="100.34167"
       x1="40.775471"
       gradientTransform="matrix(1,0,0,1.0202334,0,-1.4234613)"
       gradientUnits="userSpaceOnUse"
       id="linearGradient3826-1"
       xlink:href="#linearGradient3649-3"
       inkscape:collect="always" />
    <inkscape:perspective
       sodipodi:type="inkscape:persp3d"
       inkscape:vp_x="0 : 3.7866652 : 1"
       inkscape:vp_y="0 : 1066.6667 : 0"
       inkscape:vp_z="1.0666667 : 3.7866652 : 1"
       inkscape:persp3d-origin="0.53333333 : 3.6088882 : 1"
       id="perspective3852-5" />
    <inkscape:perspective
       id="perspective3924-4"
       inkscape:persp3d-origin="396.85039 : 377.42655 : 1"
       inkscape:vp_z="793.70078 : 564.51316 : 1"
       inkscape:vp_y="0 : 1066.6667 : 0"
       inkscape:vp_x="0 : 564.51316 : 1"
       sodipodi:type="inkscape:persp3d" />
    <linearGradient
       id="linearGradient2460"
       y2="44.984001"
       gradientUnits="userSpaceOnUse"
       x2="19.360001"
       y1="21.030804"
       x1="19.244999">
      <stop
         id="stop3602"
         style="stop-color:#fafafa;stop-opacity:1;"
         offset="0" />
      <stop
         id="stop3604"
         style="stop-color:#f0f0f0;stop-opacity:1;"
         offset="1" />
    </linearGradient>
    <linearGradient
       inkscape:collect="always"
       xlink:href="#linearGradient2460"
       id="linearGradient3157"
       gradientUnits="userSpaceOnUse"
       gradientTransform="matrix(12.102564,0,0,12.102564,-34.468255,-46.187105)"
       x1="18.930269"
       y1="6.2951212"
       x2="19.360001"
       y2="36.643665" />
    <linearGradient
       id="linearGradient5479-2">
      <stop
         id="stop5481-7"
         offset="0"
         style="stop-color:#be5300;stop-opacity:1;" />
      <stop
         style="stop-color:#f07300;stop-opacity:1"
         offset="0.76255572"
         id="stop5483-4" />
      <stop
         id="stop5485-2"
         offset="1"
         style="stop-color:#e67700;stop-opacity:1;" />
    </linearGradient>
    <linearGradient
       y2="134.64415"
       x2="128.50706"
       y1="101.1183"
       x1="4.1104655"
       gradientTransform="matrix(1.2351592,0,0,1.2351592,262.25708,326.9873)"
       gradientUnits="userSpaceOnUse"
       id="linearGradient3900"
       xlink:href="#linearGradient5479-2"
       inkscape:collect="always" />
    <linearGradient
       id="linearGradient5479-6">
      <stop
         style="stop-color:#be5300;stop-opacity:1;"
         offset="0"
         id="stop5481-6" />
      <stop
         id="stop5483-0"
         offset="0.76255572"
         style="stop-color:#f07300;stop-opacity:1" />
      <stop
         style="stop-color:#e67700;stop-opacity:1;"
         offset="1"
         id="stop5485-5" />
    </linearGradient>
    <linearGradient
       inkscape:collect="always"
       xlink:href="#linearGradient5479-6"
       id="linearGradient5467-1"
       gradientUnits="userSpaceOnUse"
       gradientTransform="matrix(1.2351592,0,0,1.2351592,262.25708,326.9873)"
       x1="4.1104655"
       y1="101.1183"
       x2="128.50706"
       y2="134.64415" />
    <linearGradient
       id="linearGradient5447">
      <stop
         id="stop5451"
         offset="0"
         style="stop-color:#e66e00;stop-opacity:1;" />
      <stop
         style="stop-color:#e67700;stop-opacity:1;"
         offset="1"
         id="stop5453" />
    </linearGradient>
    <linearGradient
       id="linearGradient5479">
      <stop
         style="stop-color:#be5300;stop-opacity:1;"
         offset="0"
         id="stop5481" />
      <stop
         id="stop5483"
         offset="0.76255572"
         style="stop-color:#f07300;stop-opacity:1" />
      <stop
         style="stop-color:#e67700;stop-opacity:1;"
         offset="1"
         id="stop5485" />
    </linearGradient>
    <linearGradient
       inkscape:collect="always"
       xlink:href="#linearGradient5479"
       id="linearGradient5467"
       gradientUnits="userSpaceOnUse"
       gradientTransform="matrix(1.2351592,0,0,1.2351592,262.25708,326.9873)"
       x1="4.1104655"
       y1="101.1183"
       x2="128.50706"
       y2="134.64415" />
    <linearGradient
       gradientTransform="matrix(1.0058652,0,0,0.994169,100,0)"
       gradientUnits="userSpaceOnUse"
       id="linearGradient3416"
       y2="7.0165396"
       x2="45.447727"
       y1="92.539597"
       x1="45.447727">
      <stop
         offset="0"
         style="stop-color:#000000;stop-opacity:1"
         id="stop3418" />
      <stop
         offset="1"
         style="stop-color:#000000;stop-opacity:0.58823532"
         id="stop3420" />
    </linearGradient>
    <linearGradient
       inkscape:collect="always"
       xlink:href="#ButtonShadow-0-1-1-5"
       id="linearGradient5342"
       gradientUnits="userSpaceOnUse"
       gradientTransform="matrix(1.0074153,0,0,1.0074153,-810.48879,593.1369)"
       x1="1012.5133"
       y1="484.41721"
       x2="1006.8082"
       y2="20.625916" />
    <linearGradient
       gradientTransform="matrix(1.0058652,0,0,0.994169,100,0)"
       gradientUnits="userSpaceOnUse"
       id="linearGradient3409"
       y2="7.0165396"
       x2="45.447727"
       y1="92.539597"
       x1="45.447727">
      <stop
         offset="0"
         style="stop-color:#000000;stop-opacity:1"
         id="stop3411" />
      <stop
         offset="1"
         style="stop-color:#000000;stop-opacity:0.58823532"
         id="stop3413" />
    </linearGradient>
    <linearGradient
       gradientTransform="matrix(1.0058652,0,0,0.994169,100,0)"
       gradientUnits="userSpaceOnUse"
       id="linearGradient3402"
       y2="7.0165396"
       x2="45.447727"
       y1="92.539597"
       x1="45.447727">
      <stop
         offset="0"
         style="stop-color:#000000;stop-opacity:1"
         id="stop3404" />
      <stop
         offset="1"
         style="stop-color:#000000;stop-opacity:0.58823532"
         id="stop3406" />
    </linearGradient>
    <linearGradient
       gradientTransform="matrix(1.0058652,0,0,0.994169,100,0)"
       gradientUnits="userSpaceOnUse"
       id="linearGradient3395"
       y2="7.0165396"
       x2="45.447727"
       y1="92.539597"
       x1="45.447727">
      <stop
         offset="0"
         style="stop-color:#000000;stop-opacity:1"
         id="stop3397" />
      <stop
         offset="1"
         style="stop-color:#000000;stop-opacity:0.58823532"
         id="stop3399" />
    </linearGradient>
    <linearGradient
       gradientTransform="matrix(1.0058652,0,0,0.994169,100,0)"
       gradientUnits="userSpaceOnUse"
       id="ButtonShadow-0-1-1-5"
       y2="7.0165396"
       x2="45.447727"
       y1="92.539597"
       x1="45.447727">
      <stop
         offset="0"
         style="stop-color:#000000;stop-opacity:1"
         id="stop3750-8-9-3-6" />
      <stop
         offset="1"
         style="stop-color:#000000;stop-opacity:0.58823532"
         id="stop3752-5-6-4-2" />
    </linearGradient>
    <linearGradient
       id="linearGradient4046">
      <stop
         offset="0"
         style="stop-color:#000000;stop-opacity:1;"
         id="stop4048" />
      <stop
         offset="1"
         style="stop-color:#ffffff;stop-opacity:0.2"
         id="stop4050" />
    </linearGradient>
    <linearGradient
       id="linearGradient3737">
      <stop
         offset="0"
         style="stop-color:#ffffff;stop-opacity:1"
         id="stop3739" />
      <stop
         offset="1"
         style="stop-color:#ffffff;stop-opacity:0"
         id="stop3741" />
    </linearGradient>
    <linearGradient
       id="linearGradient4487">
      <stop
         offset="0"
         style="stop-color:#000000;stop-opacity:1"
         id="stop4489" />
      <stop
         offset="1"
         style="stop-color:#000000;stop-opacity:0"
         id="stop4491" />
    </linearGradient>
    <linearGradient
       y2="251.66064"
       x2="1011.9534"
       y1="476.25983"
       x1="1016.1035"
       gradientTransform="translate(-146.22032,369.08845)"
       gradientUnits="userSpaceOnUse"
       id="linearGradient4082"
       xlink:href="#linearGradient4487"
       inkscape:collect="always" />
    <linearGradient
       inkscape:collect="always"
       xlink:href="#SVGID_2_"
       id="linearGradient3803"
       x1="259.99384"
       y1="44"
       x2="259.99384"
       y2="464"
       gradientUnits="userSpaceOnUse" />
    <linearGradient
       y2="217.4595"
       x2="200.0508"
       y1="185.0742"
       x1="200.0508"
       gradientTransform="matrix(9.2574736,0,0,9.2574736,-1595.9285,-1607.2111)"
       gradientUnits="userSpaceOnUse"
       id="linearGradient3017"
       xlink:href="#SVGID_2_"
       inkscape:collect="always" />
    <linearGradient
       inkscape:collect="always"
       xlink:href="#SVGID_2_"
       id="linearGradient3021"
       gradientUnits="userSpaceOnUse"
       gradientTransform="matrix(13.577628,0,0,13.577628,-2026.1619,-2566.7096)"
       x1="200.0508"
       y1="185.0742"
       x2="200.0508"
       y2="217.4595" />
    <linearGradient
       y2="217.4595"
       x2="200.0508"
       y1="185.0742"
       x1="200.0508"
       gradientUnits="userSpaceOnUse"
       id="SVGID_2_">
      <stop
         id="stop13"
         style="stop-color:#61B74A"
         offset="0" />
      <stop
         id="stop15"
         style="stop-color:#449934"
         offset="1" />
    </linearGradient>
    <radialGradient
       gradientUnits="userSpaceOnUse"
       gradientTransform="matrix(1,0,0,1.0499906,0,-19.270593)"
       r="191.6187"
       fy="385.4841"
       fx="558.35437"
       cy="385.4841"
       cx="558.35437"
       id="radialGradient3867"
       xlink:href="#XMLID_74_-8-1"
       inkscape:collect="always" />
    <linearGradient
       y2="48.0854"
       x2="78.466103"
       y1="56.3008"
       x1="64.477501"
       gradientUnits="userSpaceOnUse"
       id="XMLID_74_-8-1">
      <stop
         id="stop155-3-8"
         style="stop-color:#ffffff;stop-opacity:1;"
         offset="0" />
      <stop
         id="stop157-94-6"
         style="stop-color:#e6e6e6;stop-opacity:1;"
         offset="1" />
    </linearGradient>
    <linearGradient
       inkscape:collect="always"
       xlink:href="#linearGradient8471"
       id="linearGradient8465"
       x1="14.999157"
       y1="1095.7725"
       x2="14.999157"
       y2="1121.7725"
       gradientUnits="userSpaceOnUse"
       gradientTransform="translate(1.8008614e-5)" />
  </defs>
  <sodipodi:namedview
     id="base"
     pagecolor="#ffffff"
     bordercolor="#666666"
     borderopacity="1.0"
     inkscape:pageopacity="0.0"
     inkscape:pageshadow="2"
     inkscape:zoom="16"
     inkscape:cx="19.125"
     inkscape:cy="19.9375"
     inkscape:document-units="px"
     inkscape:current-layer="layer1"
     showgrid="true"
     inkscape:window-width="1366"
     inkscape:window-height="699"
     inkscape:window-x="0"
     inkscape:window-y="32"
     inkscape:window-maximized="1"
     units="px"
     showguides="false"
     inkscape:pagecheckerboard="true"
     inkscape:snap-nodes="true"
     inkscape:snap-object-midpoints="true"
     inkscape:snap-bbox="true"
     inkscape:snap-bbox-midpoints="true"
     inkscape:snap-global="false"
     inkscape:snap-bbox-edge-midpoints="true"
     height="16px"
     inkscape:snap-others="true"
     inkscape:bbox-nodes="true"
     inkscape:bbox-paths="true"
     fit-margin-top="1"
     fit-margin-left="1"
     fit-margin-right="1"
     fit-margin-bottom="1"
     lock-margins="true"
     inkscape:snap-center="true"
     inkscape:object-paths="true"
     inkscape:snap-smooth-nodes="true"
     inkscape:snap-intersection-paths="true"
     inkscape:document-rotation="0"
     inkscape:showpageshadow="true"
     inkscape:deskcolor="#d1d1d1"
     showborder="true"
     shape-rendering="auto"
     borderlayer="false"
     inkscape:clip-to-page="false">
    <inkscape:grid
       type="xygrid"
       id="grid2985"
       empspacing="4"
       visible="true"
       enabled="true"
       snapvisiblegridlinesonly="true"
       spacingx="1"
       spacingy="1"
       units="px"
       originx="0"
       originy="0"
       color="#5600f7"
       opacity="0.04705882"
       empcolor="#6008ff"
       empopacity="0.19215686" />
  </sodipodi:namedview>
  <metadata
     id="metadata7">
    <rdf:RDF>
      <cc:Work
         rdf:about="">
        <cc:license
           rdf:resource="http://creativecommons.org/licenses/by-sa/4.0/" />
        <dc:title>Aleta Postre</dc:title>
        <dc:format>image/svg+xml</dc:format>
        <dc:type
           rdf:resource="http://purl.org/dc/dcmitype/StillImage" />
      </cc:Work>
      <cc:License
         rdf:about="http://creativecommons.org/licenses/by-sa/4.0/">
        <cc:permits
           rdf:resource="http://creativecommons.org/ns#Reproduction" />
        <cc:permits
           rdf:resource="http://creativecommons.org/ns#Distribution" />
        <cc:requires
           rdf:resource="http://creativecommons.org/ns#Notice" />
        <cc:requires
           rdf:resource="http://creativecommons.org/ns#Attribution" />
        <cc:permits
           rdf:resource="http://creativecommons.org/ns#DerivativeWorks" />
        <cc:requires
           rdf:resource="http://creativecommons.org/ns#ShareAlike" />
      </cc:License>
    </rdf:RDF>
  </metadata>
  <g
     inkscape:label="background"
     inkscape:groupmode="layer"
     id="layer1"
     transform="translate(1.0008429,-1092.7725)"
     style="display:inline">
    <rect
       style="opacity:1;fill:url(#linearGradient8465);fill-opacity:1;stroke:none;stroke-width:2;paint-order:markers stroke fill"
       id="rect7796"
       width="28"
       height="28.000038"
       x="0.99915707"
       y="1094.7725"
       ry="4.0000391" />
    <path
       id="rect7982"
       style="opacity:0.3;fill:#ffffff;fill-opacity:1;stroke-width:2;paint-order:markers stroke fill"
       d="M 6,2 C 3.7839783,2 2,3.7839783 2,6 V 7 C 2,4.7839783 3.7839783,3 6,3 h 20 c 2.216022,0 4,1.7839783 4,4 V 6 C 30,3.7839783 28.216022,2 26,2 Z"
       transform="translate(-1.0008429,1092.7725)"
       sodipodi:nodetypes="sscsscsss"
       inkscape:transform-center-y="-11.5" />
    <path
       id="path8382"
       style="opacity:0.3;fill:#000000;fill-opacity:1;stroke-width:2;paint-order:markers stroke fill"
       d="m 4.9991571,1122.7725 c -2.2160217,0 -4,-1.784 -4,-4 v -1 c 0,2.216 1.7839783,4 4,4 H 24.999157 c 2.216022,0 4,-1.784 4,-4 v 1 c 0,2.216 -1.783978,4 -4,4 z"
       sodipodi:nodetypes="sscsscsss"
       inkscape:transform-center-y="11.5" />
  </g>
  <g
     inkscape:groupmode="layer"
     id="layer3"
     inkscape:label="hint"
     style="display:none;opacity:0.962927"
     transform="translate(1.0008429,1.0005)"
     sodipodi:insensitive="true">
    <rect
       style="opacity:0.2;fill:#000000;stroke-width:2;paint-order:markers stroke fill"
       id="rect6364"
       width="16"
       height="16"
       x="6.999157"
       y="6.9994998"
       ry="0" />
  </g>
  <g
     inkscape:groupmode="layer"
     id="layer2"
     inkscape:label="foreground"
     transform="translate(1.0008429,1.0005)"
     style="display:inline">
    <g
       id="g11995"
       transform="translate(5.4687111e-8,-1)">
      <path
         id="rect1206"
         style="opacity:0.35;fill:#ffffff;stroke-width:1.2;stroke-linecap:square;stroke-linejoin:round;stroke-opacity:0.618642"
         d="m 8.5,19.126953 -0.5,0.5 V 22.5 C 8,22.777 8.223,23 8.5,23 H 9 v 0.5 C 9,23.777 9.223,24 9.5,24 h 13 C 22.777,24 23,23.777 23,23.5 V 23 h 0.5 c 0.277,0 0.5,-0.223 0.5,-0.5 v -2.873047 l -0.5,-0.5 z"
         transform="translate(-1.0008429,-1.0005)" />
      <path
         id="path9743"
         style="color:#000000;opacity:0.75;fill:#ffffff;stroke-width:2;stroke-linecap:square;stroke-linejoin:round;-inkscape-stroke:none"
         d="M 10.416016,10.837891 8.5546875,19.3125 23.399127,19.318014 21.526538,10.687716 Z M 12.011719,11 c 2.658195,0 5.316433,-0.0026 7.974609,0.002 l 1.498047,1.361328 0.0332,0.179688 L 22,15 c 0,1.178813 -0.751262,2.201265 -1.84375,2.896484 C 19.063762,18.591704 17.60476,19 16,19 H 9.1347656 L 10.53125,12.332031 Z"
         transform="translate(-1.0008429,-1.0005)"
         sodipodi:nodetypes="ccccccccccssccc" />
      <path
         id="path3524"
         style="opacity:0.6;fill:#ffffff;fill-opacity:1;stroke:none;stroke-width:1.76955;stroke-linecap:square;stroke-linejoin:round;stroke-miterlimit:4;stroke-dasharray:none;stroke-opacity:0.618642"
         d="m 10.785156,16.884766 c -0.06462,-5e-6 -0.129178,0.0026 -0.193359,0.0078 l -0.119141,0.570313 c 0.197173,0.03292 0.421492,-0.0031 0.589844,0.08203 0.180103,0.09104 0.347708,0.212484 0.472656,0.398437 0.0113,0.01677 -4.44e-4,0.04621 0.0098,0.06445 0.302104,-5.89e-4 0.603981,-0.0012 0.90625,-0.002 -0.03053,-0.62507 -0.767322,-1.120871 -1.666016,-1.121093 z"
         transform="translate(-1.0008429,-1.0005)"
         sodipodi:nodetypes="cccscccc" />
      <path
         id="path3183"
         style="color:#000000;fill:#ffffff;fill-opacity:1;stroke-linecap:square;stroke-linejoin:round;-inkscape-stroke:none"
         d="M 9.4620481,8.9995 A 0.57293323,0.57293323 0 0 0 8.9015009,9.454578 L 6.9991571,18.544422 A 0.37809842,0.37809842 0 0 0 7.3682977,18.9995 H 22.630016 a 0.37809846,0.37809846 0 0 0 0.369141,-0.455078 L 21.096813,9.454578 A 0.57293317,0.57293317 0 0 0 20.536266,8.9995 Z m 0.347656,1 H 20.186657 l 1.675781,8 H 8.1339227 Z" />
      <rect
         style="fill:#ffffff;stroke-width:1.2;stroke-linecap:square;stroke-linejoin:round;stroke-opacity:0.618642"
         id="rect1530"
         width="0.99999988"
         height="1.0000002"
         x="20.999157"
         y="19.9995" />
      <rect
         style="fill:#ffffff;stroke-width:1.2;stroke-linecap:square;stroke-linejoin:round;stroke-opacity:0.618642"
         id="rect1554"
         width="2.0000002"
         height="0.9999997"
         x="17.999157"
         y="19.9995" />
      <rect
         style="fill:#ffffff;stroke-width:1.2;stroke-linecap:square;stroke-linejoin:round;stroke-opacity:0.618642"
         id="rect1556"
         width="1"
         height="1"
         x="15.999158"
         y="19.9995" />
      <rect
         style="fill:#ffffff;stroke-width:1.2;stroke-linecap:square;stroke-linejoin:round;stroke-opacity:0.618642"
         id="rect1558"
         width="1"
         height="1"
         x="13.999158"
         y="19.9995" />
      <path
         id="path1582"
         style="opacity:0.8;fill:#ffffff;stroke-width:1.09545;stroke-linecap:square;stroke-linejoin:round;stroke-opacity:0.618642"
         d="m 16,12 a 5,3.0000002 0 0 0 -3.535156,0.878906 l 7.070312,4.242188 A 5,3.0000002 0 0 0 21,15 5,3.0000002 0 0 0 16,12 Z"
         transform="translate(-1.0008429,-1.0005)" />
      <path
         id="path1878"
         style="opacity:0.6;fill:#ffffff;stroke-width:1.01419;stroke-linecap:square;stroke-linejoin:round;stroke-opacity:0.618642"
         d="m 14.999157,13.9995 c -1.224273,1 -0.61086,2 0,3 1.326006,-1.2e-4 2.597629,-0.31627 3.535157,-0.878907 z"
         sodipodi:nodetypes="cccc" />
      <path
         id="path2202"
         style="opacity:0.4;fill:#ffffff;stroke-width:1.01419;stroke-linecap:square;stroke-linejoin:round;stroke-opacity:0.618642"
         d="m 11.464001,11.878407 c -0.937728,0.562516 -1.4646438,1.32549 -1.4648438,2.121093 1.4335578,0.968645 4.1299798,0.414295 4.9999998,0 z"
         sodipodi:nodetypes="cccc" />
      <path
         id="rect1705"
         style="fill:#ffffff;stroke-width:2.77746;stroke-linecap:square;stroke-linejoin:round;stroke-opacity:0.618642"
         d="m 9.9991572,13.9995 a 4.9999999,3.0000002 0 0 0 4.9999998,3 v -3 z" />
      <path
         id="path3723"
         style="color:#000000;opacity:0.5;fill:#ffffff;fill-opacity:0.618642;stroke-linecap:square;-inkscape-stroke:none"
         d="M 12.011719,11 10.53125,12.332031 9.1347656,19 H 16 c 1.60476,0 3.063762,-0.408296 4.15625,-1.103516 C 21.248738,17.201265 22,16.178813 22,15 L 21.688534,12.541188 21.484068,12.362459 19.986329,11.001953 C 17.328153,10.997374 14.669914,11 12.011719,11 Z m 0.386719,1 c 2.443255,1.4e-5 4.71957,-3.6e-5 7.201171,0 l 0.970703,0.871094 C 20.736528,13.687062 20.97407,14.285015 21,15 21,15.754182 20.517259,16.481204 19.619141,17.052734 18.721022,17.624264 17.432802,18 16,18 c -1.481915,-0.0018 -2.969952,0.0049 -4.455078,0.0078 -0.01021,-0.01824 0.0015,-0.04768 -0.0098,-0.06445 -0.124948,-0.185953 -0.292553,-0.307393 -0.472656,-0.398437 -0.168352,-0.0851 -0.392671,-0.04911 -0.589844,-0.08203 L 11.43356,12.86718 Z"
         transform="translate(-1.0008429,-1.0005)"
         sodipodi:nodetypes="cccsscccccccccscccsccc" />
    </g>
  </g>
</svg>
