#! /usr/local/bin/vvp
:ivl_version "0.10.0 (devel)" "(s20150513)";
:ivl_delay_selection "TYPICAL";
:vpi_time_precision + 0;
:vpi_module "system";
:vpi_module "vhdl_sys";
:vpi_module "v2005_math";
:vpi_module "va_math";
S_0x56150b1d9390 .scope module, "ram_interact" "ram_interact" 2 108;
 .timescale 0 0;
    .port_info 0 /INPUT 32 "data"
    .port_info 1 /INPUT 8 "address"
    .port_info 2 /INPUT 1 "w_r"
    .port_info 3 /INPUT 1 "enable"
    .port_info 4 /INPUT 2 "mode"
    .port_info 5 /OUTPUT 1 "MOC"
    .port_info 6 /OUTPUT 32 "data_output"
v0x56150b1f9a20_0 .net "MOC", 0 0, v0x56150b1d97f0_0;  1 drivers
o0x7ff5516f3048 .functor BUFZ 8, C4<zzzzzzzz>; HiZ drive
v0x56150b1f9ae0_0 .net "address", 7 0, o0x7ff5516f3048;  0 drivers
v0x56150b1f9bb0_0 .var "addresser", 7 0;
o0x7ff5516f3078 .functor BUFZ 32, C4<zzzzzzzzzzzzzzzzzzzzzzzzzzzzzzzz>; HiZ drive
v0x56150b1f9c80_0 .net "data", 31 0, o0x7ff5516f3078;  0 drivers
v0x56150b1f9d70_0 .var "data_in", 7 0;
v0x56150b1f9e80_0 .net "data_output", 31 0, v0x56150b1f95b0_0;  1 drivers
o0x7ff5516f30a8 .functor BUFZ 1, C4<z>; HiZ drive
v0x56150b1f9f40_0 .net "enable", 0 0, o0x7ff5516f30a8;  0 drivers
v0x56150b1fa010_0 .var/i "file_in", 31 0;
v0x56150b1fa0b0_0 .var/i "file_status", 31 0;
o0x7ff5516f3108 .functor BUFZ 2, C4<zz>; HiZ drive
v0x56150b1fa190_0 .net "mode", 1 0, o0x7ff5516f3108;  0 drivers
o0x7ff5516f3138 .functor BUFZ 1, C4<z>; HiZ drive
v0x56150b1fa280_0 .net "w_r", 0 0, o0x7ff5516f3138;  0 drivers
S_0x56150b1d95c0 .scope module, "ram" "ram_256_b" 2 118, 2 8 0, S_0x56150b1d9390;
 .timescale 0 0;
    .port_info 0 /INPUT 32 "data_input"
    .port_info 1 /INPUT 8 "address"
    .port_info 2 /INPUT 1 "w_r_mode"
    .port_info 3 /INPUT 1 "enable"
    .port_info 4 /INPUT 2 "op_code"
    .port_info 5 /OUTPUT 1 "MOC"
    .port_info 6 /OUTPUT 32 "mem"
v0x56150b1d97f0_0 .var "MOC", 0 0;
v0x56150b1f9350_0 .net "address", 7 0, o0x7ff5516f3048;  alias, 0 drivers
v0x56150b1f9430_0 .net "data_input", 31 0, o0x7ff5516f3078;  alias, 0 drivers
v0x56150b1f94f0_0 .net "enable", 0 0, o0x7ff5516f30a8;  alias, 0 drivers
v0x56150b1f95b0_0 .var "mem", 31 0;
v0x56150b1f96e0_0 .net "op_code", 1 0, o0x7ff5516f3108;  alias, 0 drivers
v0x56150b1f97c0 .array "storage", 255 0, 7 0;
v0x56150b1f9880_0 .net "w_r_mode", 0 0, o0x7ff5516f3138;  alias, 0 drivers
E_0x56150b1c46d0/0 .event edge, v0x56150b1f9350_0, v0x56150b1f9880_0;
E_0x56150b1c46d0/1 .event posedge, v0x56150b1f94f0_0;
E_0x56150b1c46d0 .event/or E_0x56150b1c46d0/0, E_0x56150b1c46d0/1;
    .scope S_0x56150b1d95c0;
T_0 ;
    %wait E_0x56150b1c46d0;
    %load/vec4 v0x56150b1f94f0_0;
    %flag_set/vec4 8;
    %jmp/0xz  T_0.0, 8;
    %pushi/vec4 0, 0, 1;
    %assign/vec4 v0x56150b1d97f0_0, 0;
    %load/vec4 v0x56150b1f9880_0;
    %flag_set/vec4 8;
    %jmp/0xz  T_0.2, 8;
    %load/vec4 v0x56150b1f96e0_0;
    %dup/vec4;
    %pushi/vec4 0, 0, 2;
    %cmp/u;
    %jmp/1 T_0.4, 6;
    %dup/vec4;
    %pushi/vec4 1, 0, 2;
    %cmp/u;
    %jmp/1 T_0.5, 6;
    %dup/vec4;
    %pushi/vec4 2, 0, 2;
    %cmp/u;
    %jmp/1 T_0.6, 6;
    %jmp T_0.7;
T_0.4 ;
    %load/vec4 v0x56150b1f9350_0;
    %pad/u 10;
    %ix/vec4 4;
    %load/vec4a v0x56150b1f97c0, 4;
    %ix/load 4, 0, 0;
    %ix/load 5, 0, 0;
    %flag_set/imm 4, 0;
    %assign/vec4/off/d v0x56150b1f95b0_0, 4, 5;
    %pushi/vec4 0, 0, 24;
    %ix/load 4, 8, 0;
    %ix/load 5, 0, 0;
    %flag_set/imm 4, 0;
    %assign/vec4/off/d v0x56150b1f95b0_0, 4, 5;
    %jmp T_0.7;
T_0.5 ;
    %load/vec4 v0x56150b1f9350_0;
    %pad/u 10;
    %ix/vec4 4;
    %load/vec4a v0x56150b1f97c0, 4;
    %ix/load 4, 8, 0;
    %ix/load 5, 0, 0;
    %flag_set/imm 4, 0;
    %assign/vec4/off/d v0x56150b1f95b0_0, 4, 5;
    %load/vec4 v0x56150b1f9350_0;
    %pad/u 33;
    %addi 1, 0, 33;
    %ix/vec4 4;
    %load/vec4a v0x56150b1f97c0, 4;
    %ix/load 4, 0, 0;
    %ix/load 5, 0, 0;
    %flag_set/imm 4, 0;
    %assign/vec4/off/d v0x56150b1f95b0_0, 4, 5;
    %pushi/vec4 0, 0, 16;
    %ix/load 4, 16, 0;
    %ix/load 5, 0, 0;
    %flag_set/imm 4, 0;
    %assign/vec4/off/d v0x56150b1f95b0_0, 4, 5;
    %jmp T_0.7;
T_0.6 ;
    %load/vec4 v0x56150b1f9350_0;
    %pad/u 10;
    %ix/vec4 4;
    %load/vec4a v0x56150b1f97c0, 4;
    %ix/load 4, 24, 0;
    %ix/load 5, 0, 0;
    %flag_set/imm 4, 0;
    %assign/vec4/off/d v0x56150b1f95b0_0, 4, 5;
    %load/vec4 v0x56150b1f9350_0;
    %pad/u 33;
    %addi 1, 0, 33;
    %ix/vec4 4;
    %load/vec4a v0x56150b1f97c0, 4;
    %ix/load 4, 16, 0;
    %ix/load 5, 0, 0;
    %flag_set/imm 4, 0;
    %assign/vec4/off/d v0x56150b1f95b0_0, 4, 5;
    %load/vec4 v0x56150b1f9350_0;
    %pad/u 33;
    %addi 2, 0, 33;
    %ix/vec4 4;
    %load/vec4a v0x56150b1f97c0, 4;
    %ix/load 4, 8, 0;
    %ix/load 5, 0, 0;
    %flag_set/imm 4, 0;
    %assign/vec4/off/d v0x56150b1f95b0_0, 4, 5;
    %load/vec4 v0x56150b1f9350_0;
    %pad/u 33;
    %addi 3, 0, 33;
    %ix/vec4 4;
    %load/vec4a v0x56150b1f97c0, 4;
    %ix/load 4, 0, 0;
    %ix/load 5, 0, 0;
    %flag_set/imm 4, 0;
    %assign/vec4/off/d v0x56150b1f95b0_0, 4, 5;
    %jmp T_0.7;
T_0.7 ;
    %pop/vec4 1;
    %pushi/vec4 1, 0, 1;
    %assign/vec4 v0x56150b1d97f0_0, 0;
    %jmp T_0.3;
T_0.2 ;
    %pushi/vec4 0, 0, 1;
    %assign/vec4 v0x56150b1d97f0_0, 0;
    %load/vec4 v0x56150b1f96e0_0;
    %dup/vec4;
    %pushi/vec4 0, 0, 2;
    %cmp/u;
    %jmp/1 T_0.8, 6;
    %dup/vec4;
    %pushi/vec4 1, 0, 2;
    %cmp/u;
    %jmp/1 T_0.9, 6;
    %dup/vec4;
    %pushi/vec4 2, 0, 2;
    %cmp/u;
    %jmp/1 T_0.10, 6;
    %jmp T_0.11;
T_0.8 ;
    %load/vec4 v0x56150b1f9430_0;
    %parti/s 8, 0, 2;
    %load/vec4 v0x56150b1f9350_0;
    %pad/u 10;
    %ix/vec4 3;
    %ix/load 4, 0, 0; Constant delay
    %assign/vec4/a/d v0x56150b1f97c0, 0, 4;
    %jmp T_0.11;
T_0.9 ;
    %load/vec4 v0x56150b1f9430_0;
    %parti/s 8, 8, 5;
    %load/vec4 v0x56150b1f9350_0;
    %pad/u 10;
    %ix/vec4 3;
    %ix/load 4, 0, 0; Constant delay
    %assign/vec4/a/d v0x56150b1f97c0, 0, 4;
    %load/vec4 v0x56150b1f9430_0;
    %parti/s 8, 0, 2;
    %load/vec4 v0x56150b1f9350_0;
    %pad/u 33;
    %addi 1, 0, 33;
    %ix/vec4 3;
    %ix/load 4, 0, 0; Constant delay
    %assign/vec4/a/d v0x56150b1f97c0, 0, 4;
    %jmp T_0.11;
T_0.10 ;
    %load/vec4 v0x56150b1f9430_0;
    %parti/s 8, 24, 6;
    %load/vec4 v0x56150b1f9350_0;
    %pad/u 10;
    %ix/vec4 3;
    %ix/load 4, 0, 0; Constant delay
    %assign/vec4/a/d v0x56150b1f97c0, 0, 4;
    %load/vec4 v0x56150b1f9430_0;
    %parti/s 8, 16, 6;
    %load/vec4 v0x56150b1f9350_0;
    %pad/u 33;
    %addi 1, 0, 33;
    %ix/vec4 3;
    %ix/load 4, 0, 0; Constant delay
    %assign/vec4/a/d v0x56150b1f97c0, 0, 4;
    %load/vec4 v0x56150b1f9430_0;
    %parti/s 8, 8, 5;
    %load/vec4 v0x56150b1f9350_0;
    %pad/u 33;
    %addi 2, 0, 33;
    %ix/vec4 3;
    %ix/load 4, 0, 0; Constant delay
    %assign/vec4/a/d v0x56150b1f97c0, 0, 4;
    %load/vec4 v0x56150b1f9430_0;
    %parti/s 8, 0, 2;
    %load/vec4 v0x56150b1f9350_0;
    %pad/u 33;
    %addi 3, 0, 33;
    %ix/vec4 3;
    %ix/load 4, 0, 0; Constant delay
    %assign/vec4/a/d v0x56150b1f97c0, 0, 4;
    %jmp T_0.11;
T_0.11 ;
    %pop/vec4 1;
    %pushi/vec4 1, 0, 1;
    %assign/vec4 v0x56150b1d97f0_0, 0;
T_0.3 ;
T_0.0 ;
    %pushi/vec4 1, 0, 1;
    %assign/vec4 v0x56150b1d97f0_0, 0;
    %jmp T_0;
    .thread T_0;
    .scope S_0x56150b1d9390;
T_1 ;
    %vpi_func 2 121 "$fopen" 32, "data_bin.txt", "rb" {0 0 0};
    %store/vec4 v0x56150b1fa010_0, 0, 32;
    %pushi/vec4 0, 0, 8;
    %store/vec4 v0x56150b1f9bb0_0, 0, 8;
T_1.0 ;
    %vpi_func 2 126 "$feof" 32, v0x56150b1fa010_0 {0 0 0};
    %nor/r;
    %flag_set/vec4 8;
    %jmp/0xz T_1.1, 8;
    %vpi_func 2 127 "$fscanf" 32, v0x56150b1fa010_0, "%b", v0x56150b1f9d70_0 {0 0 0};
    %store/vec4 v0x56150b1fa0b0_0, 0, 32;
    %load/vec4 v0x56150b1f9d70_0;
    %load/vec4 v0x56150b1f9bb0_0;
    %pad/u 10;
    %ix/vec4 4;
    %store/vec4a v0x56150b1f97c0, 4, 0;
    %load/vec4 v0x56150b1f9bb0_0;
    %addi 1, 0, 8;
    %store/vec4 v0x56150b1f9bb0_0, 0, 8;
    %jmp T_1.0;
T_1.1 ;
    %vpi_call 2 134 "$fclose", v0x56150b1fa010_0 {0 0 0};
    %end;
    .thread T_1;
# The file index is used to find the file name in the following table.
:file_names 3;
    "N/A";
    "<interactive>";
    "RAM.v";
