#! /usr/local/bin/vvp
:ivl_version "0.10.0 (devel)" "(s20150513)";
:ivl_delay_selection "TYPICAL";
:vpi_time_precision + 0;
:vpi_module "system";
:vpi_module "vhdl_sys";
:vpi_module "v2005_math";
:vpi_module "va_math";
S_0x55d393cc2880 .scope module, "IR" "IR" 2 1;
 .timescale 0 0;
    .port_info 0 /INPUT 32 "Ds"
    .port_info 1 /INPUT 1 "Ld"
    .port_info 2 /INPUT 1 "Clk"
    .port_info 3 /OUTPUT 32 "Qs"
o0x7fe5f20d2018 .functor BUFZ 1, C4<z>; HiZ drive
v0x55d393cc2a90_0 .net "Clk", 0 0, o0x7fe5f20d2018;  0 drivers
o0x7fe5f20d2048 .functor BUFZ 32, C4<zzzzzzzzzzzzzzzzzzzzzzzzzzzzzzzz>; HiZ drive
v0x55d393ce2b70_0 .net "Ds", 31 0, o0x7fe5f20d2048;  0 drivers
o0x7fe5f20d2078 .functor BUFZ 1, C4<z>; HiZ drive
v0x55d393ce2c50_0 .net "Ld", 0 0, o0x7fe5f20d2078;  0 drivers
v0x55d393ce2d20_0 .var "Qs", 31 0;
E_0x55d393c8b870/0 .event edge, v0x55d393ce2c50_0;
E_0x55d393c8b870/1 .event posedge, v0x55d393cc2a90_0;
E_0x55d393c8b870 .event/or E_0x55d393c8b870/0, E_0x55d393c8b870/1;
    .scope S_0x55d393cc2880;
T_0 ;
    %pushi/vec4 0, 0, 32;
    %assign/vec4 v0x55d393ce2d20_0, 0;
    %end;
    .thread T_0;
    .scope S_0x55d393cc2880;
T_1 ;
    %wait E_0x55d393c8b870;
    %load/vec4 v0x55d393ce2c50_0;
    %flag_set/vec4 8;
    %jmp/0xz  T_1.0, 8;
    %load/vec4 v0x55d393ce2b70_0;
    %assign/vec4 v0x55d393ce2d20_0, 0;
    %vpi_call 2 9 "$display", "IReg  IR: %b", v0x55d393ce2d20_0 {0 0 0};
T_1.0 ;
    %jmp T_1;
    .thread T_1;
# The file index is used to find the file name in the following table.
:file_names 3;
    "N/A";
    "<interactive>";
    "InstructionRegister.v";
