{
  "config": {
    "adminName": "Pablo Sande Pena",
    "permissions": [
      "hollywood"
    ]
  },
  "hollywood": [
    {
      "id": 1,
      "layout": "grid2",
      "style": "dark",
      "name": "Employees Travels",
      "charts": [
        {
          "chart": {
            "type": "line"
          },
          "title": {
            "text": "Widget 1"
          },
          "credits": {
            "enabled": false
          },
          "series": [
            {
              "name": "COLUMNS SERIE",
              "type": "area",
              "data": [
                23,
                27,
                6,
                99,
                41,
                71,
                99,
                29,
                31,
                71,
                76,
                19,
                27,
                58,
                89,
                61,
                67,
                90,
                90,
                13
              ]
            }
          ]
        },
        {
          "chart": {
            "type": "line"
          },
          "title": {
            "text": "Widget 1"
          },
          "credits": {
            "enabled": false
          },
          "series": [
            {
              "name": "AREAS SERIE",
              "type": "areaspline",
              "data": [
                85,
                27,
                71,
                30,
                13,
                14,
                6,
                68,
                52,
                38,
                70,
                3,
                46,
                76,
                35,
                95,
                63,
                45,
                17,
                72
              ]
            }
          ]
        },
        {
          "chart": {
            "type": "line"
          },
          "title": {
            "text": "Widget 2"
          },
          "credits": {
            "enabled": false
          },
          "series": [
            {
              "name": "LINES SERIE",
              "type": "line",
              "data": [
                53,
                50,
                56,
                93,
                62,
                21,
                45,
                69,
                90,
                75,
                7,
                65,
                69,
                99,
                41,
                43,
                85,
                99,
                58,
                65
              ]
            }
          ]
        },
        {
          "chart": {
            "type": "line"
          },
          "title": {
            "text": "Widget 3"
          },
          "credits": {
            "enabled": false
          },
          "series": [
            {
              "name": "SPLINES SERIE",
              "type": "column",
              "data": [
                70,
                38,
                51,
                99,
                78,
                78,
                72,
                12,
                50,
                42,
                83,
                51,
                88,
                4,
                76,
                63,
                99,
                36,
                25,
                11
              ]
            }
          ]
        }
      ]
    },
    {
      "id": 2,
      "layout": "grid1",
      "style": "light",
      "name": "Insurances",
      "charts": [
        {
          "chart": {
            "type": "line"
          },
          "title": {
            "text": "Widget 1"
          },
          "credits": {
            "enabled": false
          },
          "series": [
            {
              "name": "SPLINES SERIE",
              "type": "line",
              "data": [
                27,
                78,
                71,
                97,
                89,
                72,
                22,
                94,
                42,
                10,
                17,
                79,
                94,
                34,
                56,
                61,
                35,
                87,
                34,
                49
              ]
            }
          ]
        },
        {
          "chart": {
            "type": "line"
          },
          "title": {
            "text": "Widget 1"
          },
          "credits": {
            "enabled": false
          },
          "series": [
            {
              "name": "SPLINES SERIE",
              "type": "line",
              "data": [
                26,
                3,
                87,
                23,
                36,
                17,
                78,
                55,
                55,
                23,
                83,
                10,
                42,
                57,
                28,
                40,
                22,
                83,
                16,
                74
              ]
            }
          ]
        },
        {
          "chart": {
            "type": "line"
          },
          "title": {
            "text": "Widget 2"
          },
          "credits": {
            "enabled": false
          },
          "series": [
            {
              "name": "AREASPLINES SERIE",
              "type": "spline",
              "data": [
                26,
                32,
                11,
                95,
                65,
                96,
                50,
                69,
                20,
                4,
                2,
                24,
                18,
                82,
                84,
                43,
                20,
                88,
                81,
                100
              ]
            }
          ]
        },
        {
          "chart": {
            "type": "line"
          },
          "title": {
            "text": "Widget 3"
          },
          "credits": {
            "enabled": false
          },
          "series": [
            {
              "name": "LINES SERIE",
              "type": "spline",
              "data": [
                87,
                56,
                83,
                96,
                71,
                80,
                97,
                21,
                72,
                75,
                81,
                37,
                81,
                80,
                67,
                73,
                15,
                67,
                78,
                84
              ]
            }
          ]
        },
        {
          "chart": {
            "type": "line"
          },
          "title": {
            "text": "Widget 4"
          },
          "credits": {
            "enabled": false
          },
          "series": [
            {
              "name": "AREASPLINES SERIE",
              "type": "spline",
              "data": [
                46,
                46,
                95,
                12,
                84,
                31,
                15,
                73,
                55,
                20,
                73,
                61,
                9,
                26,
                62,
                75,
                96,
                71,
                2,
                82
              ]
            }
          ]
        },
        {
          "chart": {
            "type": "line"
          },
          "title": {
            "text": "Widget 5"
          },
          "credits": {
            "enabled": false
          },
          "series": [
            {
              "name": "SPLINES SERIE",
              "type": "column",
              "data": [
                80,
                82,
                75,
                71,
                17,
                28,
                75,
                56,
                85,
                9,
                45,
                75,
                3,
                36,
                92,
                5,
                50,
                43,
                82,
                40
              ]
            }
          ]
        }
      ]
    },
    {
      "id": 3,
      "layout": "grid2",
      "style": "light",
      "name": "Retail",
      "charts": [
        {
          "chart": {
            "type": "line"
          },
          "title": {
            "text": "Widget 1"
          },
          "credits": {
            "enabled": false
          },
          "series": [
            {
              "name": "SPLINES SERIE",
              "type": "column",
              "data": [
                21,
                72,
                47,
                67,
                94,
                57,
                92,
                28,
                24,
                44,
                87,
                67,
                33,
                32,
                42,
                97,
                96,
                27,
                56,
                82
              ]
            }
          ]
        },
        {
          "chart": {
            "type": "line"
          },
          "title": {
            "text": "Widget 1"
          },
          "credits": {
            "enabled": false
          },
          "series": [
            {
              "name": "SPLINES SERIE",
              "type": "area",
              "data": [
                8,
                62,
                39,
                37,
                40,
                37,
                38,
                43,
                14,
                87,
                30,
                49,
                48,
                82,
                70,
                76,
                30,
                3,
                33,
                81
              ]
            }
          ]
        }
      ]
    }
  ]
}