{
  "name": "",
  "css_prefix_text": "icon-",
  "css_use_suffix": false,
  "hinting": true,
  "units_per_em": 1000,
  "ascent": 850,
  "glyphs": [
    {
      "uid": "b49fa3e57e92b38143e0fdcc5d9a904b",
      "css": "gmail",
      "code": 59393,
      "src": "zocial"
    },
    {
      "uid": "d090355c31f497b61d676416c1fd39fb",
      "css": "twitter",
      "code": 62217,
      "src": "entypo"
    },
    {
      "uid": "ce1d525f3f31024c6a6b38f5e9a88953",
      "css": "facebook-circled",
      "code": 62221,
      "src": "entypo"
    },
    {
      "uid": "a9862b9d5197886c1ad693ecd7120b31",
      "css": "youtube",
      "code": 61799,
      "src": "fontawesome"
    }
  ]
}