PRAGMA foreign_keys=OFF;
BEGIN TRANSACTION;
CREATE TABLE CONFIG (KEYSTRING TEXT UNIQUE NOT NULL, VALUESTRING TEXT, STATIC INTEGER DEFAULT 0, OPTIONAL INTEGER DEFAULT 0, COMMENTS TEXT DEFAULT '');
INSERT INTO "CONFIG" VALUES('Log.Level','NOTICE',0,1,'Default logging level when no other level is defined for a file.');
COMMIT;
