module github.com/a2n/foo

go 1.17

require (
	gorm.io/driver/mysql v1.1.3
	gorm.io/gorm v1.22.2
)

require (
	github.com/go-sql-driver/mysql v1.6.0 // indirect
	github.com/jinzhu/inflection v1.0.0 // indirect
	github.com/jinzhu/now v1.1.2 // indirect
)
