{
  "message": "L'explication de l'aigle apparait en double, une fois pour chaque case qui voit les 2 serres",
  "gridI"  : [
    {
      "value"     : null,
      "kumiKata"  : [true, true, true, true, true, true, true, true, true],
      "lockedKata": [false, false, false, false, false, false, false, false, false],
      "effect"    : null,
      "annotation": ""
    }, {
      "value"     : null,
      "kumiKata"  : [true, true, true, true, true, true, true, true, true],
      "lockedKata": [false, false, false, false, false, false, false, false, false],
      "effect"    : null,
      "annotation": ""
    }, {
      "value"     : null,
      "kumiKata"  : [true, true, true, true, true, true, true, true, true],
      "lockedKata": [false, false, false, false, false, false, false, false, false],
      "effect"    : null,
      "annotation": ""
    }, {
      "value"     : 8,
      "kumiKata"  : [true, true, true, true, true, true, true, true, true],
      "lockedKata": [false, false, false, false, false, false, false, false, false],
      "effect"    : null,
      "annotation": ""
    }, {
      "value"     : 0,
      "kumiKata"  : [true, true, true, true, true, true, true, true, true],
      "lockedKata": [false, false, false, false, false, false, false, false, false],
      "effect"    : null,
      "annotation": ""
    }, {
      "value"     : 4,
      "kumiKata"  : [true, true, true, true, true, true, true, true, true],
      "lockedKata": [false, false, false, false, false, false, false, false, false],
      "effect"    : null,
      "annotation": ""
    }, {
      "value"     : null,
      "kumiKata"  : [true, true, true, true, true, true, true, true, true],
      "lockedKata": [false, false, false, false, false, false, false, false, false],
      "effect"    : null,
      "annotation": ""
    }, {
      "value"     : null,
      "kumiKata"  : [true, true, true, true, true, true, true, true, true],
      "lockedKata": [false, false, false, false, false, false, false, false, false],
      "effect"    : null,
      "annotation": ""
    }, {
      "value"     : null,
      "kumiKata"  : [true, true, true, true, true, true, true, true, true],
      "lockedKata": [false, false, false, false, false, false, false, false, false],
      "effect"    : null,
      "annotation": ""
    }, {
      "value"     : null,
      "kumiKata"  : [true, true, true, true, true, true, true, true, true],
      "lockedKata": [false, false, false, false, false, false, false, false, false],
      "effect"    : null,
      "annotation": ""
    }, {
      "value"     : null,
      "kumiKata"  : [true, true, true, true, true, true, true, true, true],
      "lockedKata": [false, false, false, false, false, false, false, false, false],
      "effect"    : null,
      "annotation": ""
    }, {
      "value"     : 8,
      "kumiKata"  : [true, true, true, true, true, true, true, true, true],
      "lockedKata": [false, false, false, false, false, false, false, false, false],
      "effect"    : null,
      "annotation": ""
    }, {
      "value"     : null,
      "kumiKata"  : [true, true, true, true, true, true, true, true, true],
      "lockedKata": [false, false, false, false, false, false, false, false, false],
      "effect"    : null,
      "annotation": ""
    }, {
      "value"     : null,
      "kumiKata"  : [true, true, true, true, true, true, true, true, true],
      "lockedKata": [false, false, false, false, false, false, false, false, false],
      "effect"    : null,
      "annotation": ""
    }, {
      "value"     : null,
      "kumiKata"  : [true, true, true, true, true, true, true, true, true],
      "lockedKata": [false, false, false, false, false, false, false, false, false],
      "effect"    : null,
      "annotation": ""
    }, {
      "value"     : 2,
      "kumiKata"  : [true, true, true, true, true, true, true, true, true],
      "lockedKata": [false, false, false, false, false, false, false, false, false],
      "effect"    : null,
      "annotation": ""
    }, {
      "value"     : null,
      "kumiKata"  : [true, true, true, true, true, true, true, true, true],
      "lockedKata": [false, false, false, false, false, false, false, false, false],
      "effect"    : null,
      "annotation": ""
    }, {
      "value"     : null,
      "kumiKata"  : [true, true, true, true, true, true, true, true, true],
      "lockedKata": [false, false, false, false, false, false, false, false, false],
      "effect"    : null,
      "annotation": ""
    }, {
      "value"     : null,
      "kumiKata"  : [true, true, true, true, true, true, true, true, true],
      "lockedKata": [false, false, false, false, false, false, false, false, false],
      "effect"    : null,
      "annotation": ""
    }, {
      "value"     : null,
      "kumiKata"  : [true, true, true, true, true, true, true, true, true],
      "lockedKata": [false, false, false, false, false, false, false, false, false],
      "effect"    : null,
      "annotation": ""
    }, {
      "value"     : 1,
      "kumiKata"  : [true, true, true, true, true, true, true, true, true],
      "lockedKata": [false, false, false, false, false, false, false, false, false],
      "effect"    : null,
      "annotation": ""
    }, {
      "value"     : null,
      "kumiKata"  : [true, true, true, true, true, true, true, true, true],
      "lockedKata": [false, false, false, false, false, false, false, false, false],
      "effect"    : null,
      "annotation": ""
    }, {
      "value"     : null,
      "kumiKata"  : [true, true, true, true, true, true, true, true, true],
      "lockedKata": [false, false, false, false, false, false, false, false, false],
      "effect"    : null,
      "annotation": ""
    }, {
      "value"     : null,
      "kumiKata"  : [true, true, true, true, true, true, true, true, true],
      "lockedKata": [false, false, false, false, false, false, false, false, false],
      "effect"    : null,
      "annotation": ""
    }, {
      "value"     : 7,
      "kumiKata"  : [true, true, true, true, true, true, true, true, true],
      "lockedKata": [false, false, false, false, false, false, false, false, false],
      "effect"    : null,
      "annotation": ""
    }, {
      "value"     : null,
      "kumiKata"  : [true, true, true, true, true, true, true, true, true],
      "lockedKata": [false, false, false, false, false, false, false, false, false],
      "effect"    : null,
      "annotation": ""
    }, {
      "value"     : null,
      "kumiKata"  : [true, true, true, true, true, true, true, true, true],
      "lockedKata": [false, false, false, false, false, false, false, false, false],
      "effect"    : null,
      "annotation": ""
    }, {
      "value"     : null,
      "kumiKata"  : [true, true, true, true, true, true, true, true, true],
      "lockedKata": [false, false, false, false, false, false, false, false, false],
      "effect"    : null,
      "annotation": ""
    }, {
      "value"     : null,
      "kumiKata"  : [true, true, true, true, true, true, true, true, true],
      "lockedKata": [false, false, false, false, false, false, false, false, false],
      "effect"    : null,
      "annotation": ""
    }, {
      "value"     : null,
      "kumiKata"  : [true, true, true, true, true, true, true, true, true],
      "lockedKata": [false, false, false, false, false, false, false, false, false],
      "effect"    : null,
      "annotation": ""
    }, {
      "value"     : 3,
      "kumiKata"  : [true, true, true, true, true, true, true, true, true],
      "lockedKata": [false, false, false, false, false, false, false, false, false],
      "effect"    : null,
      "annotation": ""
    }, {
      "value"     : null,
      "kumiKata"  : [true, true, true, true, true, true, true, true, true],
      "lockedKata": [false, false, false, false, false, false, false, false, false],
      "effect"    : null,
      "annotation": ""
    }, {
      "value"     : 6,
      "kumiKata"  : [true, true, true, true, true, true, true, true, true],
      "lockedKata": [false, false, false, false, false, false, false, false, false],
      "effect"    : null,
      "annotation": ""
    }, {
      "value"     : null,
      "kumiKata"  : [true, true, true, true, true, true, true, true, true],
      "lockedKata": [false, false, false, false, false, false, false, false, false],
      "effect"    : null,
      "annotation": ""
    }, {
      "value"     : null,
      "kumiKata"  : [true, true, true, true, true, true, true, true, true],
      "lockedKata": [false, false, false, false, false, false, false, false, false],
      "effect"    : null,
      "annotation": ""
    }, {
      "value"     : null,
      "kumiKata"  : [true, true, true, true, true, true, true, true, true],
      "lockedKata": [false, false, false, false, false, false, false, false, false],
      "effect"    : null,
      "annotation": ""
    }, {
      "value"     : 5,
      "kumiKata"  : [true, true, true, true, true, true, true, true, true],
      "lockedKata": [false, false, false, false, false, false, false, false, false],
      "effect"    : null,
      "annotation": ""
    }, {
      "value"     : null,
      "kumiKata"  : [true, true, true, true, true, true, true, true, true],
      "lockedKata": [false, false, false, false, false, false, false, false, false],
      "effect"    : null,
      "annotation": ""
    }, {
      "value"     : null,
      "kumiKata"  : [true, true, true, true, true, true, true, true, true],
      "lockedKata": [false, false, false, false, false, false, false, false, false],
      "effect"    : null,
      "annotation": ""
    }, {
      "value"     : null,
      "kumiKata"  : [true, true, true, true, true, true, true, true, true],
      "lockedKata": [false, false, false, false, false, false, false, false, false],
      "effect"    : null,
      "annotation": ""
    }, {
      "value"     : 2,
      "kumiKata"  : [true, true, true, true, true, true, true, true, true],
      "lockedKata": [false, false, false, false, false, false, false, false, false],
      "effect"    : null,
      "annotation": ""
    }, {
      "value"     : null,
      "kumiKata"  : [true, true, true, true, true, true, true, true, true],
      "lockedKata": [false, false, false, false, false, false, false, false, false],
      "effect"    : null,
      "annotation": ""
    }, {
      "value"     : null,
      "kumiKata"  : [true, true, true, true, true, true, true, true, true],
      "lockedKata": [false, false, false, false, false, false, false, false, false],
      "effect"    : null,
      "annotation": ""
    }, {
      "value"     : null,
      "kumiKata"  : [true, true, true, true, true, true, true, true, true],
      "lockedKata": [false, false, false, false, false, false, false, false, false],
      "effect"    : null,
      "annotation": ""
    }, {
      "value"     : 6,
      "kumiKata"  : [true, true, true, true, true, true, true, true, true],
      "lockedKata": [false, false, false, false, false, false, false, false, false],
      "effect"    : null,
      "annotation": ""
    }, {
      "value"     : null,
      "kumiKata"  : [true, true, true, true, true, true, true, true, true],
      "lockedKata": [false, false, false, false, false, false, false, false, false],
      "effect"    : null,
      "annotation": ""
    }, {
      "value"     : 4,
      "kumiKata"  : [true, true, true, true, true, true, true, true, true],
      "lockedKata": [false, false, false, false, false, false, false, false, false],
      "effect"    : null,
      "annotation": ""
    }, {
      "value"     : null,
      "kumiKata"  : [true, true, true, true, true, true, true, true, true],
      "lockedKata": [false, false, false, false, false, false, false, false, false],
      "effect"    : null,
      "annotation": ""
    }, {
      "value"     : null,
      "kumiKata"  : [true, true, true, true, true, true, true, true, true],
      "lockedKata": [false, false, false, false, false, false, false, false, false],
      "effect"    : null,
      "annotation": ""
    }, {
      "value"     : null,
      "kumiKata"  : [true, true, true, true, true, true, true, true, true],
      "lockedKata": [false, false, false, false, false, false, false, false, false],
      "effect"    : null,
      "annotation": ""
    }, {
      "value"     : null,
      "kumiKata"  : [true, true, true, true, true, true, true, true, true],
      "lockedKata": [false, false, false, false, false, false, false, false, false],
      "effect"    : null,
      "annotation": ""
    }, {
      "value"     : null,
      "kumiKata"  : [true, true, true, true, true, true, true, true, true],
      "lockedKata": [false, false, false, false, false, false, false, false, false],
      "effect"    : null,
      "annotation": ""
    }, {
      "value"     : 7,
      "kumiKata"  : [true, true, true, true, true, true, true, true, true],
      "lockedKata": [false, false, false, false, false, false, false, false, false],
      "effect"    : null,
      "annotation": ""
    }, {
      "value"     : null,
      "kumiKata"  : [true, true, true, true, true, true, true, true, true],
      "lockedKata": [false, false, false, false, false, false, false, false, false],
      "effect"    : null,
      "annotation": ""
    }, {
      "value"     : null,
      "kumiKata"  : [true, true, true, true, true, true, true, true, true],
      "lockedKata": [false, false, false, false, false, false, false, false, false],
      "effect"    : null,
      "annotation": ""
    }, {
      "value"     : null,
      "kumiKata"  : [true, true, true, true, true, true, true, true, true],
      "lockedKata": [false, false, false, false, false, false, false, false, false],
      "effect"    : null,
      "annotation": ""
    }, {
      "value"     : 6,
      "kumiKata"  : [true, true, true, true, true, true, true, true, true],
      "lockedKata": [false, false, false, false, false, false, false, false, false],
      "effect"    : null,
      "annotation": ""
    }, {
      "value"     : 4,
      "kumiKata"  : [true, true, true, true, true, true, true, true, true],
      "lockedKata": [false, false, false, false, false, false, false, false, false],
      "effect"    : null,
      "annotation": ""
    }, {
      "value"     : null,
      "kumiKata"  : [true, true, true, true, true, true, true, true, true],
      "lockedKata": [false, false, false, false, false, false, false, false, false],
      "effect"    : null,
      "annotation": ""
    }, {
      "value"     : 8,
      "kumiKata"  : [true, true, true, true, true, true, true, true, true],
      "lockedKata": [false, false, false, false, false, false, false, false, false],
      "effect"    : null,
      "annotation": ""
    }, {
      "value"     : 3,
      "kumiKata"  : [true, true, true, true, true, true, true, true, true],
      "lockedKata": [false, false, false, false, false, false, false, false, false],
      "effect"    : null,
      "annotation": ""
    }, {
      "value"     : null,
      "kumiKata"  : [true, true, true, true, true, true, true, true, true],
      "lockedKata": [false, false, false, false, false, false, false, false, false],
      "effect"    : null,
      "annotation": ""
    }, {
      "value"     : null,
      "kumiKata"  : [true, true, true, true, true, true, true, true, true],
      "lockedKata": [false, false, false, false, false, false, false, false, false],
      "effect"    : null,
      "annotation": ""
    }, {
      "value"     : null,
      "kumiKata"  : [true, true, true, true, true, true, true, true, true],
      "lockedKata": [false, false, false, false, false, false, false, false, false],
      "effect"    : null,
      "annotation": ""
    }, {
      "value"     : null,
      "kumiKata"  : [true, true, true, true, true, true, true, true, true],
      "lockedKata": [false, false, false, false, false, false, false, false, false],
      "effect"    : null,
      "annotation": ""
    }, {
      "value"     : null,
      "kumiKata"  : [true, true, true, true, true, true, true, true, true],
      "lockedKata": [false, false, false, false, false, false, false, false, false],
      "effect"    : null,
      "annotation": ""
    }, {
      "value"     : 5,
      "kumiKata"  : [true, true, true, true, true, true, true, true, true],
      "lockedKata": [false, false, false, false, false, false, false, false, false],
      "effect"    : null,
      "annotation": ""
    }, {
      "value"     : null,
      "kumiKata"  : [true, true, true, true, true, true, true, true, true],
      "lockedKata": [false, false, false, false, false, false, false, false, false],
      "effect"    : null,
      "annotation": ""
    }, {
      "value"     : 7,
      "kumiKata"  : [true, true, true, true, true, true, true, true, true],
      "lockedKata": [false, false, false, false, false, false, false, false, false],
      "effect"    : null,
      "annotation": ""
    }, {
      "value"     : null,
      "kumiKata"  : [true, true, true, true, true, true, true, true, true],
      "lockedKata": [false, false, false, false, false, false, false, false, false],
      "effect"    : null,
      "annotation": ""
    }, {
      "value"     : null,
      "kumiKata"  : [true, true, true, true, true, true, true, true, true],
      "lockedKata": [false, false, false, false, false, false, false, false, false],
      "effect"    : null,
      "annotation": ""
    }, {
      "value"     : null,
      "kumiKata"  : [true, true, true, true, true, true, true, true, true],
      "lockedKata": [false, false, false, false, false, false, false, false, false],
      "effect"    : null,
      "annotation": ""
    }, {
      "value"     : 3,
      "kumiKata"  : [true, true, true, true, true, true, true, true, true],
      "lockedKata": [false, false, false, false, false, false, false, false, false],
      "effect"    : null,
      "annotation": ""
    }, {
      "value"     : null,
      "kumiKata"  : [true, true, true, true, true, true, true, true, true],
      "lockedKata": [false, false, false, false, false, false, false, false, false],
      "effect"    : null,
      "annotation": ""
    }, {
      "value"     : null,
      "kumiKata"  : [true, true, true, true, true, true, true, true, true],
      "lockedKata": [false, false, false, false, false, false, false, false, false],
      "effect"    : null,
      "annotation": ""
    }, {
      "value"     : 2,
      "kumiKata"  : [true, true, true, true, true, true, true, true, true],
      "lockedKata": [false, false, false, false, false, false, false, false, false],
      "effect"    : null,
      "annotation": ""
    }, {
      "value"     : null,
      "kumiKata"  : [true, true, true, true, true, true, true, true, true],
      "lockedKata": [false, false, false, false, false, false, false, false, false],
      "effect"    : null,
      "annotation": ""
    }, {
      "value"     : 0,
      "kumiKata"  : [true, true, true, true, true, true, true, true, true],
      "lockedKata": [false, false, false, false, false, false, false, false, false],
      "effect"    : null,
      "annotation": ""
    }, {
      "value"     : null,
      "kumiKata"  : [true, true, true, true, true, true, true, true, true],
      "lockedKata": [false, false, false, false, false, false, false, false, false],
      "effect"    : null,
      "annotation": ""
    }, {
      "value"     : null,
      "kumiKata"  : [true, true, true, true, true, true, true, true, true],
      "lockedKata": [false, false, false, false, false, false, false, false, false],
      "effect"    : null,
      "annotation": ""
    }, {
      "value"     : 4,
      "kumiKata"  : [true, true, true, true, true, true, true, true, true],
      "lockedKata": [false, false, false, false, false, false, false, false, false],
      "effect"    : null,
      "annotation": ""
    }
  ],
  "grid1"  : [
    {
      "value"     : 7,
      "kumiKata"  : [false, false, false, false, false, false, false, false, false],
      "lockedKata": [false, false, false, false, false, false, false, false, false],
      "effect"    : null,
      "annotation": ""
    }, {
      "value"     : null,
      "kumiKata"  : [false, false, true, false, false, true, true, false, false],
      "lockedKata": [false, false, true, false, false, false, true, false, false],
      "effect"    : null,
      "annotation": ""
    }, {
      "value"     : null,
      "kumiKata"  : [false, false, true, false, false, true, false, false, false],
      "lockedKata": [false, false, true, false, false, false, false, false, false],
      "effect"    : null,
      "annotation": ""
    }, {
      "value"     : 8,
      "kumiKata"  : [false, false, false, false, false, false, false, false, false],
      "lockedKata": [false, false, false, false, false, false, false, false, false],
      "effect"    : null,
      "annotation": ""
    }, {
      "value"     : 0,
      "kumiKata"  : [false, false, false, false, false, false, false, false, false],
      "lockedKata": [false, false, false, false, false, false, false, false, false],
      "effect"    : null,
      "annotation": ""
    }, {
      "value"     : 4,
      "kumiKata"  : [false, false, false, false, false, false, false, false, false],
      "lockedKata": [false, false, false, false, false, false, false, false, false],
      "effect"    : null,
      "annotation": ""
    }, {
      "value"     : null,
      "kumiKata"  : [false, false, false, false, false, true, true, false, false],
      "lockedKata": [false, false, false, false, false, false, false, false, false],
      "effect"    : null,
      "annotation": ""
    }, {
      "value"     : null,
      "kumiKata"  : [false, true, false, true, false, false, false, false, false],
      "lockedKata": [false, true, false, true, false, false, false, false, false],
      "effect"    : null,
      "annotation": ""
    }, {
      "value"     : null,
      "kumiKata"  : [false, true, false, true, false, false, false, false, false],
      "lockedKata": [false, true, false, true, false, false, false, false, false],
      "effect"    : 2,
      "annotation": "T1"
    }, {
      "value"     : null,
      "kumiKata"  : [true, false, false, false, true, false, false, false, false],
      "lockedKata": [true, false, false, false, true, false, false, false, false],
      "effect"    : null,
      "annotation": ""
    }, {
      "value"     : null,
      "kumiKata"  : [false, false, false, false, false, true, true, false, false],
      "lockedKata": [false, false, false, false, false, false, true, false, false],
      "effect"    : null,
      "annotation": ""
    }, {
      "value"     : 8,
      "kumiKata"  : [false, false, false, false, false, false, false, false, false],
      "lockedKata": [false, false, false, false, false, false, false, false, false],
      "effect"    : null,
      "annotation": ""
    }, {
      "value"     : 1,
      "kumiKata"  : [false, false, false, false, false, false, false, false, false],
      "lockedKata": [false, false, false, false, false, false, false, false, false],
      "effect"    : null,
      "annotation": ""
    }, {
      "value"     : 7,
      "kumiKata"  : [false, false, false, false, false, false, false, false, false],
      "lockedKata": [false, false, false, false, false, false, false, false, false],
      "effect"    : null,
      "annotation": ""
    }, {
      "value"     : 3,
      "kumiKata"  : [false, false, false, false, false, false, false, false, false],
      "lockedKata": [false, false, false, false, false, false, false, false, false],
      "effect"    : null,
      "annotation": ""
    }, {
      "value"     : 2,
      "kumiKata"  : [false, false, false, false, false, false, false, false, false],
      "lockedKata": [false, false, false, false, false, false, false, false, false],
      "effect"    : null,
      "annotation": ""
    }, {
      "value"     : null,
      "kumiKata"  : [true, false, false, false, true, true, true, false, false],
      "lockedKata": [false, false, false, false, true, false, false, false, false],
      "effect"    : null,
      "annotation": ""
    }, {
      "value"     : null,
      "kumiKata"  : [true, false, false, false, false, true, false, false, false],
      "lockedKata": [false, false, false, false, false, false, false, false, false],
      "effect"    : null,
      "annotation": ""
    }, {
      "value"     : null,
      "kumiKata"  : [true, false, false, false, true, false, false, false, false],
      "lockedKata": [true, false, false, false, true, false, false, false, false],
      "effect"    : null,
      "annotation": ""
    }, {
      "value"     : 3,
      "kumiKata"  : [false, false, false, false, false, false, false, false, false],
      "lockedKata": [false, false, false, false, false, false, false, false, false],
      "effect"    : null,
      "annotation": ""
    }, {
      "value"     : 1,
      "kumiKata"  : [false, false, false, false, false, false, false, false, false],
      "lockedKata": [false, false, false, false, false, false, false, false, false],
      "effect"    : null,
      "annotation": ""
    }, {
      "value"     : 6,
      "kumiKata"  : [false, false, false, false, false, false, false, false, false],
      "lockedKata": [false, false, false, false, false, false, false, false, false],
      "effect"    : null,
      "annotation": ""
    }, {
      "value"     : 5,
      "kumiKata"  : [false, false, false, false, false, false, false, false, false],
      "lockedKata": [false, false, false, false, false, false, false, false, false],
      "effect"    : null,
      "annotation": ""
    }, {
      "value"     : 2,
      "kumiKata"  : [false, false, false, false, false, false, false, false, false],
      "lockedKata": [false, false, false, false, false, false, false, false, false],
      "effect"    : null,
      "annotation": ""
    }, {
      "value"     : 7,
      "kumiKata"  : [false, false, false, false, false, false, false, false, false],
      "lockedKata": [false, false, false, false, false, false, false, false, false],
      "effect"    : null,
      "annotation": ""
    }, {
      "value"     : null,
      "kumiKata"  : [true, false, false, false, true, false, false, false, true],
      "lockedKata": [false, false, false, false, true, false, false, false, true],
      "effect"    : null,
      "annotation": ""
    }, {
      "value"     : null,
      "kumiKata"  : [true, false, false, false, false, false, false, false, true],
      "lockedKata": [false, false, false, false, false, false, false, false, true],
      "effect"    : null,
      "annotation": ""
    }, {
      "value"     : 1,
      "kumiKata"  : [false, false, false, false, false, false, false, false, false],
      "lockedKata": [false, false, false, false, false, false, false, false, false],
      "effect"    : null,
      "annotation": ""
    }, {
      "value"     : null,
      "kumiKata"  : [false, false, true, false, false, false, false, true, false],
      "lockedKata": [false, false, false, false, false, false, false, true, false],
      "effect"    : null,
      "annotation": ""
    }, {
      "value"     : null,
      "kumiKata"  : [true, false, true, false, false, false, false, true, false],
      "lockedKata": [true, false, false, false, false, false, false, true, false],
      "effect"    : null,
      "annotation": ""
    }, {
      "value"     : 3,
      "kumiKata"  : [false, false, false, false, false, false, false, false, false],
      "lockedKata": [false, false, false, false, false, false, false, false, false],
      "effect"    : null,
      "annotation": ""
    }, {
      "value"     : 4,
      "kumiKata"  : [false, false, false, false, false, false, false, false, false],
      "lockedKata": [false, false, false, false, false, false, false, false, false],
      "effect"    : null,
      "annotation": ""
    }, {
      "value"     : 6,
      "kumiKata"  : [false, false, false, false, false, false, false, false, false],
      "lockedKata": [false, false, false, false, false, false, false, false, false],
      "effect"    : null,
      "annotation": ""
    }, {
      "value"     : null,
      "kumiKata"  : [true, false, false, false, false, true, false, false, true],
      "lockedKata": [false, false, false, false, false, true, false, false, true],
      "effect"    : null,
      "annotation": ""
    }, {
      "value"     : null,
      "kumiKata"  : [true, false, true, false, false, true, false, false, true],
      "lockedKata": [false, false, false, false, false, true, false, false, true],
      "effect"    : null,
      "annotation": ""
    }, {
      "value"     : null,
      "kumiKata"  : [true, false, false, false, false, true, false, false, true],
      "lockedKata": [false, false, false, false, false, true, false, false, true],
      "effect"    : 4,
      "annotation": "X1"
    }, {
      "value"     : 5,
      "kumiKata"  : [false, false, false, false, false, false, false, false, false],
      "lockedKata": [false, false, false, false, false, false, false, false, false],
      "effect"    : null,
      "annotation": ""
    }, {
      "value"     : 8,
      "kumiKata"  : [false, false, false, false, false, false, false, false, false],
      "lockedKata": [false, false, false, false, false, false, false, false, false],
      "effect"    : null,
      "annotation": ""
    }, {
      "value"     : null,
      "kumiKata"  : [true, false, false, true, false, false, false, false, false],
      "lockedKata": [true, false, false, true, false, false, false, false, false],
      "effect"    : null,
      "annotation": ""
    }, {
      "value"     : 7,
      "kumiKata"  : [false, false, false, false, false, false, false, false, false],
      "lockedKata": [false, false, false, false, false, false, false, false, false],
      "effect"    : null,
      "annotation": ""
    }, {
      "value"     : 2,
      "kumiKata"  : [false, false, false, false, false, false, false, false, false],
      "lockedKata": [false, false, false, false, false, false, false, false, false],
      "effect"    : null,
      "annotation": ""
    }, {
      "value"     : 1,
      "kumiKata"  : [false, false, false, false, false, false, false, false, false],
      "lockedKata": [false, false, false, false, false, false, false, false, false],
      "effect"    : null,
      "annotation": ""
    }, {
      "value"     : 4,
      "kumiKata"  : [false, false, false, false, false, false, false, false, false],
      "lockedKata": [false, false, false, false, false, false, false, false, false],
      "effect"    : null,
      "annotation": ""
    }, {
      "value"     : null,
      "kumiKata"  : [true, false, false, true, false, false, false, false, false],
      "lockedKata": [false, false, false, false, false, false, false, false, false],
      "effect"    : null,
      "annotation": ""
    }, {
      "value"     : 6,
      "kumiKata"  : [false, false, false, false, false, false, false, false, false],
      "lockedKata": [false, false, false, false, false, false, false, false, false],
      "effect"    : null,
      "annotation": ""
    }, {
      "value"     : 6,
      "kumiKata"  : [false, false, false, false, false, false, false, false, false],
      "lockedKata": [false, false, false, false, false, false, false, false, false],
      "effect"    : null,
      "annotation": ""
    }, {
      "value"     : 4,
      "kumiKata"  : [false, false, false, false, false, false, false, false, false],
      "lockedKata": [false, false, false, false, false, false, false, false, false],
      "effect"    : null,
      "annotation": ""
    }, {
      "value"     : null,
      "kumiKata"  : [false, false, true, true, false, false, false, false, false],
      "lockedKata": [false, false, false, true, false, false, false, false, false],
      "effect"    : null,
      "annotation": ""
    }, {
      "value"     : 0,
      "kumiKata"  : [false, false, false, false, false, false, false, false, false],
      "lockedKata": [false, false, false, false, false, false, false, false, false],
      "effect"    : null,
      "annotation": ""
    }, {
      "value"     : 8,
      "kumiKata"  : [false, false, false, false, false, false, false, false, false],
      "lockedKata": [false, false, false, false, false, false, false, false, false],
      "effect"    : null,
      "annotation": ""
    }, {
      "value"     : 5,
      "kumiKata"  : [false, false, false, false, false, false, false, false, false],
      "lockedKata": [false, false, false, false, false, false, false, false, false],
      "effect"    : null,
      "annotation": ""
    }, {
      "value"     : 1,
      "kumiKata"  : [false, false, false, false, false, false, false, false, false],
      "lockedKata": [false, false, false, false, false, false, false, false, false],
      "effect"    : null,
      "annotation": ""
    }, {
      "value"     : 7,
      "kumiKata"  : [false, false, false, false, false, false, false, false, false],
      "lockedKata": [false, false, false, false, false, false, false, false, false],
      "effect"    : null,
      "annotation": ""
    }, {
      "value"     : null,
      "kumiKata"  : [false, false, true, true, false, false, false, false, false],
      "lockedKata": [false, false, false, false, false, false, false, false, false],
      "effect"    : 2,
      "annotation": "T2"
    }, {
      "value"     : 2,
      "kumiKata"  : [false, false, false, false, false, false, false, false, false],
      "lockedKata": [false, false, false, false, false, false, false, false, false],
      "effect"    : null,
      "annotation": ""
    }, {
      "value"     : null,
      "kumiKata"  : [true, false, false, false, false, true, false, false, false],
      "lockedKata": [true, false, false, false, false, false, false, false, false],
      "effect"    : null,
      "annotation": ""
    }, {
      "value"     : 6,
      "kumiKata"  : [false, false, false, false, false, false, false, false, false],
      "lockedKata": [false, false, false, false, false, false, false, false, false],
      "effect"    : null,
      "annotation": ""
    }, {
      "value"     : 4,
      "kumiKata"  : [false, false, false, false, false, false, false, false, false],
      "lockedKata": [false, false, false, false, false, false, false, false, false],
      "effect"    : null,
      "annotation": ""
    }, {
      "value"     : 1,
      "kumiKata"  : [false, false, false, false, false, false, false, false, false],
      "lockedKata": [false, false, false, false, false, false, false, false, false],
      "effect"    : null,
      "annotation": ""
    }, {
      "value"     : 8,
      "kumiKata"  : [false, false, false, false, false, false, false, false, false],
      "lockedKata": [false, false, false, false, false, false, false, false, false],
      "effect"    : null,
      "annotation": ""
    }, {
      "value"     : 3,
      "kumiKata"  : [false, false, false, false, false, false, false, false, false],
      "lockedKata": [false, false, false, false, false, false, false, false, false],
      "effect"    : null,
      "annotation": ""
    }, {
      "value"     : null,
      "kumiKata"  : [true, false, false, false, false, true, false, false, false],
      "lockedKata": [false, false, false, false, false, false, false, false, false],
      "effect"    : null,
      "annotation": ""
    }, {
      "value"     : 7,
      "kumiKata"  : [false, false, false, false, false, false, false, false, false],
      "lockedKata": [false, false, false, false, false, false, false, false, false],
      "effect"    : null,
      "annotation": ""
    }, {
      "value"     : 8,
      "kumiKata"  : [false, false, false, false, false, false, false, false, false],
      "lockedKata": [false, false, false, false, false, false, false, false, false],
      "effect"    : null,
      "annotation": ""
    }, {
      "value"     : null,
      "kumiKata"  : [true, true, false, false, false, false, false, false, false],
      "lockedKata": [true, true, false, false, false, false, false, false, false],
      "effect"    : null,
      "annotation": ""
    }, {
      "value"     : 4,
      "kumiKata"  : [false, false, false, false, false, false, false, false, false],
      "lockedKata": [false, false, false, false, false, false, false, false, false],
      "effect"    : null,
      "annotation": ""
    }, {
      "value"     : 5,
      "kumiKata"  : [false, false, false, false, false, false, false, false, false],
      "lockedKata": [false, false, false, false, false, false, false, false, false],
      "effect"    : null,
      "annotation": ""
    }, {
      "value"     : 3,
      "kumiKata"  : [false, false, false, false, false, false, false, false, false],
      "lockedKata": [false, false, false, false, false, false, false, false, false],
      "effect"    : null,
      "annotation": ""
    }, {
      "value"     : 7,
      "kumiKata"  : [false, false, false, false, false, false, false, false, false],
      "lockedKata": [false, false, false, false, false, false, false, false, false],
      "effect"    : null,
      "annotation": ""
    }, {
      "value"     : null,
      "kumiKata"  : [true, false, false, false, false, false, true, false, false],
      "lockedKata": [false, false, false, false, false, false, true, false, false],
      "effect"    : null,
      "annotation": ""
    }, {
      "value"     : null,
      "kumiKata"  : [true, true, true, false, false, false, true, false, false],
      "lockedKata": [false, false, true, false, false, false, true, false, false],
      "effect"    : null,
      "annotation": ""
    }, {
      "value"     : null,
      "kumiKata"  : [false, true, true, false, false, false, false, false, false],
      "lockedKata": [false, false, true, false, false, false, false, false, false],
      "effect"    : 2,
      "annotation": "T3"
    }, {
      "value"     : 3,
      "kumiKata"  : [false, false, false, false, false, false, false, false, false],
      "lockedKata": [false, false, false, false, false, false, false, false, false],
      "effect"    : null,
      "annotation": ""
    }, {
      "value"     : null,
      "kumiKata"  : [false, true, false, false, false, true, false, true, false],
      "lockedKata": [false, true, false, false, false, false, false, true, false],
      "effect"    : null,
      "annotation": ""
    }, {
      "value"     : null,
      "kumiKata"  : [false, false, false, false, false, true, false, true, false],
      "lockedKata": [false, false, false, false, false, false, false, true, false],
      "effect"    : null,
      "annotation": ""
    }, {
      "value"     : 2,
      "kumiKata"  : [false, false, false, false, false, false, false, false, false],
      "lockedKata": [false, false, false, false, false, false, false, false, false],
      "effect"    : null,
      "annotation": ""
    }, {
      "value"     : 6,
      "kumiKata"  : [false, false, false, false, false, false, false, false, false],
      "lockedKata": [false, false, false, false, false, false, false, false, false],
      "effect"    : null,
      "annotation": ""
    }, {
      "value"     : 0,
      "kumiKata"  : [false, false, false, false, false, false, false, false, false],
      "lockedKata": [false, false, false, false, false, false, false, false, false],
      "effect"    : null,
      "annotation": ""
    }, {
      "value"     : null,
      "kumiKata"  : [false, false, false, false, false, true, false, false, true],
      "lockedKata": [false, false, false, false, false, false, false, false, true],
      "effect"    : null,
      "annotation": ""
    }, {
      "value"     : null,
      "kumiKata"  : [false, true, false, false, false, true, false, false, true],
      "lockedKata": [false, false, false, false, false, false, false, false, true],
      "effect"    : null,
      "annotation": ""
    }, {
      "value"     : 4,
      "kumiKata"  : [false, false, false, false, false, false, false, false, false],
      "lockedKata": [false, false, false, false, false, false, false, false, false],
      "effect"    : null,
      "annotation": ""
    }
  ],
  "grid2"  : [
    {
      "value"     : 7,
      "kumiKata"  : [false, false, false, false, false, false, false, false, false],
      "lockedKata": [false, false, false, false, false, false, false, false, false],
      "effect"    : null,
      "annotation": ""
    }, {
      "value"     : null,
      "kumiKata"  : [false, false, true, false, false, true, true, false, false],
      "lockedKata": [false, false, true, false, false, false, true, false, false],
      "effect"    : null,
      "annotation": ""
    }, {
      "value"     : null,
      "kumiKata"  : [false, false, true, false, false, true, false, false, false],
      "lockedKata": [false, false, true, false, false, false, false, false, false],
      "effect"    : null,
      "annotation": ""
    }, {
      "value"     : 8,
      "kumiKata"  : [false, false, false, false, false, false, false, false, false],
      "lockedKata": [false, false, false, false, false, false, false, false, false],
      "effect"    : null,
      "annotation": ""
    }, {
      "value"     : 0,
      "kumiKata"  : [false, false, false, false, false, false, false, false, false],
      "lockedKata": [false, false, false, false, false, false, false, false, false],
      "effect"    : null,
      "annotation": ""
    }, {
      "value"     : 4,
      "kumiKata"  : [false, false, false, false, false, false, false, false, false],
      "lockedKata": [false, false, false, false, false, false, false, false, false],
      "effect"    : null,
      "annotation": ""
    }, {
      "value"     : null,
      "kumiKata"  : [false, false, false, false, false, true, true, false, false],
      "lockedKata": [false, false, false, false, false, false, false, false, false],
      "effect"    : 3,
      "annotation": "S2"
    }, {
      "value"     : null,
      "kumiKata"  : [false, true, false, true, false, false, false, false, false],
      "lockedKata": [false, true, false, true, false, false, false, false, false],
      "effect"    : null,
      "annotation": ""
    }, {
      "value"     : null,
      "kumiKata"  : [false, true, false, true, false, false, false, false, false],
      "lockedKata": [false, true, false, true, false, false, false, false, false],
      "effect"    : null,
      "annotation": ""
    }, {
      "value"     : null,
      "kumiKata"  : [true, false, false, false, true, false, false, false, false],
      "lockedKata": [true, false, false, false, true, false, false, false, false],
      "effect"    : null,
      "annotation": ""
    }, {
      "value"     : null,
      "kumiKata"  : [false, false, false, false, false, true, true, false, false],
      "lockedKata": [false, false, false, false, false, false, true, false, false],
      "effect"    : null,
      "annotation": ""
    }, {
      "value"     : 8,
      "kumiKata"  : [false, false, false, false, false, false, false, false, false],
      "lockedKata": [false, false, false, false, false, false, false, false, false],
      "effect"    : null,
      "annotation": ""
    }, {
      "value"     : 1,
      "kumiKata"  : [false, false, false, false, false, false, false, false, false],
      "lockedKata": [false, false, false, false, false, false, false, false, false],
      "effect"    : null,
      "annotation": ""
    }, {
      "value"     : 7,
      "kumiKata"  : [false, false, false, false, false, false, false, false, false],
      "lockedKata": [false, false, false, false, false, false, false, false, false],
      "effect"    : null,
      "annotation": ""
    }, {
      "value"     : 3,
      "kumiKata"  : [false, false, false, false, false, false, false, false, false],
      "lockedKata": [false, false, false, false, false, false, false, false, false],
      "effect"    : null,
      "annotation": ""
    }, {
      "value"     : 2,
      "kumiKata"  : [false, false, false, false, false, false, false, false, false],
      "lockedKata": [false, false, false, false, false, false, false, false, false],
      "effect"    : null,
      "annotation": ""
    }, {
      "value"     : null,
      "kumiKata"  : [true, false, false, false, true, false, true, false, false],
      "lockedKata": [false, false, false, false, true, false, false, false, false],
      "effect"    : 4,
      "annotation": ""
    }, {
      "value"     : null,
      "kumiKata"  : [true, false, false, false, false, true, false, false, false],
      "lockedKata": [false, false, false, false, false, false, false, false, false],
      "effect"    : null,
      "annotation": ""
    }, {
      "value"     : null,
      "kumiKata"  : [true, false, false, false, true, false, false, false, false],
      "lockedKata": [true, false, false, false, true, false, false, false, false],
      "effect"    : null,
      "annotation": ""
    }, {
      "value"     : 3,
      "kumiKata"  : [false, false, false, false, false, false, false, false, false],
      "lockedKata": [false, false, false, false, false, false, false, false, false],
      "effect"    : null,
      "annotation": ""
    }, {
      "value"     : 1,
      "kumiKata"  : [false, false, false, false, false, false, false, false, false],
      "lockedKata": [false, false, false, false, false, false, false, false, false],
      "effect"    : null,
      "annotation": ""
    }, {
      "value"     : 6,
      "kumiKata"  : [false, false, false, false, false, false, false, false, false],
      "lockedKata": [false, false, false, false, false, false, false, false, false],
      "effect"    : null,
      "annotation": ""
    }, {
      "value"     : 5,
      "kumiKata"  : [false, false, false, false, false, false, false, false, false],
      "lockedKata": [false, false, false, false, false, false, false, false, false],
      "effect"    : null,
      "annotation": ""
    }, {
      "value"     : 2,
      "kumiKata"  : [false, false, false, false, false, false, false, false, false],
      "lockedKata": [false, false, false, false, false, false, false, false, false],
      "effect"    : null,
      "annotation": ""
    }, {
      "value"     : 7,
      "kumiKata"  : [false, false, false, false, false, false, false, false, false],
      "lockedKata": [false, false, false, false, false, false, false, false, false],
      "effect"    : null,
      "annotation": ""
    }, {
      "value"     : null,
      "kumiKata"  : [true, false, false, false, true, false, false, false, true],
      "lockedKata": [false, false, false, false, true, false, false, false, true],
      "effect"    : null,
      "annotation": ""
    }, {
      "value"     : null,
      "kumiKata"  : [true, false, false, false, false, false, false, false, true],
      "lockedKata": [false, false, false, false, false, false, false, false, true],
      "effect"    : null,
      "annotation": ""
    }, {
      "value"     : 1,
      "kumiKata"  : [false, false, false, false, false, false, false, false, false],
      "lockedKata": [false, false, false, false, false, false, false, false, false],
      "effect"    : null,
      "annotation": ""
    }, {
      "value"     : null,
      "kumiKata"  : [false, false, true, false, false, false, false, true, false],
      "lockedKata": [false, false, false, false, false, false, false, true, false],
      "effect"    : null,
      "annotation": ""
    }, {
      "value"     : null,
      "kumiKata"  : [true, false, true, false, false, false, false, true, false],
      "lockedKata": [true, false, false, false, false, false, false, true, false],
      "effect"    : null,
      "annotation": ""
    }, {
      "value"     : 3,
      "kumiKata"  : [false, false, false, false, false, false, false, false, false],
      "lockedKata": [false, false, false, false, false, false, false, false, false],
      "effect"    : null,
      "annotation": ""
    }, {
      "value"     : 4,
      "kumiKata"  : [false, false, false, false, false, false, false, false, false],
      "lockedKata": [false, false, false, false, false, false, false, false, false],
      "effect"    : null,
      "annotation": ""
    }, {
      "value"     : 6,
      "kumiKata"  : [false, false, false, false, false, false, false, false, false],
      "lockedKata": [false, false, false, false, false, false, false, false, false],
      "effect"    : null,
      "annotation": ""
    }, {
      "value"     : null,
      "kumiKata"  : [true, false, false, false, false, true, false, false, true],
      "lockedKata": [false, false, false, false, false, true, false, false, true],
      "effect"    : null,
      "annotation": ""
    }, {
      "value"     : null,
      "kumiKata"  : [true, false, true, false, false, true, false, false, true],
      "lockedKata": [false, false, false, false, false, true, false, false, true],
      "effect"    : null,
      "annotation": ""
    }, {
      "value"     : null,
      "kumiKata"  : [true, false, false, false, false, true, false, false, true],
      "lockedKata": [false, false, false, false, false, true, false, false, true],
      "effect"    : null,
      "annotation": ""
    }, {
      "value"     : 5,
      "kumiKata"  : [false, false, false, false, false, false, false, false, false],
      "lockedKata": [false, false, false, false, false, false, false, false, false],
      "effect"    : null,
      "annotation": ""
    }, {
      "value"     : 8,
      "kumiKata"  : [false, false, false, false, false, false, false, false, false],
      "lockedKata": [false, false, false, false, false, false, false, false, false],
      "effect"    : null,
      "annotation": ""
    }, {
      "value"     : null,
      "kumiKata"  : [true, false, false, true, false, false, false, false, false],
      "lockedKata": [true, false, false, true, false, false, false, false, false],
      "effect"    : null,
      "annotation": ""
    }, {
      "value"     : 7,
      "kumiKata"  : [false, false, false, false, false, false, false, false, false],
      "lockedKata": [false, false, false, false, false, false, false, false, false],
      "effect"    : null,
      "annotation": ""
    }, {
      "value"     : 2,
      "kumiKata"  : [false, false, false, false, false, false, false, false, false],
      "lockedKata": [false, false, false, false, false, false, false, false, false],
      "effect"    : null,
      "annotation": ""
    }, {
      "value"     : 1,
      "kumiKata"  : [false, false, false, false, false, false, false, false, false],
      "lockedKata": [false, false, false, false, false, false, false, false, false],
      "effect"    : null,
      "annotation": ""
    }, {
      "value"     : 4,
      "kumiKata"  : [false, false, false, false, false, false, false, false, false],
      "lockedKata": [false, false, false, false, false, false, false, false, false],
      "effect"    : null,
      "annotation": ""
    }, {
      "value"     : null,
      "kumiKata"  : [true, false, false, true, false, false, false, false, false],
      "lockedKata": [false, false, false, false, false, false, false, false, false],
      "effect"    : null,
      "annotation": ""
    }, {
      "value"     : 6,
      "kumiKata"  : [false, false, false, false, false, false, false, false, false],
      "lockedKata": [false, false, false, false, false, false, false, false, false],
      "effect"    : null,
      "annotation": ""
    }, {
      "value"     : 6,
      "kumiKata"  : [false, false, false, false, false, false, false, false, false],
      "lockedKata": [false, false, false, false, false, false, false, false, false],
      "effect"    : null,
      "annotation": ""
    }, {
      "value"     : 4,
      "kumiKata"  : [false, false, false, false, false, false, false, false, false],
      "lockedKata": [false, false, false, false, false, false, false, false, false],
      "effect"    : null,
      "annotation": ""
    }, {
      "value"     : null,
      "kumiKata"  : [false, false, true, true, false, false, false, false, false],
      "lockedKata": [false, false, false, true, false, false, false, false, false],
      "effect"    : null,
      "annotation": ""
    }, {
      "value"     : 0,
      "kumiKata"  : [false, false, false, false, false, false, false, false, false],
      "lockedKata": [false, false, false, false, false, false, false, false, false],
      "effect"    : null,
      "annotation": ""
    }, {
      "value"     : 8,
      "kumiKata"  : [false, false, false, false, false, false, false, false, false],
      "lockedKata": [false, false, false, false, false, false, false, false, false],
      "effect"    : null,
      "annotation": ""
    }, {
      "value"     : 5,
      "kumiKata"  : [false, false, false, false, false, false, false, false, false],
      "lockedKata": [false, false, false, false, false, false, false, false, false],
      "effect"    : null,
      "annotation": ""
    }, {
      "value"     : 1,
      "kumiKata"  : [false, false, false, false, false, false, false, false, false],
      "lockedKata": [false, false, false, false, false, false, false, false, false],
      "effect"    : null,
      "annotation": ""
    }, {
      "value"     : 7,
      "kumiKata"  : [false, false, false, false, false, false, false, false, false],
      "lockedKata": [false, false, false, false, false, false, false, false, false],
      "effect"    : null,
      "annotation": ""
    }, {
      "value"     : null,
      "kumiKata"  : [false, false, true, true, false, false, false, false, false],
      "lockedKata": [false, false, false, false, false, false, false, false, false],
      "effect"    : null,
      "annotation": ""
    }, {
      "value"     : 2,
      "kumiKata"  : [false, false, false, false, false, false, false, false, false],
      "lockedKata": [false, false, false, false, false, false, false, false, false],
      "effect"    : null,
      "annotation": ""
    }, {
      "value"     : null,
      "kumiKata"  : [true, false, false, false, false, true, false, false, false],
      "lockedKata": [true, false, false, false, false, false, false, false, false],
      "effect"    : null,
      "annotation": ""
    }, {
      "value"     : 6,
      "kumiKata"  : [false, false, false, false, false, false, false, false, false],
      "lockedKata": [false, false, false, false, false, false, false, false, false],
      "effect"    : null,
      "annotation": ""
    }, {
      "value"     : 4,
      "kumiKata"  : [false, false, false, false, false, false, false, false, false],
      "lockedKata": [false, false, false, false, false, false, false, false, false],
      "effect"    : null,
      "annotation": ""
    }, {
      "value"     : 1,
      "kumiKata"  : [false, false, false, false, false, false, false, false, false],
      "lockedKata": [false, false, false, false, false, false, false, false, false],
      "effect"    : null,
      "annotation": ""
    }, {
      "value"     : 8,
      "kumiKata"  : [false, false, false, false, false, false, false, false, false],
      "lockedKata": [false, false, false, false, false, false, false, false, false],
      "effect"    : null,
      "annotation": ""
    }, {
      "value"     : 3,
      "kumiKata"  : [false, false, false, false, false, false, false, false, false],
      "lockedKata": [false, false, false, false, false, false, false, false, false],
      "effect"    : null,
      "annotation": ""
    }, {
      "value"     : null,
      "kumiKata"  : [true, false, false, false, false, true, false, false, false],
      "lockedKata": [false, false, false, false, false, false, false, false, false],
      "effect"    : 3,
      "annotation": "S1"
    }, {
      "value"     : 7,
      "kumiKata"  : [false, false, false, false, false, false, false, false, false],
      "lockedKata": [false, false, false, false, false, false, false, false, false],
      "effect"    : null,
      "annotation": ""
    }, {
      "value"     : 8,
      "kumiKata"  : [false, false, false, false, false, false, false, false, false],
      "lockedKata": [false, false, false, false, false, false, false, false, false],
      "effect"    : null,
      "annotation": ""
    }, {
      "value"     : null,
      "kumiKata"  : [true, true, false, false, false, false, false, false, false],
      "lockedKata": [true, true, false, false, false, false, false, false, false],
      "effect"    : null,
      "annotation": ""
    }, {
      "value"     : 4,
      "kumiKata"  : [false, false, false, false, false, false, false, false, false],
      "lockedKata": [false, false, false, false, false, false, false, false, false],
      "effect"    : null,
      "annotation": ""
    }, {
      "value"     : 5,
      "kumiKata"  : [false, false, false, false, false, false, false, false, false],
      "lockedKata": [false, false, false, false, false, false, false, false, false],
      "effect"    : null,
      "annotation": ""
    }, {
      "value"     : 3,
      "kumiKata"  : [false, false, false, false, false, false, false, false, false],
      "lockedKata": [false, false, false, false, false, false, false, false, false],
      "effect"    : null,
      "annotation": ""
    }, {
      "value"     : 7,
      "kumiKata"  : [false, false, false, false, false, false, false, false, false],
      "lockedKata": [false, false, false, false, false, false, false, false, false],
      "effect"    : null,
      "annotation": ""
    }, {
      "value"     : null,
      "kumiKata"  : [true, false, false, false, false, false, true, false, false],
      "lockedKata": [false, false, false, false, false, false, true, false, false],
      "effect"    : 1,
      "annotation": "A"
    }, {
      "value"     : null,
      "kumiKata"  : [true, true, true, false, false, false, true, false, false],
      "lockedKata": [false, false, true, false, false, false, true, false, false],
      "effect"    : null,
      "annotation": ""
    }, {
      "value"     : null,
      "kumiKata"  : [false, true, true, false, false, false, false, false, false],
      "lockedKata": [false, false, true, false, false, false, false, false, false],
      "effect"    : null,
      "annotation": ""
    }, {
      "value"     : 3,
      "kumiKata"  : [false, false, false, false, false, false, false, false, false],
      "lockedKata": [false, false, false, false, false, false, false, false, false],
      "effect"    : null,
      "annotation": ""
    }, {
      "value"     : null,
      "kumiKata"  : [false, true, false, false, false, true, false, true, false],
      "lockedKata": [false, true, false, false, false, false, false, true, false],
      "effect"    : null,
      "annotation": ""
    }, {
      "value"     : null,
      "kumiKata"  : [false, false, false, false, false, true, false, true, false],
      "lockedKata": [false, false, false, false, false, false, false, true, false],
      "effect"    : null,
      "annotation": ""
    }, {
      "value"     : 2,
      "kumiKata"  : [false, false, false, false, false, false, false, false, false],
      "lockedKata": [false, false, false, false, false, false, false, false, false],
      "effect"    : null,
      "annotation": ""
    }, {
      "value"     : 6,
      "kumiKata"  : [false, false, false, false, false, false, false, false, false],
      "lockedKata": [false, false, false, false, false, false, false, false, false],
      "effect"    : null,
      "annotation": ""
    }, {
      "value"     : 0,
      "kumiKata"  : [false, false, false, false, false, false, false, false, false],
      "lockedKata": [false, false, false, false, false, false, false, false, false],
      "effect"    : null,
      "annotation": ""
    }, {
      "value"     : null,
      "kumiKata"  : [false, false, false, false, false, false, false, false, true],
      "lockedKata": [false, false, false, false, false, false, false, false, true],
      "effect"    : 4,
      "annotation": ""
    }, {
      "value"     : null,
      "kumiKata"  : [false, true, false, false, false, true, false, false, true],
      "lockedKata": [false, false, false, false, false, false, false, false, true],
      "effect"    : null,
      "annotation": ""
    }, {
      "value"     : 4,
      "kumiKata"  : [false, false, false, false, false, false, false, false, false],
      "lockedKata": [false, false, false, false, false, false, false, false, false],
      "effect"    : null,
      "annotation": ""
    }
  ]
}