{
  "message": "6 espions : reste \u00e0 faire le cas non align\u00e9 et tester les autres cas",
  "gridI"  : [
    {
      "value"     : null,
      "kumiKata"  : [false, true, true, true, false, false, true, true, true],
      "lockedKata": [false, false, false, false, false, false, false, false, false],
      "effect"    : null,
      "annotation": ""
    }, {
      "value"     : null,
      "kumiKata"  : [false, false, true, true, false, false, true, true, true],
      "lockedKata": [false, false, false, false, false, false, false, false, false],
      "effect"    : null,
      "annotation": ""
    }, {
      "value"     : null,
      "kumiKata"  : [false, true, true, true, false, false, false, true, false],
      "lockedKata": [false, false, false, false, false, false, false, false, false],
      "effect"    : null,
      "annotation": ""
    }, {
      "value"     : null,
      "kumiKata"  : [true, true, false, false, true, false, false, false, true],
      "lockedKata": [false, false, false, false, false, false, false, false, false],
      "effect"    : null,
      "annotation": ""
    }, {
      "value"     : 5,
      "kumiKata"  : [false, false, false, false, false, false, false, false, false],
      "lockedKata": [false, false, false, false, false, false, false, false, false],
      "effect"    : null,
      "annotation": ""
    }, {
      "value"     : null,
      "kumiKata"  : [false, true, false, true, true, false, false, false, true],
      "lockedKata": [false, false, false, false, false, false, false, false, false],
      "effect"    : null,
      "annotation": ""
    }, {
      "value"     : null,
      "kumiKata"  : [true, true, true, true, true, false, false, false, false],
      "lockedKata": [false, false, false, false, false, false, false, false, false],
      "effect"    : null,
      "annotation": ""
    }, {
      "value"     : null,
      "kumiKata"  : [true, false, true, true, true, false, true, false, false],
      "lockedKata": [false, false, false, false, false, false, false, false, false],
      "effect"    : null,
      "annotation": ""
    }, {
      "value"     : null,
      "kumiKata"  : [true, true, true, true, true, false, true, false, false],
      "lockedKata": [false, false, false, false, false, false, false, false, false],
      "effect"    : null,
      "annotation": ""
    }, {
      "value"     : null,
      "kumiKata"  : [false, true, true, true, false, false, false, false, false],
      "lockedKata": [false, false, false, false, false, false, false, false, false],
      "effect"    : null,
      "annotation": ""
    }, {
      "value"     : null,
      "kumiKata"  : [false, false, true, true, false, true, false, false, false],
      "lockedKata": [false, false, false, false, false, false, false, false, false],
      "effect"    : null,
      "annotation": ""
    }, {
      "value"     : 0,
      "kumiKata"  : [false, false, false, false, false, false, false, false, false],
      "lockedKata": [false, false, false, false, false, false, false, false, false],
      "effect"    : null,
      "annotation": ""
    }, {
      "value"     : 7,
      "kumiKata"  : [false, false, false, false, false, false, false, false, false],
      "lockedKata": [false, false, false, false, false, false, false, false, false],
      "effect"    : null,
      "annotation": ""
    }, {
      "value"     : null,
      "kumiKata"  : [false, false, false, true, false, false, false, false, false],
      "lockedKata": [false, false, false, false, false, false, false, false, false],
      "effect"    : null,
      "annotation": ""
    }, {
      "value"     : 6,
      "kumiKata"  : [false, false, false, false, false, false, false, false, false],
      "lockedKata": [false, false, false, false, false, false, false, false, false],
      "effect"    : null,
      "annotation": ""
    }, {
      "value"     : 8,
      "kumiKata"  : [false, false, false, false, false, false, false, false, false],
      "lockedKata": [false, false, false, false, false, false, false, false, false],
      "effect"    : null,
      "annotation": ""
    }, {
      "value"     : null,
      "kumiKata"  : [false, false, true, true, true, false, false, false, false],
      "lockedKata": [false, false, false, false, false, false, false, false, false],
      "effect"    : null,
      "annotation": ""
    }, {
      "value"     : null,
      "kumiKata"  : [false, true, true, true, true, true, false, false, false],
      "lockedKata": [false, false, false, false, false, false, false, false, false],
      "effect"    : null,
      "annotation": ""
    }, {
      "value"     : null,
      "kumiKata"  : [false, true, false, true, false, false, true, false, true],
      "lockedKata": [false, false, false, false, false, false, false, false, false],
      "effect"    : null,
      "annotation": ""
    }, {
      "value"     : null,
      "kumiKata"  : [false, false, false, true, false, true, true, false, true],
      "lockedKata": [false, false, false, false, false, false, false, false, false],
      "effect"    : null,
      "annotation": ""
    }, {
      "value"     : 4,
      "kumiKata"  : [false, false, false, false, false, false, false, false, false],
      "lockedKata": [false, false, false, false, false, false, false, false, false],
      "effect"    : null,
      "annotation": ""
    }, {
      "value"     : null,
      "kumiKata"  : [true, true, false, false, false, false, false, false, true],
      "lockedKata": [false, false, false, false, false, false, false, false, false],
      "effect"    : null,
      "annotation": ""
    }, {
      "value"     : 2,
      "kumiKata"  : [false, false, false, false, false, false, false, false, false],
      "lockedKata": [false, false, false, false, false, false, false, false, false],
      "effect"    : null,
      "annotation": ""
    }, {
      "value"     : null,
      "kumiKata"  : [false, true, false, true, false, false, false, false, true],
      "lockedKata": [false, false, false, false, false, false, false, false, false],
      "effect"    : null,
      "annotation": ""
    }, {
      "value"     : 7,
      "kumiKata"  : [false, false, false, false, false, false, false, false, false],
      "lockedKata": [false, false, false, false, false, false, false, false, false],
      "effect"    : null,
      "annotation": ""
    }, {
      "value"     : null,
      "kumiKata"  : [true, false, false, true, false, false, true, false, false],
      "lockedKata": [false, false, false, false, false, false, false, false, false],
      "effect"    : null,
      "annotation": ""
    }, {
      "value"     : null,
      "kumiKata"  : [true, true, false, true, false, true, true, false, false],
      "lockedKata": [false, false, false, false, false, false, false, false, false],
      "effect"    : null,
      "annotation": ""
    }, {
      "value"     : null,
      "kumiKata"  : [false, false, true, true, true, false, false, true, false],
      "lockedKata": [false, false, false, false, false, false, false, false, false],
      "effect"    : null,
      "annotation": ""
    }, {
      "value"     : 0,
      "kumiKata"  : [false, false, false, false, false, false, false, false, false],
      "lockedKata": [false, false, false, false, false, false, false, false, false],
      "effect"    : null,
      "annotation": ""
    }, {
      "value"     : 8,
      "kumiKata"  : [false, false, false, false, false, false, false, false, false],
      "lockedKata": [false, false, false, false, false, false, false, false, false],
      "effect"    : null,
      "annotation": ""
    }, {
      "value"     : null,
      "kumiKata"  : [false, false, true, false, true, true, false, false, false],
      "lockedKata": [false, false, false, false, false, false, false, false, false],
      "effect"    : null,
      "annotation": ""
    }, {
      "value"     : null,
      "kumiKata"  : [false, false, false, true, false, false, false, true, false],
      "lockedKata": [false, false, false, false, false, false, false, false, false],
      "effect"    : null,
      "annotation": ""
    }, {
      "value"     : null,
      "kumiKata"  : [false, false, true, true, true, true, false, true, false],
      "lockedKata": [false, false, false, false, false, false, false, false, false],
      "effect"    : null,
      "annotation": ""
    }, {
      "value"     : 6,
      "kumiKata"  : [false, false, false, false, false, false, false, false, false],
      "lockedKata": [false, false, false, false, false, false, false, false, false],
      "effect"    : null,
      "annotation": ""
    }, {
      "value"     : 1,
      "kumiKata"  : [false, false, false, false, false, false, false, false, false],
      "lockedKata": [false, false, false, false, false, false, false, false, false],
      "effect"    : null,
      "annotation": ""
    }, {
      "value"     : null,
      "kumiKata"  : [false, false, true, true, true, false, false, true, false],
      "lockedKata": [false, false, false, false, false, false, false, false, false],
      "effect"    : null,
      "annotation": ""
    }, {
      "value"     : null,
      "kumiKata"  : [false, true, true, true, true, false, false, true, false],
      "lockedKata": [false, false, false, false, false, false, false, false, false],
      "effect"    : null,
      "annotation": ""
    }, {
      "value"     : null,
      "kumiKata"  : [false, false, true, true, true, true, false, true, false],
      "lockedKata": [false, false, false, false, false, false, false, false, false],
      "effect"    : null,
      "annotation": ""
    }, {
      "value"     : null,
      "kumiKata"  : [false, true, true, true, false, true, false, true, false],
      "lockedKata": [false, false, false, false, false, false, false, false, false],
      "effect"    : null,
      "annotation": ""
    }, {
      "value"     : null,
      "kumiKata"  : [false, true, true, false, true, true, true, false, true],
      "lockedKata": [false, false, false, false, false, false, false, false, false],
      "effect"    : null,
      "annotation": ""
    }, {
      "value"     : 0,
      "kumiKata"  : [false, false, false, false, false, false, false, false, false],
      "lockedKata": [false, false, false, false, false, false, false, false, false],
      "effect"    : null,
      "annotation": ""
    }, {
      "value"     : null,
      "kumiKata"  : [false, true, true, true, true, true, false, true, true],
      "lockedKata": [false, false, false, false, false, false, false, false, false],
      "effect"    : null,
      "annotation": ""
    }, {
      "value"     : null,
      "kumiKata"  : [false, false, true, true, true, false, false, false, false],
      "lockedKata": [false, false, false, false, false, false, false, false, false],
      "effect"    : null,
      "annotation": ""
    }, {
      "value"     : null,
      "kumiKata"  : [false, false, true, true, true, false, false, true, true],
      "lockedKata": [false, false, false, false, false, false, false, false, false],
      "effect"    : null,
      "annotation": ""
    }, {
      "value"     : null,
      "kumiKata"  : [false, false, true, true, true, false, false, true, false],
      "lockedKata": [false, false, false, false, false, false, false, false, false],
      "effect"    : null,
      "annotation": ""
    }, {
      "value"     : null,
      "kumiKata"  : [false, true, true, true, true, false, false, true, false],
      "lockedKata": [false, false, false, false, false, false, false, false, false],
      "effect"    : null,
      "annotation": ""
    }, {
      "value"     : null,
      "kumiKata"  : [false, false, true, true, true, false, false, true, false],
      "lockedKata": [false, false, false, false, false, false, false, false, false],
      "effect"    : null,
      "annotation": ""
    }, {
      "value"     : 6,
      "kumiKata"  : [false, false, false, false, false, false, false, false, false],
      "lockedKata": [false, false, false, false, false, false, false, false, false],
      "effect"    : null,
      "annotation": ""
    }, {
      "value"     : null,
      "kumiKata"  : [false, true, true, false, true, false, false, false, true],
      "lockedKata": [false, false, false, false, false, false, false, false, false],
      "effect"    : null,
      "annotation": ""
    }, {
      "value"     : null,
      "kumiKata"  : [false, false, false, true, false, false, false, true, true],
      "lockedKata": [false, false, false, false, false, false, false, false, false],
      "effect"    : null,
      "annotation": ""
    }, {
      "value"     : null,
      "kumiKata"  : [false, true, true, true, true, false, false, true, true],
      "lockedKata": [false, false, false, false, false, false, false, false, false],
      "effect"    : null,
      "annotation": ""
    }, {
      "value"     : 5,
      "kumiKata"  : [false, false, false, false, false, false, false, false, false],
      "lockedKata": [false, false, false, false, false, false, false, false, false],
      "effect"    : null,
      "annotation": ""
    }, {
      "value"     : null,
      "kumiKata"  : [true, false, true, true, true, false, false, true, true],
      "lockedKata": [false, false, false, false, false, false, false, false, false],
      "effect"    : null,
      "annotation": ""
    }, {
      "value"     : null,
      "kumiKata"  : [true, false, true, true, true, false, false, true, false],
      "lockedKata": [false, false, false, false, false, false, false, false, false],
      "effect"    : null,
      "annotation": ""
    }, {
      "value"     : null,
      "kumiKata"  : [false, false, true, false, false, false, true, true, true],
      "lockedKata": [false, false, false, false, false, false, false, false, false],
      "effect"    : null,
      "annotation": ""
    }, {
      "value"     : 1,
      "kumiKata"  : [false, false, false, false, false, false, false, false, false],
      "lockedKata": [false, false, false, false, false, false, false, false, false],
      "effect"    : null,
      "annotation": ""
    }, {
      "value"     : null,
      "kumiKata"  : [false, false, true, false, false, false, false, true, false],
      "lockedKata": [false, false, false, false, false, false, false, false, false],
      "effect"    : null,
      "annotation": ""
    }, {
      "value"     : 3,
      "kumiKata"  : [false, false, false, false, false, false, false, false, false],
      "lockedKata": [false, false, false, false, false, false, false, false, false],
      "effect"    : null,
      "annotation": ""
    }, {
      "value"     : 4,
      "kumiKata"  : [false, false, false, false, false, false, false, false, false],
      "lockedKata": [false, false, false, false, false, false, false, false, false],
      "effect"    : null,
      "annotation": ""
    }, {
      "value"     : 0,
      "kumiKata"  : [false, false, false, false, false, false, false, false, false],
      "lockedKata": [false, false, false, false, false, false, false, false, false],
      "effect"    : null,
      "annotation": ""
    }, {
      "value"     : null,
      "kumiKata"  : [false, false, true, false, false, false, false, false, false],
      "lockedKata": [false, false, false, false, false, false, false, false, false],
      "effect"    : null,
      "annotation": ""
    }, {
      "value"     : 5,
      "kumiKata"  : [false, false, false, false, false, false, false, false, false],
      "lockedKata": [false, false, false, false, false, false, false, false, false],
      "effect"    : null,
      "annotation": ""
    }, {
      "value"     : null,
      "kumiKata"  : [false, false, true, false, false, false, true, true, false],
      "lockedKata": [false, false, false, false, false, false, false, false, false],
      "effect"    : null,
      "annotation": ""
    }, {
      "value"     : 5,
      "kumiKata"  : [false, false, false, false, false, false, false, false, false],
      "lockedKata": [false, false, false, false, false, false, false, false, false],
      "effect"    : null,
      "annotation": ""
    }, {
      "value"     : null,
      "kumiKata"  : [false, false, true, true, true, false, true, true, false],
      "lockedKata": [false, false, false, false, false, false, false, false, false],
      "effect"    : null,
      "annotation": ""
    }, {
      "value"     : null,
      "kumiKata"  : [false, false, true, true, false, false, false, true, false],
      "lockedKata": [false, false, false, false, false, false, false, false, false],
      "effect"    : null,
      "annotation": ""
    }, {
      "value"     : null,
      "kumiKata"  : [false, false, true, false, false, false, false, false, false],
      "lockedKata": [false, false, false, false, false, false, false, false, false],
      "effect"    : null,
      "annotation": ""
    }, {
      "value"     : 1,
      "kumiKata"  : [false, false, false, false, false, false, false, false, false],
      "lockedKata": [false, false, false, false, false, false, false, false, false],
      "effect"    : null,
      "annotation": ""
    }, {
      "value"     : null,
      "kumiKata"  : [false, false, true, false, false, false, false, true, false],
      "lockedKata": [false, false, false, false, false, false, false, false, false],
      "effect"    : null,
      "annotation": ""
    }, {
      "value"     : null,
      "kumiKata"  : [true, false, true, true, true, false, false, false, false],
      "lockedKata": [false, false, false, false, false, false, false, false, false],
      "effect"    : null,
      "annotation": ""
    }, {
      "value"     : null,
      "kumiKata"  : [true, false, true, true, true, false, true, true, false],
      "lockedKata": [false, false, false, false, false, false, false, false, false],
      "effect"    : null,
      "annotation": ""
    }, {
      "value"     : 8,
      "kumiKata"  : [false, false, false, false, false, false, false, false, false],
      "lockedKata": [false, false, false, false, false, false, false, false, false],
      "effect"    : null,
      "annotation": ""
    }, {
      "value"     : null,
      "kumiKata"  : [true, false, true, true, true, false, false, true, true],
      "lockedKata": [false, false, false, false, false, false, false, false, false],
      "effect"    : null,
      "annotation": ""
    }, {
      "value"     : null,
      "kumiKata"  : [false, false, true, true, true, false, false, true, true],
      "lockedKata": [false, false, false, false, false, false, false, false, false],
      "effect"    : null,
      "annotation": ""
    }, {
      "value"     : null,
      "kumiKata"  : [false, false, true, true, false, false, false, true, false],
      "lockedKata": [false, false, false, false, false, false, false, false, false],
      "effect"    : null,
      "annotation": ""
    }, {
      "value"     : null,
      "kumiKata"  : [false, false, true, false, false, true, false, false, true],
      "lockedKata": [false, false, false, false, false, false, false, false, false],
      "effect"    : null,
      "annotation": ""
    }, {
      "value"     : 6,
      "kumiKata"  : [false, false, false, false, false, false, false, false, false],
      "lockedKata": [false, false, false, false, false, false, false, false, false],
      "effect"    : null,
      "annotation": ""
    }, {
      "value"     : null,
      "kumiKata"  : [false, false, true, false, false, true, false, true, true],
      "lockedKata": [false, false, false, false, false, false, false, false, false],
      "effect"    : null,
      "annotation": ""
    }, {
      "value"     : null,
      "kumiKata"  : [true, true, true, true, true, false, false, false, false],
      "lockedKata": [false, false, false, false, false, false, false, false, false],
      "effect"    : null,
      "annotation": ""
    }, {
      "value"     : null,
      "kumiKata"  : [true, false, true, true, true, false, false, true, false],
      "lockedKata": [false, false, false, false, false, false, false, false, false],
      "effect"    : null,
      "annotation": ""
    }, {
      "value"     : null,
      "kumiKata"  : [true, true, true, true, true, false, false, true, false],
      "lockedKata": [false, false, false, false, false, false, false, false, false],
      "effect"    : null,
      "annotation": ""
    }
  ],
  "grid1"  : [
    {
      "value"     : null,
      "kumiKata"  : [false, false, false, true, false, false, true, true, false],
      "lockedKata": [false, false, false, false, false, false, true, true, false],
      "effect"    : null,
      "annotation": ""
    }, {
      "value"     : null,
      "kumiKata"  : [false, false, false, true, false, false, false, true, false],
      "lockedKata": [false, false, false, false, false, false, false, true, false],
      "effect"    : null,
      "annotation": ""
    }, {
      "value"     : 1,
      "kumiKata"  : [false, false, false, false, false, false, false, false, false],
      "lockedKata": [false, false, false, false, false, false, false, false, false],
      "effect"    : null,
      "annotation": ""
    }, {
      "value"     : null,
      "kumiKata"  : [false, false, false, false, true, false, false, false, true],
      "lockedKata": [false, false, false, false, true, false, false, false, true],
      "effect"    : null,
      "annotation": ""
    }, {
      "value"     : 5,
      "kumiKata"  : [false, false, false, false, false, false, false, false, false],
      "lockedKata": [false, false, false, false, false, false, false, false, false],
      "effect"    : null,
      "annotation": ""
    }, {
      "value"     : null,
      "kumiKata"  : [false, false, false, false, true, false, false, false, true],
      "lockedKata": [false, false, false, false, true, false, false, false, true],
      "effect"    : null,
      "annotation": ""
    }, {
      "value"     : 0,
      "kumiKata"  : [false, false, false, false, false, false, false, false, false],
      "lockedKata": [false, false, false, false, false, false, false, false, false],
      "effect"    : null,
      "annotation": ""
    }, {
      "value"     : null,
      "kumiKata"  : [false, false, true, true, false, false, true, false, false],
      "lockedKata": [false, false, true, false, false, false, true, false, false],
      "effect"    : null,
      "annotation": ""
    }, {
      "value"     : null,
      "kumiKata"  : [false, false, true, true, false, false, false, false, false],
      "lockedKata": [false, false, true, false, false, false, false, false, false],
      "effect"    : null,
      "annotation": ""
    }, {
      "value"     : 2,
      "kumiKata"  : [false, false, false, false, false, false, false, false, false],
      "lockedKata": [false, false, false, false, false, false, false, false, false],
      "effect"    : null,
      "annotation": ""
    }, {
      "value"     : 5,
      "kumiKata"  : [false, false, false, false, false, false, false, false, false],
      "lockedKata": [false, false, false, false, false, false, false, false, false],
      "effect"    : null,
      "annotation": ""
    }, {
      "value"     : 0,
      "kumiKata"  : [false, false, false, false, false, false, false, false, false],
      "lockedKata": [false, false, false, false, false, false, false, false, false],
      "effect"    : null,
      "annotation": ""
    }, {
      "value"     : 7,
      "kumiKata"  : [false, false, false, false, false, false, false, false, false],
      "lockedKata": [false, false, false, false, false, false, false, false, false],
      "effect"    : null,
      "annotation": ""
    }, {
      "value"     : 3,
      "kumiKata"  : [false, false, false, false, false, false, false, false, false],
      "lockedKata": [false, false, false, false, false, false, false, false, false],
      "effect"    : null,
      "annotation": ""
    }, {
      "value"     : 6,
      "kumiKata"  : [false, false, false, false, false, false, false, false, false],
      "lockedKata": [false, false, false, false, false, false, false, false, false],
      "effect"    : null,
      "annotation": ""
    }, {
      "value"     : 8,
      "kumiKata"  : [false, false, false, false, false, false, false, false, false],
      "lockedKata": [false, false, false, false, false, false, false, false, false],
      "effect"    : null,
      "annotation": ""
    }, {
      "value"     : 4,
      "kumiKata"  : [false, false, false, false, false, false, false, false, false],
      "lockedKata": [false, false, false, false, false, false, false, false, false],
      "effect"    : null,
      "annotation": ""
    }, {
      "value"     : 1,
      "kumiKata"  : [false, false, false, false, false, false, false, false, false],
      "lockedKata": [false, false, false, false, false, false, false, false, false],
      "effect"    : null,
      "annotation": ""
    }, {
      "value"     : null,
      "kumiKata"  : [false, false, false, true, false, false, true, false, false],
      "lockedKata": [false, false, false, false, false, false, true, false, false],
      "effect"    : null,
      "annotation": ""
    }, {
      "value"     : 8,
      "kumiKata"  : [false, false, false, false, false, false, false, false, false],
      "lockedKata": [false, false, false, false, false, false, false, false, false],
      "effect"    : null,
      "annotation": ""
    }, {
      "value"     : 4,
      "kumiKata"  : [false, false, false, false, false, false, false, false, false],
      "lockedKata": [false, false, false, false, false, false, false, false, false],
      "effect"    : null,
      "annotation": ""
    }, {
      "value"     : 0,
      "kumiKata"  : [false, false, false, false, false, false, false, false, false],
      "lockedKata": [false, false, false, false, false, false, false, false, false],
      "effect"    : null,
      "annotation": ""
    }, {
      "value"     : 2,
      "kumiKata"  : [false, false, false, false, false, false, false, false, false],
      "lockedKata": [false, false, false, false, false, false, false, false, false],
      "effect"    : null,
      "annotation": ""
    }, {
      "value"     : 1,
      "kumiKata"  : [false, false, false, false, false, false, false, false, false],
      "lockedKata": [false, false, false, false, false, false, false, false, false],
      "effect"    : null,
      "annotation": ""
    }, {
      "value"     : 7,
      "kumiKata"  : [false, false, false, false, false, false, false, false, false],
      "lockedKata": [false, false, false, false, false, false, false, false, false],
      "effect"    : null,
      "annotation": ""
    }, {
      "value"     : null,
      "kumiKata"  : [false, false, false, true, false, false, true, false, false],
      "lockedKata": [false, false, false, false, false, false, true, false, false],
      "effect"    : null,
      "annotation": ""
    }, {
      "value"     : 5,
      "kumiKata"  : [false, false, false, false, false, false, false, false, false],
      "lockedKata": [false, false, false, false, false, false, false, false, false],
      "effect"    : null,
      "annotation": ""
    }, {
      "value"     : null,
      "kumiKata"  : [false, false, false, true, true, false, false, false, false],
      "lockedKata": [false, false, false, false, true, false, false, false, false],
      "effect"    : null,
      "annotation": ""
    }, {
      "value"     : 0,
      "kumiKata"  : [false, false, false, false, false, false, false, false, false],
      "lockedKata": [false, false, false, false, false, false, false, false, false],
      "effect"    : null,
      "annotation": ""
    }, {
      "value"     : 8,
      "kumiKata"  : [false, false, false, false, false, false, false, false, false],
      "lockedKata": [false, false, false, false, false, false, false, false, false],
      "effect"    : null,
      "annotation": ""
    }, {
      "value"     : null,
      "kumiKata"  : [false, false, false, false, true, true, false, false, false],
      "lockedKata": [false, false, false, false, false, true, false, false, false],
      "effect"    : null,
      "annotation": ""
    }, {
      "value"     : 7,
      "kumiKata"  : [false, false, false, false, false, false, false, false, false],
      "lockedKata": [false, false, false, false, false, false, false, false, false],
      "effect"    : null,
      "annotation": ""
    }, {
      "value"     : null,
      "kumiKata"  : [false, false, true, true, true, true, false, false, false],
      "lockedKata": [false, false, true, true, false, true, false, false, false],
      "effect"    : null,
      "annotation": ""
    }, {
      "value"     : 6,
      "kumiKata"  : [false, false, false, false, false, false, false, false, false],
      "lockedKata": [false, false, false, false, false, false, false, false, false],
      "effect"    : null,
      "annotation": ""
    }, {
      "value"     : 1,
      "kumiKata"  : [false, false, false, false, false, false, false, false, false],
      "lockedKata": [false, false, false, false, false, false, false, false, false],
      "effect"    : null,
      "annotation": ""
    }, {
      "value"     : null,
      "kumiKata"  : [false, false, true, false, true, false, false, false, false],
      "lockedKata": [false, false, false, false, true, false, false, false, false],
      "effect"    : null,
      "annotation": ""
    }, {
      "value"     : 1,
      "kumiKata"  : [false, false, false, false, false, false, false, false, false],
      "lockedKata": [false, false, false, false, false, false, false, false, false],
      "effect"    : null,
      "annotation": ""
    }, {
      "value"     : null,
      "kumiKata"  : [false, false, true, false, false, false, false, true, false],
      "lockedKata": [false, false, true, false, false, false, false, false, false],
      "effect"    : null,
      "annotation": ""
    }, {
      "value"     : 5,
      "kumiKata"  : [false, false, false, false, false, false, false, false, false],
      "lockedKata": [false, false, false, false, false, false, false, false, false],
      "effect"    : null,
      "annotation": ""
    }, {
      "value"     : 6,
      "kumiKata"  : [false, false, false, false, false, false, false, false, false],
      "lockedKata": [false, false, false, false, false, false, false, false, false],
      "effect"    : null,
      "annotation": ""
    }, {
      "value"     : 0,
      "kumiKata"  : [false, false, false, false, false, false, false, false, false],
      "lockedKata": [false, false, false, false, false, false, false, false, false],
      "effect"    : null,
      "annotation": ""
    }, {
      "value"     : null,
      "kumiKata"  : [false, false, true, false, true, false, false, false, false],
      "lockedKata": [false, false, true, false, false, false, false, false, false],
      "effect"    : null,
      "annotation": ""
    }, {
      "value"     : 3,
      "kumiKata"  : [false, false, false, false, false, false, false, false, false],
      "lockedKata": [false, false, false, false, false, false, false, false, false],
      "effect"    : null,
      "annotation": ""
    }, {
      "value"     : 8,
      "kumiKata"  : [false, false, false, false, false, false, false, false, false],
      "lockedKata": [false, false, false, false, false, false, false, false, false],
      "effect"    : null,
      "annotation": ""
    }, {
      "value"     : null,
      "kumiKata"  : [false, false, true, false, true, false, false, true, false],
      "lockedKata": [false, false, false, false, true, false, false, false, false],
      "effect"    : null,
      "annotation": ""
    }, {
      "value"     : null,
      "kumiKata"  : [false, false, false, true, true, false, false, true, false],
      "lockedKata": [false, false, false, false, true, false, false, false, false],
      "effect"    : null,
      "annotation": ""
    }, {
      "value"     : null,
      "kumiKata"  : [false, false, true, true, false, false, false, true, false],
      "lockedKata": [false, false, true, false, false, false, false, false, false],
      "effect"    : null,
      "annotation": ""
    }, {
      "value"     : 6,
      "kumiKata"  : [false, false, false, false, false, false, false, false, false],
      "lockedKata": [false, false, false, false, false, false, false, false, false],
      "effect"    : null,
      "annotation": ""
    }, {
      "value"     : 1,
      "kumiKata"  : [false, false, false, false, false, false, false, false, false],
      "lockedKata": [false, false, false, false, false, false, false, false, false],
      "effect"    : null,
      "annotation": ""
    }, {
      "value"     : 8,
      "kumiKata"  : [false, false, false, false, false, false, false, false, false],
      "lockedKata": [false, false, false, false, false, false, false, false, false],
      "effect"    : null,
      "annotation": ""
    }, {
      "value"     : null,
      "kumiKata"  : [false, false, true, true, true, false, false, false, false],
      "lockedKata": [false, false, true, true, false, false, false, false, false],
      "effect"    : null,
      "annotation": ""
    }, {
      "value"     : 5,
      "kumiKata"  : [false, false, false, false, false, false, false, false, false],
      "lockedKata": [false, false, false, false, false, false, false, false, false],
      "effect"    : null,
      "annotation": ""
    }, {
      "value"     : null,
      "kumiKata"  : [false, false, true, false, false, false, false, true, false],
      "lockedKata": [false, false, false, false, false, false, false, false, false],
      "effect"    : null,
      "annotation": ""
    }, {
      "value"     : 0,
      "kumiKata"  : [false, false, false, false, false, false, false, false, false],
      "lockedKata": [false, false, false, false, false, false, false, false, false],
      "effect"    : null,
      "annotation": ""
    }, {
      "value"     : 8,
      "kumiKata"  : [false, false, false, false, false, false, false, false, false],
      "lockedKata": [false, false, false, false, false, false, false, false, false],
      "effect"    : null,
      "annotation": ""
    }, {
      "value"     : 1,
      "kumiKata"  : [false, false, false, false, false, false, false, false, false],
      "lockedKata": [false, false, false, false, false, false, false, false, false],
      "effect"    : null,
      "annotation": ""
    }, {
      "value"     : 7,
      "kumiKata"  : [false, false, false, false, false, false, false, false, false],
      "lockedKata": [false, false, false, false, false, false, false, false, false],
      "effect"    : null,
      "annotation": ""
    }, {
      "value"     : 3,
      "kumiKata"  : [false, false, false, false, false, false, false, false, false],
      "lockedKata": [false, false, false, false, false, false, false, false, false],
      "effect"    : null,
      "annotation": ""
    }, {
      "value"     : 4,
      "kumiKata"  : [false, false, false, false, false, false, false, false, false],
      "lockedKata": [false, false, false, false, false, false, false, false, false],
      "effect"    : null,
      "annotation": ""
    }, {
      "value"     : 0,
      "kumiKata"  : [false, false, false, false, false, false, false, false, false],
      "lockedKata": [false, false, false, false, false, false, false, false, false],
      "effect"    : null,
      "annotation": ""
    }, {
      "value"     : 2,
      "kumiKata"  : [false, false, false, false, false, false, false, false, false],
      "lockedKata": [false, false, false, false, false, false, false, false, false],
      "effect"    : null,
      "annotation": ""
    }, {
      "value"     : 5,
      "kumiKata"  : [false, false, false, false, false, false, false, false, false],
      "lockedKata": [false, false, false, false, false, false, false, false, false],
      "effect"    : null,
      "annotation": ""
    }, {
      "value"     : 6,
      "kumiKata"  : [false, false, false, false, false, false, false, false, false],
      "lockedKata": [false, false, false, false, false, false, false, false, false],
      "effect"    : null,
      "annotation": ""
    }, {
      "value"     : 5,
      "kumiKata"  : [false, false, false, false, false, false, false, false, false],
      "lockedKata": [false, false, false, false, false, false, false, false, false],
      "effect"    : null,
      "annotation": ""
    }, {
      "value"     : 6,
      "kumiKata"  : [false, false, false, false, false, false, false, false, false],
      "lockedKata": [false, false, false, false, false, false, false, false, false],
      "effect"    : null,
      "annotation": ""
    }, {
      "value"     : 3,
      "kumiKata"  : [false, false, false, false, false, false, false, false, false],
      "lockedKata": [false, false, false, false, false, false, false, false, false],
      "effect"    : null,
      "annotation": ""
    }, {
      "value"     : 2,
      "kumiKata"  : [false, false, false, false, false, false, false, false, false],
      "lockedKata": [false, false, false, false, false, false, false, false, false],
      "effect"    : null,
      "annotation": ""
    }, {
      "value"     : 1,
      "kumiKata"  : [false, false, false, false, false, false, false, false, false],
      "lockedKata": [false, false, false, false, false, false, false, false, false],
      "effect"    : null,
      "annotation": ""
    }, {
      "value"     : 7,
      "kumiKata"  : [false, false, false, false, false, false, false, false, false],
      "lockedKata": [false, false, false, false, false, false, false, false, false],
      "effect"    : null,
      "annotation": ""
    }, {
      "value"     : 4,
      "kumiKata"  : [false, false, false, false, false, false, false, false, false],
      "lockedKata": [false, false, false, false, false, false, false, false, false],
      "effect"    : null,
      "annotation": ""
    }, {
      "value"     : 0,
      "kumiKata"  : [false, false, false, false, false, false, false, false, false],
      "lockedKata": [false, false, false, false, false, false, false, false, false],
      "effect"    : null,
      "annotation": ""
    }, {
      "value"     : 8,
      "kumiKata"  : [false, false, false, false, false, false, false, false, false],
      "lockedKata": [false, false, false, false, false, false, false, false, false],
      "effect"    : null,
      "annotation": ""
    }, {
      "value"     : 0,
      "kumiKata"  : [false, false, false, false, false, false, false, false, false],
      "lockedKata": [false, false, false, false, false, false, false, false, false],
      "effect"    : null,
      "annotation": ""
    }, {
      "value"     : 4,
      "kumiKata"  : [false, false, false, false, false, false, false, false, false],
      "lockedKata": [false, false, false, false, false, false, false, false, false],
      "effect"    : null,
      "annotation": ""
    }, {
      "value"     : 2,
      "kumiKata"  : [false, false, false, false, false, false, false, false, false],
      "lockedKata": [false, false, false, false, false, false, false, false, false],
      "effect"    : null,
      "annotation": ""
    }, {
      "value"     : null,
      "kumiKata"  : [false, false, false, false, false, true, false, false, true],
      "lockedKata": [false, false, false, false, false, true, false, false, true],
      "effect"    : null,
      "annotation": ""
    }, {
      "value"     : 6,
      "kumiKata"  : [false, false, false, false, false, false, false, false, false],
      "lockedKata": [false, false, false, false, false, false, false, false, false],
      "effect"    : null,
      "annotation": ""
    }, {
      "value"     : null,
      "kumiKata"  : [false, false, false, false, false, true, false, false, true],
      "lockedKata": [false, false, false, false, false, true, false, false, true],
      "effect"    : null,
      "annotation": ""
    }, {
      "value"     : 1,
      "kumiKata"  : [false, false, false, false, false, false, false, false, false],
      "lockedKata": [false, false, false, false, false, false, false, false, false],
      "effect"    : null,
      "annotation": ""
    }, {
      "value"     : null,
      "kumiKata"  : [false, false, false, true, false, false, false, true, false],
      "lockedKata": [false, false, false, true, false, false, false, true, false],
      "effect"    : null,
      "annotation": ""
    }, {
      "value"     : null,
      "kumiKata"  : [false, false, false, true, false, false, false, true, false],
      "lockedKata": [false, false, false, true, false, false, false, true, false],
      "effect"    : null,
      "annotation": ""
    }
  ],
  "grid2"  : [
    {
      "value"     : null,
      "kumiKata"  : [false, false, false, true, false, false, true, true, false],
      "lockedKata": [false, false, false, false, false, false, true, true, false],
      "effect"    : null,
      "annotation": ""
    }, {
      "value"     : null,
      "kumiKata"  : [false, false, false, true, false, false, false, true, false],
      "lockedKata": [false, false, false, false, false, false, false, true, false],
      "effect"    : null,
      "annotation": ""
    }, {
      "value"     : 1,
      "kumiKata"  : [false, false, false, false, false, false, false, false, false],
      "lockedKata": [false, false, false, false, false, false, false, false, false],
      "effect"    : null,
      "annotation": ""
    }, {
      "value"     : null,
      "kumiKata"  : [false, false, false, false, true, false, false, false, true],
      "lockedKata": [false, false, false, false, true, false, false, false, true],
      "effect"    : 1,
      "annotation": "AB1"
    }, {
      "value"     : 5,
      "kumiKata"  : [false, false, false, false, false, false, false, false, false],
      "lockedKata": [false, false, false, false, false, false, false, false, false],
      "effect"    : null,
      "annotation": ""
    }, {
      "value"     : null,
      "kumiKata"  : [false, false, false, false, true, false, false, false, true],
      "lockedKata": [false, false, false, false, true, false, false, false, true],
      "effect"    : 1,
      "annotation": "AB2"
    }, {
      "value"     : 0,
      "kumiKata"  : [false, false, false, false, false, false, false, false, false],
      "lockedKata": [false, false, false, false, false, false, false, false, false],
      "effect"    : null,
      "annotation": ""
    }, {
      "value"     : null,
      "kumiKata"  : [false, false, true, true, false, false, true, false, false],
      "lockedKata": [false, false, true, false, false, false, true, false, false],
      "effect"    : null,
      "annotation": ""
    }, {
      "value"     : null,
      "kumiKata"  : [false, false, true, true, false, false, false, false, false],
      "lockedKata": [false, false, true, false, false, false, false, false, false],
      "effect"    : null,
      "annotation": ""
    }, {
      "value"     : 2,
      "kumiKata"  : [false, false, false, false, false, false, false, false, false],
      "lockedKata": [false, false, false, false, false, false, false, false, false],
      "effect"    : null,
      "annotation": ""
    }, {
      "value"     : 5,
      "kumiKata"  : [false, false, false, false, false, false, false, false, false],
      "lockedKata": [false, false, false, false, false, false, false, false, false],
      "effect"    : null,
      "annotation": ""
    }, {
      "value"     : 0,
      "kumiKata"  : [false, false, false, false, false, false, false, false, false],
      "lockedKata": [false, false, false, false, false, false, false, false, false],
      "effect"    : null,
      "annotation": ""
    }, {
      "value"     : 7,
      "kumiKata"  : [false, false, false, false, false, false, false, false, false],
      "lockedKata": [false, false, false, false, false, false, false, false, false],
      "effect"    : null,
      "annotation": ""
    }, {
      "value"     : 3,
      "kumiKata"  : [false, false, false, false, false, false, false, false, false],
      "lockedKata": [false, false, false, false, false, false, false, false, false],
      "effect"    : null,
      "annotation": ""
    }, {
      "value"     : 6,
      "kumiKata"  : [false, false, false, false, false, false, false, false, false],
      "lockedKata": [false, false, false, false, false, false, false, false, false],
      "effect"    : null,
      "annotation": ""
    }, {
      "value"     : 8,
      "kumiKata"  : [false, false, false, false, false, false, false, false, false],
      "lockedKata": [false, false, false, false, false, false, false, false, false],
      "effect"    : null,
      "annotation": ""
    }, {
      "value"     : 4,
      "kumiKata"  : [false, false, false, false, false, false, false, false, false],
      "lockedKata": [false, false, false, false, false, false, false, false, false],
      "effect"    : null,
      "annotation": ""
    }, {
      "value"     : 1,
      "kumiKata"  : [false, false, false, false, false, false, false, false, false],
      "lockedKata": [false, false, false, false, false, false, false, false, false],
      "effect"    : null,
      "annotation": ""
    }, {
      "value"     : null,
      "kumiKata"  : [false, false, false, true, false, false, true, false, false],
      "lockedKata": [false, false, false, false, false, false, true, false, false],
      "effect"    : null,
      "annotation": ""
    }, {
      "value"     : 8,
      "kumiKata"  : [false, false, false, false, false, false, false, false, false],
      "lockedKata": [false, false, false, false, false, false, false, false, false],
      "effect"    : null,
      "annotation": ""
    }, {
      "value"     : 4,
      "kumiKata"  : [false, false, false, false, false, false, false, false, false],
      "lockedKata": [false, false, false, false, false, false, false, false, false],
      "effect"    : null,
      "annotation": ""
    }, {
      "value"     : 0,
      "kumiKata"  : [false, false, false, false, false, false, false, false, false],
      "lockedKata": [false, false, false, false, false, false, false, false, false],
      "effect"    : null,
      "annotation": ""
    }, {
      "value"     : 2,
      "kumiKata"  : [false, false, false, false, false, false, false, false, false],
      "lockedKata": [false, false, false, false, false, false, false, false, false],
      "effect"    : null,
      "annotation": ""
    }, {
      "value"     : 1,
      "kumiKata"  : [false, false, false, false, false, false, false, false, false],
      "lockedKata": [false, false, false, false, false, false, false, false, false],
      "effect"    : null,
      "annotation": ""
    }, {
      "value"     : 7,
      "kumiKata"  : [false, false, false, false, false, false, false, false, false],
      "lockedKata": [false, false, false, false, false, false, false, false, false],
      "effect"    : null,
      "annotation": ""
    }, {
      "value"     : null,
      "kumiKata"  : [false, false, false, true, false, false, true, false, false],
      "lockedKata": [false, false, false, false, false, false, true, false, false],
      "effect"    : null,
      "annotation": ""
    }, {
      "value"     : 5,
      "kumiKata"  : [false, false, false, false, false, false, false, false, false],
      "lockedKata": [false, false, false, false, false, false, false, false, false],
      "effect"    : null,
      "annotation": ""
    }, {
      "value"     : null,
      "kumiKata"  : [false, false, false, true, true, false, false, false, false],
      "lockedKata": [false, false, false, false, true, false, false, false, false],
      "effect"    : null,
      "annotation": ""
    }, {
      "value"     : 0,
      "kumiKata"  : [false, false, false, false, false, false, false, false, false],
      "lockedKata": [false, false, false, false, false, false, false, false, false],
      "effect"    : null,
      "annotation": ""
    }, {
      "value"     : 8,
      "kumiKata"  : [false, false, false, false, false, false, false, false, false],
      "lockedKata": [false, false, false, false, false, false, false, false, false],
      "effect"    : null,
      "annotation": ""
    }, {
      "value"     : null,
      "kumiKata"  : [false, false, false, false, true, true, false, false, false],
      "lockedKata": [false, false, false, false, false, true, false, false, false],
      "effect"    : 3,
      "annotation": "AC1"
    }, {
      "value"     : 7,
      "kumiKata"  : [false, false, false, false, false, false, false, false, false],
      "lockedKata": [false, false, false, false, false, false, false, false, false],
      "effect"    : null,
      "annotation": ""
    }, {
      "value"     : null,
      "kumiKata"  : [false, false, true, true, false, false, false, false, false],
      "lockedKata": [false, false, true, true, false, false, false, false, false],
      "effect"    : 3,
      "annotation": "AC2"
    }, {
      "value"     : 6,
      "kumiKata"  : [false, false, false, false, false, false, false, false, false],
      "lockedKata": [false, false, false, false, false, false, false, false, false],
      "effect"    : null,
      "annotation": ""
    }, {
      "value"     : 1,
      "kumiKata"  : [false, false, false, false, false, false, false, false, false],
      "lockedKata": [false, false, false, false, false, false, false, false, false],
      "effect"    : null,
      "annotation": ""
    }, {
      "value"     : null,
      "kumiKata"  : [false, false, true, false, true, false, false, false, false],
      "lockedKata": [false, false, false, false, true, false, false, false, false],
      "effect"    : null,
      "annotation": ""
    }, {
      "value"     : 1,
      "kumiKata"  : [false, false, false, false, false, false, false, false, false],
      "lockedKata": [false, false, false, false, false, false, false, false, false],
      "effect"    : null,
      "annotation": ""
    }, {
      "value"     : null,
      "kumiKata"  : [false, false, true, false, false, false, false, true, false],
      "lockedKata": [false, false, true, false, false, false, false, false, false],
      "effect"    : null,
      "annotation": ""
    }, {
      "value"     : 5,
      "kumiKata"  : [false, false, false, false, false, false, false, false, false],
      "lockedKata": [false, false, false, false, false, false, false, false, false],
      "effect"    : null,
      "annotation": ""
    }, {
      "value"     : 6,
      "kumiKata"  : [false, false, false, false, false, false, false, false, false],
      "lockedKata": [false, false, false, false, false, false, false, false, false],
      "effect"    : null,
      "annotation": ""
    }, {
      "value"     : 0,
      "kumiKata"  : [false, false, false, false, false, false, false, false, false],
      "lockedKata": [false, false, false, false, false, false, false, false, false],
      "effect"    : null,
      "annotation": ""
    }, {
      "value"     : null,
      "kumiKata"  : [false, false, true, false, true, false, false, false, false],
      "lockedKata": [false, false, true, false, false, false, false, false, false],
      "effect"    : null,
      "annotation": ""
    }, {
      "value"     : 3,
      "kumiKata"  : [false, false, false, false, false, false, false, false, false],
      "lockedKata": [false, false, false, false, false, false, false, false, false],
      "effect"    : null,
      "annotation": ""
    }, {
      "value"     : 8,
      "kumiKata"  : [false, false, false, false, false, false, false, false, false],
      "lockedKata": [false, false, false, false, false, false, false, false, false],
      "effect"    : null,
      "annotation": ""
    }, {
      "value"     : null,
      "kumiKata"  : [false, false, true, false, true, false, false, true, false],
      "lockedKata": [false, false, false, false, true, false, false, false, false],
      "effect"    : null,
      "annotation": ""
    }, {
      "value"     : null,
      "kumiKata"  : [false, false, false, true, true, false, false, true, false],
      "lockedKata": [false, false, false, false, true, false, false, false, false],
      "effect"    : null,
      "annotation": ""
    }, {
      "value"     : null,
      "kumiKata"  : [false, false, true, true, false, false, false, true, false],
      "lockedKata": [false, false, true, false, false, false, false, false, false],
      "effect"    : null,
      "annotation": ""
    }, {
      "value"     : 6,
      "kumiKata"  : [false, false, false, false, false, false, false, false, false],
      "lockedKata": [false, false, false, false, false, false, false, false, false],
      "effect"    : null,
      "annotation": ""
    }, {
      "value"     : 1,
      "kumiKata"  : [false, false, false, false, false, false, false, false, false],
      "lockedKata": [false, false, false, false, false, false, false, false, false],
      "effect"    : null,
      "annotation": ""
    }, {
      "value"     : 8,
      "kumiKata"  : [false, false, false, false, false, false, false, false, false],
      "lockedKata": [false, false, false, false, false, false, false, false, false],
      "effect"    : null,
      "annotation": ""
    }, {
      "value"     : null,
      "kumiKata"  : [false, false, true, true, true, false, false, false, false],
      "lockedKata": [false, false, true, true, false, false, false, false, false],
      "effect"    : null,
      "annotation": ""
    }, {
      "value"     : 5,
      "kumiKata"  : [false, false, false, false, false, false, false, false, false],
      "lockedKata": [false, false, false, false, false, false, false, false, false],
      "effect"    : null,
      "annotation": ""
    }, {
      "value"     : null,
      "kumiKata"  : [false, false, true, false, false, false, false, true, false],
      "lockedKata": [false, false, false, false, false, false, false, false, false],
      "effect"    : null,
      "annotation": ""
    }, {
      "value"     : 0,
      "kumiKata"  : [false, false, false, false, false, false, false, false, false],
      "lockedKata": [false, false, false, false, false, false, false, false, false],
      "effect"    : null,
      "annotation": ""
    }, {
      "value"     : 8,
      "kumiKata"  : [false, false, false, false, false, false, false, false, false],
      "lockedKata": [false, false, false, false, false, false, false, false, false],
      "effect"    : null,
      "annotation": ""
    }, {
      "value"     : 1,
      "kumiKata"  : [false, false, false, false, false, false, false, false, false],
      "lockedKata": [false, false, false, false, false, false, false, false, false],
      "effect"    : null,
      "annotation": ""
    }, {
      "value"     : 7,
      "kumiKata"  : [false, false, false, false, false, false, false, false, false],
      "lockedKata": [false, false, false, false, false, false, false, false, false],
      "effect"    : null,
      "annotation": ""
    }, {
      "value"     : 3,
      "kumiKata"  : [false, false, false, false, false, false, false, false, false],
      "lockedKata": [false, false, false, false, false, false, false, false, false],
      "effect"    : null,
      "annotation": ""
    }, {
      "value"     : 4,
      "kumiKata"  : [false, false, false, false, false, false, false, false, false],
      "lockedKata": [false, false, false, false, false, false, false, false, false],
      "effect"    : null,
      "annotation": ""
    }, {
      "value"     : 0,
      "kumiKata"  : [false, false, false, false, false, false, false, false, false],
      "lockedKata": [false, false, false, false, false, false, false, false, false],
      "effect"    : null,
      "annotation": ""
    }, {
      "value"     : 2,
      "kumiKata"  : [false, false, false, false, false, false, false, false, false],
      "lockedKata": [false, false, false, false, false, false, false, false, false],
      "effect"    : null,
      "annotation": ""
    }, {
      "value"     : 5,
      "kumiKata"  : [false, false, false, false, false, false, false, false, false],
      "lockedKata": [false, false, false, false, false, false, false, false, false],
      "effect"    : null,
      "annotation": ""
    }, {
      "value"     : 6,
      "kumiKata"  : [false, false, false, false, false, false, false, false, false],
      "lockedKata": [false, false, false, false, false, false, false, false, false],
      "effect"    : null,
      "annotation": ""
    }, {
      "value"     : 5,
      "kumiKata"  : [false, false, false, false, false, false, false, false, false],
      "lockedKata": [false, false, false, false, false, false, false, false, false],
      "effect"    : null,
      "annotation": ""
    }, {
      "value"     : 6,
      "kumiKata"  : [false, false, false, false, false, false, false, false, false],
      "lockedKata": [false, false, false, false, false, false, false, false, false],
      "effect"    : null,
      "annotation": ""
    }, {
      "value"     : 3,
      "kumiKata"  : [false, false, false, false, false, false, false, false, false],
      "lockedKata": [false, false, false, false, false, false, false, false, false],
      "effect"    : null,
      "annotation": ""
    }, {
      "value"     : 2,
      "kumiKata"  : [false, false, false, false, false, false, false, false, false],
      "lockedKata": [false, false, false, false, false, false, false, false, false],
      "effect"    : null,
      "annotation": ""
    }, {
      "value"     : 1,
      "kumiKata"  : [false, false, false, false, false, false, false, false, false],
      "lockedKata": [false, false, false, false, false, false, false, false, false],
      "effect"    : null,
      "annotation": ""
    }, {
      "value"     : 7,
      "kumiKata"  : [false, false, false, false, false, false, false, false, false],
      "lockedKata": [false, false, false, false, false, false, false, false, false],
      "effect"    : null,
      "annotation": ""
    }, {
      "value"     : 4,
      "kumiKata"  : [false, false, false, false, false, false, false, false, false],
      "lockedKata": [false, false, false, false, false, false, false, false, false],
      "effect"    : null,
      "annotation": ""
    }, {
      "value"     : 0,
      "kumiKata"  : [false, false, false, false, false, false, false, false, false],
      "lockedKata": [false, false, false, false, false, false, false, false, false],
      "effect"    : null,
      "annotation": ""
    }, {
      "value"     : 8,
      "kumiKata"  : [false, false, false, false, false, false, false, false, false],
      "lockedKata": [false, false, false, false, false, false, false, false, false],
      "effect"    : null,
      "annotation": ""
    }, {
      "value"     : 0,
      "kumiKata"  : [false, false, false, false, false, false, false, false, false],
      "lockedKata": [false, false, false, false, false, false, false, false, false],
      "effect"    : null,
      "annotation": ""
    }, {
      "value"     : 4,
      "kumiKata"  : [false, false, false, false, false, false, false, false, false],
      "lockedKata": [false, false, false, false, false, false, false, false, false],
      "effect"    : null,
      "annotation": ""
    }, {
      "value"     : 2,
      "kumiKata"  : [false, false, false, false, false, false, false, false, false],
      "lockedKata": [false, false, false, false, false, false, false, false, false],
      "effect"    : null,
      "annotation": ""
    }, {
      "value"     : null,
      "kumiKata"  : [false, false, false, false, false, true, false, false, true],
      "lockedKata": [false, false, false, false, false, true, false, false, true],
      "effect"    : 5,
      "annotation": "BC1"
    }, {
      "value"     : 6,
      "kumiKata"  : [false, false, false, false, false, false, false, false, false],
      "lockedKata": [false, false, false, false, false, false, false, false, false],
      "effect"    : null,
      "annotation": ""
    }, {
      "value"     : null,
      "kumiKata"  : [false, false, false, false, false, true, false, false, true],
      "lockedKata": [false, false, false, false, false, true, false, false, true],
      "effect"    : 5,
      "annotation": "BC2"
    }, {
      "value"     : 1,
      "kumiKata"  : [false, false, false, false, false, false, false, false, false],
      "lockedKata": [false, false, false, false, false, false, false, false, false],
      "effect"    : null,
      "annotation": ""
    }, {
      "value"     : null,
      "kumiKata"  : [false, false, false, true, false, false, false, true, false],
      "lockedKata": [false, false, false, true, false, false, false, true, false],
      "effect"    : null,
      "annotation": ""
    }, {
      "value"     : null,
      "kumiKata"  : [false, false, false, true, false, false, false, true, false],
      "lockedKata": [false, false, false, true, false, false, false, true, false],
      "effect"    : null,
      "annotation": ""
    }
  ]
}