[
  {
    "value"     : 0,
    "kumiKata"  : [false, false, false, false, false, false, false, false, false],
    "lockedKata": [false, false, false, false, false, false, false, false, false],
    "effect"    : null,
    "annotation": ""
  }, {
  "value"     : 3,
  "kumiKata"  : [false, false, false, false, false, false, false, false, false],
  "lockedKata": [false, false, false, false, false, false, false, false, false],
  "effect"    : null,
  "annotation": ""
}, {
  "value"     : 4,
  "kumiKata"  : [false, false, false, false, false, false, false, false, false],
  "lockedKata": [false, false, false, false, false, false, false, false, false],
  "effect"    : null,
  "annotation": ""
}, {
  "value"     : 5,
  "kumiKata"  : [false, false, false, false, false, false, false, false, false],
  "lockedKata": [false, false, false, false, false, false, false, false, false],
  "effect"    : null,
  "annotation": ""
}, {
  "value"     : 2,
  "kumiKata"  : [false, false, false, false, false, false, false, false, false],
  "lockedKata": [false, false, false, false, false, false, false, false, false],
  "effect"    : null,
  "annotation": ""
}, {
  "value"     : 8,
  "kumiKata"  : [false, false, false, false, false, false, false, false, false],
  "lockedKata": [false, false, false, false, false, false, false, false, false],
  "effect"    : null,
  "annotation": ""
}, {
  "value"     : 7,
  "kumiKata"  : [false, false, false, false, false, false, false, false, false],
  "lockedKata": [false, false, false, false, false, false, false, false, false],
  "effect"    : null,
  "annotation": ""
}, {
  "value"     : 6,
  "kumiKata"  : [false, false, false, false, false, false, false, false, false],
  "lockedKata": [false, false, false, false, false, false, false, false, false],
  "effect"    : null,
  "annotation": ""
}, {
  "value"     : 1,
  "kumiKata"  : [false, false, false, false, false, false, false, false, false],
  "lockedKata": [false, false, false, false, false, false, false, false, false],
  "effect"    : null,
  "annotation": ""
}, {
  "value"     : 1,
  "kumiKata"  : [false, false, false, false, false, false, false, false, false],
  "lockedKata": [false, false, false, false, false, false, false, false, false],
  "effect"    : null,
  "annotation": ""
}, {
  "value"     : null,
  "kumiKata"  : [false, false, false, false, false, false, false, true, true],
  "lockedKata": [false, false, false, false, false, false, false, false, false],
  "effect"    : 1,
  "annotation": "A"
}, {
  "value"     : 5,
  "kumiKata"  : [false, false, false, false, false, false, false, false, false],
  "lockedKata": [false, false, false, false, false, false, false, false, false],
  "effect"    : null,
  "annotation": ""
}, {
  "value"     : null,
  "kumiKata"  : [false, false, false, false, false, false, true, true, false],
  "lockedKata": [false, false, false, false, false, false, false, false, false],
  "effect"    : null,
  "annotation": ""
}, {
  "value"     : 4,
  "kumiKata"  : [false, false, false, false, false, false, false, false, false],
  "lockedKata": [false, false, false, false, false, false, false, false, false],
  "effect"    : null,
  "annotation": ""
}, {
  "value"     : null,
  "kumiKata"  : [false, false, false, true, false, false, true, false, false],
  "lockedKata": [false, false, false, false, false, false, false, false, false],
  "effect"    : 3,
  "annotation": "E"
}, {
  "value"     : 0,
  "kumiKata"  : [false, false, false, false, false, false, false, false, false],
  "lockedKata": [false, false, false, false, false, false, false, false, false],
  "effect"    : null,
  "annotation": ""
}, {
  "value"     : null,
  "kumiKata"  : [false, false, false, true, false, false, false, false, true],
  "lockedKata": [false, false, false, false, false, false, false, false, false],
  "effect"    : null,
  "annotation": ""
}, {
  "value"     : 2,
  "kumiKata"  : [false, false, false, false, false, false, false, false, false],
  "lockedKata": [false, false, false, false, false, false, false, false, false],
  "effect"    : null,
  "annotation": ""
}, {
  "value"     : 6,
  "kumiKata"  : [false, false, false, false, false, false, false, false, false],
  "lockedKata": [false, false, false, false, false, false, false, false, false],
  "effect"    : null,
  "annotation": ""
}, {
  "value"     : 2,
  "kumiKata"  : [false, false, false, false, false, false, false, false, false],
  "lockedKata": [false, false, false, false, false, false, false, false, false],
  "effect"    : null,
  "annotation": ""
}, {
  "value"     : null,
  "kumiKata"  : [false, false, false, false, false, false, false, true, true],
  "lockedKata": [false, false, false, false, false, false, false, false, false],
  "effect"    : 3,
  "annotation": "B"
}, {
  "value"     : null,
  "kumiKata"  : [false, true, false, false, false, false, false, true, false],
  "lockedKata": [false, false, false, false, false, false, false, false, false],
  "effect"    : 3,
  "annotation": "C"
}, {
  "value"     : 0,
  "kumiKata"  : [false, false, false, false, false, false, false, false, false],
  "lockedKata": [false, false, false, false, false, false, false, false, false],
  "effect"    : null,
  "annotation": ""
}, {
  "value"     : null,
  "kumiKata"  : [false, true, false, true, false, false, false, false, false],
  "lockedKata": [false, false, false, false, false, false, false, false, false],
  "effect"    : 3,
  "annotation": "D"
}, {
  "value"     : null,
  "kumiKata"  : [false, false, false, true, true, false, false, false, false],
  "lockedKata": [false, false, false, false, false, false, false, false, false],
  "effect"    : null,
  "annotation": ""
}, {
  "value"     : null,
  "kumiKata"  : [false, false, false, true, true, false, false, false, true],
  "lockedKata": [false, false, false, false, false, false, false, false, false],
  "effect"    : null,
  "annotation": ""
}, {
  "value"     : 5,
  "kumiKata"  : [false, false, false, false, false, false, false, false, false],
  "lockedKata": [false, false, false, false, false, false, false, false, false],
  "effect"    : null,
  "annotation": ""
}, {
  "value"     : 3,
  "kumiKata"  : [false, false, false, false, false, false, false, false, false],
  "lockedKata": [false, false, false, false, false, false, false, false, false],
  "effect"    : null,
  "annotation": ""
}, {
  "value"     : null,
  "kumiKata"  : [true, false, false, false, false, false, false, false, false],
  "lockedKata": [false, false, false, false, false, false, false, false, false],
  "effect"    : 4,
  "annotation": ""
}, {
  "value"     : null,
  "kumiKata"  : [false, false, false, false, false, false, true, true, false],
  "lockedKata": [false, false, false, false, false, false, false, false, false],
  "effect"    : 1,
  "annotation": "K"
}, {
  "value"     : null,
  "kumiKata"  : [true, true, true, false, false, false, false, false, false],
  "lockedKata": [false, false, false, false, false, false, false, false, false],
  "effect"    : null,
  "annotation": ""
}, {
  "value"     : 8,
  "kumiKata"  : [false, false, false, false, false, false, false, false, false],
  "lockedKata": [false, false, false, false, false, false, false, false, false],
  "effect"    : null,
  "annotation": ""
}, {
  "value"     : null,
  "kumiKata"  : [false, true, true, false, false, false, false, false, false],
  "lockedKata": [false, false, false, false, false, false, false, false, false],
  "effect"    : 3,
  "annotation": "G"
}, {
  "value"     : null,
  "kumiKata"  : [false, false, false, false, false, true, true, false, false],
  "lockedKata": [false, false, false, false, false, false, false, false, false],
  "effect"    : null,
  "annotation": ""
}, {
  "value"     : null,
  "kumiKata"  : [false, true, false, false, false, true, false, false, false],
  "lockedKata": [false, false, false, false, false, false, false, false, false],
  "effect"    : null,
  "annotation": ""
}, {
  "value"     : 4,
  "kumiKata"  : [false, false, false, false, false, false, false, false, false],
  "lockedKata": [false, false, false, false, false, false, false, false, false],
  "effect"    : null,
  "annotation": ""
}, {
  "value"     : 4,
  "kumiKata"  : [false, false, false, false, false, false, false, false, false],
  "lockedKata": [false, false, false, false, false, false, false, false, false],
  "effect"    : null,
  "annotation": ""
}, {
  "value"     : 5,
  "kumiKata"  : [false, false, false, false, false, false, false, false, false],
  "lockedKata": [false, false, false, false, false, false, false, false, false],
  "effect"    : null,
  "annotation": ""
}, {
  "value"     : 1,
  "kumiKata"  : [false, false, false, false, false, false, false, false, false],
  "lockedKata": [false, false, false, false, false, false, false, false, false],
  "effect"    : null,
  "annotation": ""
}, {
  "value"     : 3,
  "kumiKata"  : [false, false, false, false, false, false, false, false, false],
  "lockedKata": [false, false, false, false, false, false, false, false, false],
  "effect"    : null,
  "annotation": ""
}, {
  "value"     : 6,
  "kumiKata"  : [false, false, false, false, false, false, false, false, false],
  "lockedKata": [false, false, false, false, false, false, false, false, false],
  "effect"    : null,
  "annotation": ""
}, {
  "value"     : 7,
  "kumiKata"  : [false, false, false, false, false, false, false, false, false],
  "lockedKata": [false, false, false, false, false, false, false, false, false],
  "effect"    : null,
  "annotation": ""
}, {
  "value"     : 8,
  "kumiKata"  : [false, false, false, false, false, false, false, false, false],
  "lockedKata": [false, false, false, false, false, false, false, false, false],
  "effect"    : null,
  "annotation": ""
}, {
  "value"     : 2,
  "kumiKata"  : [false, false, false, false, false, false, false, false, false],
  "lockedKata": [false, false, false, false, false, false, false, false, false],
  "effect"    : null,
  "annotation": ""
}, {
  "value"     : 0,
  "kumiKata"  : [false, false, false, false, false, false, false, false, false],
  "lockedKata": [false, false, false, false, false, false, false, false, false],
  "effect"    : null,
  "annotation": ""
}, {
  "value"     : 2,
  "kumiKata"  : [false, false, false, false, false, false, false, false, false],
  "lockedKata": [false, false, false, false, false, false, false, false, false],
  "effect"    : null,
  "annotation": ""
}, {
  "value"     : null,
  "kumiKata"  : [true, false, false, false, false, false, false, false, true],
  "lockedKata": [false, false, false, false, false, false, false, false, false],
  "effect"    : 3,
  "annotation": "I"
}, {
  "value"     : null,
  "kumiKata"  : [false, false, false, false, false, false, true, false, true],
  "lockedKata": [false, false, false, false, false, false, false, false, false],
  "effect"    : 3,
  "annotation": "J"
}, {
  "value"     : null,
  "kumiKata"  : [true, true, false, false, false, false, false, false, false],
  "lockedKata": [false, false, false, false, false, false, false, false, false],
  "effect"    : 3,
  "annotation": "H"
}, {
  "value"     : 5,
  "kumiKata"  : [false, false, false, false, false, false, false, false, false],
  "lockedKata": [false, false, false, false, false, false, false, false, false],
  "effect"    : null,
  "annotation": ""
}, {
  "value"     : 4,
  "kumiKata"  : [false, false, false, false, false, false, false, false, false],
  "lockedKata": [false, false, false, false, false, false, false, false, false],
  "effect"    : null,
  "annotation": ""
}, {
  "value"     : null,
  "kumiKata"  : [false, false, false, true, false, false, true, false, false],
  "lockedKata": [false, false, false, false, false, false, false, false, false],
  "effect"    : null,
  "annotation": ""
}, {
  "value"     : null,
  "kumiKata"  : [false, true, false, true, false, false, false, false, false],
  "lockedKata": [false, false, false, false, false, false, false, false, false],
  "effect"    : null,
  "annotation": ""
}, {
  "value"     : 7,
  "kumiKata"  : [false, false, false, false, false, false, false, false, false],
  "lockedKata": [false, false, false, false, false, false, false, false, false],
  "effect"    : null,
  "annotation": ""
}, {
  "value"     : 5,
  "kumiKata"  : [false, false, false, false, false, false, false, false, false],
  "lockedKata": [false, false, false, false, false, false, false, false, false],
  "effect"    : null,
  "annotation": ""
}, {
  "value"     : 4,
  "kumiKata"  : [false, false, false, false, false, false, false, false, false],
  "lockedKata": [false, false, false, false, false, false, false, false, false],
  "effect"    : null,
  "annotation": ""
}, {
  "value"     : 3,
  "kumiKata"  : [false, false, false, false, false, false, false, false, false],
  "lockedKata": [false, false, false, false, false, false, false, false, false],
  "effect"    : null,
  "annotation": ""
}, {
  "value"     : 8,
  "kumiKata"  : [false, false, false, false, false, false, false, false, false],
  "lockedKata": [false, false, false, false, false, false, false, false, false],
  "effect"    : null,
  "annotation": ""
}, {
  "value"     : 1,
  "kumiKata"  : [false, false, false, false, false, false, false, false, false],
  "lockedKata": [false, false, false, false, false, false, false, false, false],
  "effect"    : null,
  "annotation": ""
}, {
  "value"     : 0,
  "kumiKata"  : [false, false, false, false, false, false, false, false, false],
  "lockedKata": [false, false, false, false, false, false, false, false, false],
  "effect"    : null,
  "annotation": ""
}, {
  "value"     : 2,
  "kumiKata"  : [false, false, false, false, false, false, false, false, false],
  "lockedKata": [false, false, false, false, false, false, false, false, false],
  "effect"    : null,
  "annotation": ""
}, {
  "value"     : 7,
  "kumiKata"  : [false, false, false, false, false, false, false, false, false],
  "lockedKata": [false, false, false, false, false, false, false, false, false],
  "effect"    : null,
  "annotation": ""
}, {
  "value"     : 6,
  "kumiKata"  : [false, false, false, false, false, false, false, false, false],
  "lockedKata": [false, false, false, false, false, false, false, false, false],
  "effect"    : null,
  "annotation": ""
}, {
  "value"     : 7,
  "kumiKata"  : [false, false, false, false, false, false, false, false, false],
  "lockedKata": [false, false, false, false, false, false, false, false, false],
  "effect"    : null,
  "annotation": ""
}, {
  "value"     : 1,
  "kumiKata"  : [false, false, false, false, false, false, false, false, false],
  "lockedKata": [false, false, false, false, false, false, false, false, false],
  "effect"    : null,
  "annotation": ""
}, {
  "value"     : 0,
  "kumiKata"  : [false, false, false, false, false, false, false, false, false],
  "lockedKata": [false, false, false, false, false, false, false, false, false],
  "effect"    : null,
  "annotation": ""
}, {
  "value"     : null,
  "kumiKata"  : [false, false, true, false, false, false, true, false, false],
  "lockedKata": [false, false, false, false, false, false, false, false, false],
  "effect"    : null,
  "annotation": ""
}, {
  "value"     : 3,
  "kumiKata"  : [false, false, false, false, false, false, false, false, false],
  "lockedKata": [false, false, false, false, false, false, false, false, false],
  "effect"    : null,
  "annotation": ""
}, {
  "value"     : null,
  "kumiKata"  : [false, false, true, false, false, false, true, false, false],
  "lockedKata": [false, false, false, false, false, false, false, false, false],
  "effect"    : 3,
  "annotation": "F"
}, {
  "value"     : null,
  "kumiKata"  : [false, false, false, false, true, true, false, false, false],
  "lockedKata": [false, false, false, false, false, false, false, false, false],
  "effect"    : null,
  "annotation": ""
}, {
  "value"     : null,
  "kumiKata"  : [false, false, false, false, true, true, false, false, false],
  "lockedKata": [false, false, false, false, false, false, false, false, false],
  "effect"    : null,
  "annotation": ""
}, {
  "value"     : 8,
  "kumiKata"  : [false, false, false, false, false, false, false, false, false],
  "lockedKata": [false, false, false, false, false, false, false, false, false],
  "effect"    : null,
  "annotation": ""
}, {
  "value"     : 8,
  "kumiKata"  : [false, false, false, false, false, false, false, false, false],
  "lockedKata": [false, false, false, false, false, false, false, false, false],
  "effect"    : null,
  "annotation": ""
}, {
  "value"     : 6,
  "kumiKata"  : [false, false, false, false, false, false, false, false, false],
  "lockedKata": [false, false, false, false, false, false, false, false, false],
  "effect"    : null,
  "annotation": ""
}, {
  "value"     : 2,
  "kumiKata"  : [false, false, false, false, false, false, false, false, false],
  "lockedKata": [false, false, false, false, false, false, false, false, false],
  "effect"    : null,
  "annotation": ""
}, {
  "value"     : 4,
  "kumiKata"  : [false, false, false, false, false, false, false, false, false],
  "lockedKata": [false, false, false, false, false, false, false, false, false],
  "effect"    : null,
  "annotation": ""
}, {
  "value"     : 7,
  "kumiKata"  : [false, false, false, false, false, false, false, false, false],
  "lockedKata": [false, false, false, false, false, false, false, false, false],
  "effect"    : null,
  "annotation": ""
}, {
  "value"     : 5,
  "kumiKata"  : [false, false, false, false, false, false, false, false, false],
  "lockedKata": [false, false, false, false, false, false, false, false, false],
  "effect"    : null,
  "annotation": ""
}, {
  "value"     : 1,
  "kumiKata"  : [false, false, false, false, false, false, false, false, false],
  "lockedKata": [false, false, false, false, false, false, false, false, false],
  "effect"    : null,
  "annotation": ""
}, {
  "value"     : 0,
  "kumiKata"  : [false, false, false, false, false, false, false, false, false],
  "lockedKata": [false, false, false, false, false, false, false, false, false],
  "effect"    : null,
  "annotation": ""
}, {
  "value"     : 3,
  "kumiKata"  : [false, false, false, false, false, false, false, false, false],
  "lockedKata": [false, false, false, false, false, false, false, false, false],
  "effect"    : null,
  "annotation": ""
}
]