<?xml version="1.0" encoding="UTF-8" standalone="no"?>
<svg
        xmlns:dc="http://purl.org/dc/elements/1.1/"
        xmlns:cc="http://creativecommons.org/ns#"
        xmlns:rdf="http://www.w3.org/1999/02/22-rdf-syntax-ns#"
        xmlns:sodipodi="http://sodipodi.sourceforge.net/DTD/sodipodi-0.dtd"
        xmlns:inkscape="http://www.inkscape.org/namespaces/inkscape"
        xmlns="http://www.w3.org/2000/svg"
        width="60.0px"
        height="60.0px"
        viewBox="0 0 60.0 60.0"
        version="1.1"
        id="SVGRoot"
        sodipodi:docname="icon.svg"
        inkscape:version="1.0.1 (c497b03c, 2020-09-10)">
    <defs
            id="defs833">
        <meshgradient
                inkscape:collect="always"
                id="meshgradient1540"
                gradientUnits="userSpaceOnUse"
                x="3.7291117"
                y="2.8894973"
                gradientTransform="matrix(1.0915638,0,0,1.0915638,5.2639846,0.69241317)">
            <meshrow
                    id="meshrow1542">
                <meshpatch
                        id="meshpatch1544">
                    <stop
                            path="c 10.1182,0  20.2365,0  30.3547,0"
                            style="stop-color:#ffffff;stop-opacity:1"
                            id="stop1546"/>
                    <stop
                            path="c 0,13.6958  0,27.3916  0,41.0875"
                            style="stop-color:#fc5200;stop-opacity:1"
                            id="stop1548"/>
                    <stop
                            path="c -10.1182,0  -20.2365,0  -30.3547,0"
                            style="stop-color:#ffffff;stop-opacity:1"
                            id="stop1550"/>
                    <stop
                            path="c 0,-13.6958  0,-27.3916  0,-41.0875"
                            style="stop-color:#fc5200;stop-opacity:1"
                            id="stop1552"/>
                </meshpatch>
            </meshrow>
        </meshgradient>
        <meshgradient
                inkscape:collect="always"
                id="meshgradient1706"
                gradientUnits="userSpaceOnUse"
                x="5.0684266"
                y="3.3968258">
            <meshrow
                    id="meshrow1708">
                <meshpatch
                        id="meshpatch1710">
                    <stop
                            path="c 11.3957,0  22.7915,0  34.1872,0"
                            style="stop-color:#ffffff;stop-opacity:1"
                            id="stop1712"/>
                    <stop
                            path="c 0,15.425  0,30.8501  0,46.2751"
                            style="stop-color:#8652e3;stop-opacity:1"
                            id="stop1714"/>
                    <stop
                            path="c -11.3957,0  -22.7915,0  -34.1872,0"
                            style="stop-color:#ffffff;stop-opacity:1"
                            id="stop1716"/>
                    <stop
                            path="c 0,-15.425  0,-30.8501  0,-46.2751"
                            style="stop-color:#8652e3;stop-opacity:1"
                            id="stop1718"/>
                </meshpatch>
            </meshrow>
        </meshgradient>
        <meshgradient
                inkscape:collect="always"
                id="meshgradient1784"
                gradientUnits="userSpaceOnUse"
                x="5.7291126"
                y="1.8894862"
                gradientTransform="matrix(0.96919559,0,0,0.96919559,4.3511032,2.9843869)">
            <meshrow
                    id="meshrow1786">
                <meshpatch
                        id="meshpatch1788">
                    <stop
                            path="c 11.3957,0  22.7915,0  34.1872,0"
                            style="stop-color:#ffffff;stop-opacity:1"
                            id="stop1790"/>
                    <stop
                            path="c 0,15.425  0,30.8501  0,46.2751"
                            style="stop-color:#fe8f59;stop-opacity:1"
                            id="stop1792"/>
                    <stop
                            path="c -11.3957,0  -22.7915,0  -34.1872,0"
                            style="stop-color:#ffffff;stop-opacity:1"
                            id="stop1794"/>
                    <stop
                            path="c 0,-15.425  0,-30.8501  0,-46.2751"
                            style="stop-color:#fe8f59;stop-opacity:1"
                            id="stop1796"/>
                </meshpatch>
            </meshrow>
        </meshgradient>
        <meshgradient
                inkscape:collect="always"
                id="meshgradient1814"
                gradientUnits="userSpaceOnUse"
                gradientTransform="matrix(1.0915638,0,0,1.0915638,5.2639846,0.69241317)"
                x="3.7291117"
                y="2.8894973">
            <meshrow
                    id="meshrow1826">
                <meshpatch
                        id="meshpatch1824">
                    <stop
                            path="c 10.1182,0  20.2365,0  30.3547,0"
                            style="stop-color:#ffffff;stop-opacity:1"
                            id="stop1816"/>
                    <stop
                            path="c 0,13.6958  0,27.3916  0,41.0875"
                            style="stop-color:#fc5200;stop-opacity:1"
                            id="stop1818"/>
                    <stop
                            path="c -10.1182,0  -20.2365,0  -30.3547,0"
                            style="stop-color:#ffffff;stop-opacity:1"
                            id="stop1820"/>
                    <stop
                            path="c 0,-13.6958  0,-27.3916  0,-41.0875"
                            style="stop-color:#fc5200;stop-opacity:1"
                            id="stop1822"/>
                </meshpatch>
            </meshrow>
        </meshgradient>
        <meshgradient
                inkscape:collect="always"
                id="meshgradient1828"
                gradientUnits="userSpaceOnUse"
                gradientTransform="matrix(1.0204324,0,0,1.0204324,-81.219307,-1.6700291)"
                x="31.711176"
                y="15.979537">
            <meshrow
                    id="meshrow1840">
                <meshpatch
                        id="meshpatch1838">
                    <stop
                            path="c 8.83431,0  17.6686,0  26.5029,0"
                            style="stop-color:#ffffff;stop-opacity:1"
                            id="stop1830"/>
                    <stop
                            path="c 0,14.1947  0,28.3894  0,42.5841"
                            style="stop-color:#8652e3;stop-opacity:1"
                            id="stop1832"/>
                    <stop
                            path="c -8.83431,0  -17.6686,0  -26.5029,0"
                            style="stop-color:#ffffff;stop-opacity:1"
                            id="stop1834"/>
                    <stop
                            path="c 0,-14.1947  0,-28.3894  0,-42.5841"
                            style="stop-color:#8652e3;stop-opacity:1"
                            id="stop1836"/>
                </meshpatch>
            </meshrow>
        </meshgradient>
        <meshgradient
                inkscape:collect="always"
                id="meshgradient1842"
                gradientUnits="userSpaceOnUse"
                x="-45.850334"
                y="14.52925"
                gradientTransform="matrix(0.96919556,0,0,0.96919556,-3.7281616,0.84401533)">
            <meshrow
                    id="meshrow1854">
                <meshpatch
                        id="meshpatch1852">
                    <stop
                            path="c 9.30134,0  18.6027,0  27.904,0"
                            style="stop-color:#ffffff;stop-opacity:1"
                            id="stop1844"/>
                    <stop
                            path="c 0,14.9451  0,29.8903  0,44.8354"
                            style="stop-color:#8652e3;stop-opacity:1"
                            id="stop1846"/>
                    <stop
                            path="c -9.30134,0  -18.6027,0  -27.904,0"
                            style="stop-color:#ffffff;stop-opacity:1"
                            id="stop1848"/>
                    <stop
                            path="c 0,-14.9451  0,-29.8903  0,-44.8354"
                            style="stop-color:#8652e3;stop-opacity:1"
                            id="stop1850"/>
                </meshpatch>
            </meshrow>
        </meshgradient>
        <meshgradient
                inkscape:collect="always"
                id="meshgradient1856"
                gradientUnits="userSpaceOnUse"
                gradientTransform="matrix(0.96919559,0,0,0.96919559,4.3511032,2.9843869)"
                x="5.7291126"
                y="1.8894862">
            <meshrow
                    id="meshrow1868">
                <meshpatch
                        id="meshpatch1866">
                    <stop
                            path="c 11.3957,0  22.7915,0  34.1872,0"
                            style="stop-color:#ffffff;stop-opacity:1"
                            id="stop1858"/>
                    <stop
                            path="c 0,15.425  0,30.8501  0,46.2751"
                            style="stop-color:#fe8f59;stop-opacity:1"
                            id="stop1860"/>
                    <stop
                            path="c -11.3957,0  -22.7915,0  -34.1872,0"
                            style="stop-color:#ffffff;stop-opacity:1"
                            id="stop1862"/>
                    <stop
                            path="c 0,-15.425  0,-30.8501  0,-46.2751"
                            style="stop-color:#fe8f59;stop-opacity:1"
                            id="stop1864"/>
                </meshpatch>
            </meshrow>
        </meshgradient>
    </defs>
    <sodipodi:namedview
            id="base"
            pagecolor="#ffffff"
            bordercolor="#666666"
            borderopacity="1.0"
            inkscape:pageopacity="0.0"
            inkscape:pageshadow="2"
            inkscape:zoom="10.216667"
            inkscape:cx="31.663948"
            inkscape:cy="29.706362"
            inkscape:document-units="px"
            inkscape:current-layer="layer1"
            inkscape:document-rotation="0"
            showgrid="true"
            inkscape:window-width="1434"
            inkscape:window-height="779"
            inkscape:window-x="0"
            inkscape:window-y="25"
            inkscape:window-maximized="0">
        <inkscape:grid
                type="xygrid"
                id="grid1403"/>
    </sodipodi:namedview>
    <metadata
            id="metadata836">
        <rdf:RDF>
            <cc:Work
                    rdf:about="">
                <dc:format>image/svg+xml</dc:format>
                <dc:type
                        rdf:resource="http://purl.org/dc/dcmitype/StillImage"/>
                <dc:title></dc:title>
            </cc:Work>
        </rdf:RDF>
    </metadata>
    <g
            inkscape:label="Calque 1"
            inkscape:groupmode="layer"
            id="layer1">
        <text
                xml:space="preserve"
                style="font-style:normal;font-weight:normal;font-size:40px;line-height:1.25;font-family:sans-serif;fill:#000000;fill-opacity:1;stroke:none"
                x="2.5399675"
                y="33.07341"
                id="text1412"><tspan
         sodipodi:role="line"
         id="tspan1410"
         x="2.5399675"
         y="33.07341"
         style="font-style:normal;font-variant:normal;font-weight:normal;font-stretch:normal;font-family:Chalkduster;-inkscape-font-specification:Chalkduster" /></text>
        <text
                xml:space="preserve"
                style="font-style:normal;font-weight:normal;font-size:65.0463px;line-height:1.25;font-family:sans-serif;fill:url(#meshgradient1814);fill-opacity:1;stroke:none;stroke-width:1.62615"
                x="6.315825"
                y="47.258591"
                id="text1412-2-0"
                transform="scale(1.0317834,0.96919563)"><tspan
         sodipodi:role="line"
         id="tspan1410-2-7"
         x="6.315825"
         y="47.258591"
         style="font-style:normal;font-variant:normal;font-weight:normal;font-stretch:normal;font-family:'Chalkboard SE';-inkscape-font-specification:'Chalkboard SE';fill:url(#meshgradient1814);fill-opacity:1;stroke-width:1.62615">C</tspan></text>
        <text
                xml:space="preserve"
                style="font-style:normal;font-weight:normal;font-size:63.7376px;line-height:1.25;font-family:sans-serif;fill:url(#meshgradient1828);fill-opacity:1;stroke:none;stroke-width:1.59343"
                x="-51.043476"
                y="56.752083"
                id="text1412-2-0-1"
                transform="scale(-1.0317834,0.96919563)"><tspan
         sodipodi:role="line"
         id="tspan1410-2-7-9"
         x="-51.043476"
         y="56.752083"
         style="font-style:normal;font-variant:normal;font-weight:normal;font-stretch:normal;font-family:'Chalkboard SE';-inkscape-font-specification:'Chalkboard SE';fill:url(#meshgradient1828);fill-opacity:1;stroke-width:1.59343">F</tspan></text>
        <text
                xml:space="preserve"
                style="font-style:normal;font-weight:normal;font-size:65.0463px;line-height:1.25;font-family:sans-serif;opacity:0.347267;fill:url(#meshgradient1856);fill-opacity:1;stroke:none;stroke-width:1.62615"
                x="6.8850107"
                y="48.227783"
                id="text1412-2-0-2"
                transform="scale(1.0317834,0.96919563)"><tspan
         sodipodi:role="line"
         id="tspan1410-2-7-92"
         x="6.8850107"
         y="48.227783"
         style="font-style:normal;font-variant:normal;font-weight:normal;font-stretch:normal;font-family:'Chalkboard SE';-inkscape-font-specification:'Chalkboard SE';fill:url(#meshgradient1856);fill-opacity:1;stroke-width:1.62615">C</tspan></text>
        <text
                xml:space="preserve"
                style="font-style:normal;font-weight:normal;font-size:65.0463px;line-height:1.25;font-family:sans-serif;fill:url(#meshgradient1540);fill-opacity:1;stroke:none;stroke-width:1.62615"
                x="6.315825"
                y="47.258591"
                id="text1800"
                transform="scale(1.0317834,0.96919563)"><tspan
         sodipodi:role="line"
         id="tspan1798"
         x="6.315825"
         y="47.258591"
         style="font-style:normal;font-variant:normal;font-weight:normal;font-stretch:normal;font-family:'Chalkboard SE';-inkscape-font-specification:'Chalkboard SE';fill:url(#meshgradient1540);fill-opacity:1;stroke-width:1.62615">C</tspan></text>
        <text
                xml:space="preserve"
                style="font-style:normal;font-weight:normal;font-size:65.0463px;line-height:1.25;font-family:sans-serif;opacity:0.347267;fill:url(#meshgradient1784);fill-opacity:1;stroke:none;stroke-width:1.62615"
                x="6.8850107"
                y="48.227783"
                id="text1812"
                transform="scale(1.0317834,0.96919563)"><tspan
         sodipodi:role="line"
         id="tspan1810"
         x="6.8850107"
         y="48.227783"
         style="font-style:normal;font-variant:normal;font-weight:normal;font-stretch:normal;font-family:'Chalkboard SE';-inkscape-font-specification:'Chalkboard SE';fill:url(#meshgradient1784);fill-opacity:1;stroke-width:1.62615">C</tspan></text>
        <text
                xml:space="preserve"
                style="font-style:normal;font-weight:normal;font-size:63.7376px;line-height:1.25;font-family:sans-serif;opacity:0.350482;fill:url(#meshgradient1842);fill-opacity:1;stroke:none;stroke-width:1.59343"
                x="-50.34938"
                y="57.041813"
                id="text1412-2-0-1-5"
                transform="scale(-1.0317834,0.96919566)"><tspan
         sodipodi:role="line"
         id="tspan1410-2-7-9-8"
         x="-50.34938"
         y="57.041813"
         style="font-style:normal;font-variant:normal;font-weight:normal;font-stretch:normal;font-family:'Chalkboard SE';-inkscape-font-specification:'Chalkboard SE';fill:url(#meshgradient1842);fill-opacity:1;stroke-width:1.59343">F</tspan></text>
    </g>
    <script
            id="mesh_polyfill"
            type="text/javascript">
        !function(){const t=&quot;http://www.w3.org/2000/svg&quot;,e=&quot;http://www.w3.org/1999/xlink&quot;,s=&quot;http://www.w3.org/1999/xhtml&quot;,r=2;if(document.createElementNS(t,&quot;meshgradient&quot;).x)return;const
        n=(t,e,s,r)=&gt;{let n=new x(.5*(e.x+s.x),.5*(e.y+s.y)),o=new x(.5*(t.x+e.x),.5*(t.y+e.y)),i=new
        x(.5*(s.x+r.x),.5*(s.y+r.y)),a=new x(.5*(n.x+o.x),.5*(n.y+o.y)),h=new x(.5*(n.x+i.x),.5*(n.y+i.y)),l=new
        x(.5*(a.x+h.x),.5*(a.y+h.y));return[[t,o,a,l],[l,h,i,r]]},o=t=&gt;{let
        e=t[0].distSquared(t[1]),s=t[2].distSquared(t[3]),r=.25*t[0].distSquared(t[2]),n=.25*t[1].distSquared(t[3]),o=e&gt;s?e:s,i=r&gt;n?r:n;return
        18*(o&gt;i?o:i)},i=(t,e)=&gt;Math.sqrt(t.distSquared(e)),a=(t,e)=&gt;t.scale(2/3).add(e.scale(1/3)),h=t=&gt;{let
        e,s,r,n,o,i,a,h=new g;return t.match(/(\w+\(\s*[^)]+\))+/g).forEach(t=&gt;{let
        l=t.match(/[\w.-]+/g),d=l.shift();switch(d){case&quot;translate&quot;:2===l.length?e=new
        g(1,0,0,1,l[0],l[1]):(console.error(&quot;mesh.js: translate does not have 2 arguments!&quot;),e=new
        g(1,0,0,1,0,0)),h=h.append(e);break;case&quot;scale&quot;:1===l.length?s=new
        g(l[0],0,0,l[0],0,0):2===l.length?s=new g(l[0],0,0,l[1],0,0):(console.error(&quot;mesh.js: scale does not have 1
        or 2 arguments!&quot;),s=new g(1,0,0,1,0,0)),h=h.append(s);break;case&quot;rotate&quot;:if(3===l.length&amp;&amp;(e=new
        g(1,0,0,1,l[1],l[2]),h=h.append(e)),l[0]){r=l[0]*Math.PI/180;let t=Math.cos(r),e=Math.sin(r);Math.abs(t)&lt;1e-16&amp;&amp;(t=0),Math.abs(e)&lt;1e-16&amp;&amp;(e=0),a=new
        g(t,e,-e,t,0,0),h=h.append(a)}else console.error(&quot;math.js: No argument to rotate transform!&quot;);3===l.length&amp;&amp;(e=new
        g(1,0,0,1,-l[1],-l[2]),h=h.append(e));break;case&quot;skewX&quot;:l[0]?(r=l[0]*Math.PI/180,n=Math.tan(r),o=new
        g(1,0,n,1,0,0),h=h.append(o)):console.error(&quot;math.js: No argument to skewX transform!&quot;);break;case&quot;skewY&quot;:l[0]?(r=l[0]*Math.PI/180,n=Math.tan(r),i=new
        g(1,n,0,1,0,0),h=h.append(i)):console.error(&quot;math.js: No argument to skewY transform!&quot;);break;case&quot;matrix&quot;:6===l.length?h=h.append(new
        g(...l)):console.error(&quot;math.js: Incorrect number of arguments for matrix!&quot;);break;default:console.error(&quot;mesh.js:
        Unhandled transform type: &quot;+d)}}),h},l=t=&gt;{let e=[],s=t.split(/[ ,]+/);for(let t=0,r=s.length-1;t&lt;r;t+=2)e.push(new
        x(parseFloat(s[t]),parseFloat(s[t+1])));return e},d=(t,e)=&gt;{for(let s in
        e)t.setAttribute(s,e[s])},c=(t,e,s,r,n)=&gt;{let o,i,a=[0,0,0,0];for(let h=0;h&lt;3;++h)e[h]&lt;t[h]&amp;&amp;e[h]&lt;s[h]||t[h]&lt;e[h]&amp;&amp;s[h]&lt;e[h]?a[h]=0:(a[h]=.5*((e[h]-t[h])/r+(s[h]-e[h])/n),o=Math.abs(3*(e[h]-t[h])/r),i=Math.abs(3*(s[h]-e[h])/n),a[h]&gt;o?a[h]=o:a[h]&gt;i&amp;&amp;(a[h]=i));return
        a},u=[[1,0,0,0,0,0,0,0,0,0,0,0,0,0,0,0],[0,0,0,0,1,0,0,0,0,0,0,0,0,0,0,0],[-3,3,0,0,-2,-1,0,0,0,0,0,0,0,0,0,0],[2,-2,0,0,1,1,0,0,0,0,0,0,0,0,0,0],[0,0,0,0,0,0,0,0,1,0,0,0,0,0,0,0],[0,0,0,0,0,0,0,0,0,0,0,0,1,0,0,0],[0,0,0,0,0,0,0,0,-3,3,0,0,-2,-1,0,0],[0,0,0,0,0,0,0,0,2,-2,0,0,1,1,0,0],[-3,0,3,0,0,0,0,0,-2,0,-1,0,0,0,0,0],[0,0,0,0,-3,0,3,0,0,0,0,0,-2,0,-1,0],[9,-9,-9,9,6,3,-6,-3,6,-6,3,-3,4,2,2,1],[-6,6,6,-6,-3,-3,3,3,-4,4,-2,2,-2,-2,-1,-1],[2,0,-2,0,0,0,0,0,1,0,1,0,0,0,0,0],[0,0,0,0,2,0,-2,0,0,0,0,0,1,0,1,0],[-6,6,6,-6,-4,-2,4,2,-3,3,-3,3,-2,-1,-2,-1],[4,-4,-4,4,2,2,-2,-2,2,-2,2,-2,1,1,1,1]],f=t=&gt;{let
        e=[];for(let s=0;s&lt;16;++s){e[s]=0;for(let r=0;r&lt;16;++r)e[s]+=u[s][r]*t[r]}return e},p=(t,e,s)=&gt;{const
        r=e*e,n=s*s,o=e*e*e,i=s*s*s;return
        t[0]+t[1]*e+t[2]*r+t[3]*o+t[4]*s+t[5]*s*e+t[6]*s*r+t[7]*s*o+t[8]*n+t[9]*n*e+t[10]*n*r+t[11]*n*o+t[12]*i+t[13]*i*e+t[14]*i*r+t[15]*i*o},y=t=&gt;{let
        e=[],s=[],r=[];for(let s=0;s&lt;4;++s)e[s]=[],e[s][0]=n(t[0][s],t[1][s],t[2][s],t[3][s]),e[s][1]=[],e[s][1].push(...n(...e[s][0][0])),e[s][1].push(...n(...e[s][0][1])),e[s][2]=[],e[s][2].push(...n(...e[s][1][0])),e[s][2].push(...n(...e[s][1][1])),e[s][2].push(...n(...e[s][1][2])),e[s][2].push(...n(...e[s][1][3]));for(let
        t=0;t&lt;8;++t){s[t]=[];for(let r=0;r&lt;4;++r)s[t][r]=[],s[t][r][0]=n(e[0][2][t][r],e[1][2][t][r],e[2][2][t][r],e[3][2][t][r]),s[t][r][1]=[],s[t][r][1].push(...n(...s[t][r][0][0])),s[t][r][1].push(...n(...s[t][r][0][1])),s[t][r][2]=[],s[t][r][2].push(...n(...s[t][r][1][0])),s[t][r][2].push(...n(...s[t][r][1][1])),s[t][r][2].push(...n(...s[t][r][1][2])),s[t][r][2].push(...n(...s[t][r][1][3]))}for(let
        t=0;t&lt;8;++t){r[t]=[];for(let e=0;e&lt;8;++e)r[t][e]=[],r[t][e][0]=s[t][0][2][e],r[t][e][1]=s[t][1][2][e],r[t][e][2]=s[t][2][2][e],r[t][e][3]=s[t][3][2][e]}return
        r};class x{constructor(t,e){this.x=t||0,this.y=e||0}toString(){return`(x=${this.x}, y=${this.y})`}clone(){return
        new x(this.x,this.y)}add(t){return new x(this.x+t.x,this.y+t.y)}scale(t){return void 0===t.x?new
        x(this.x*t,this.y*t):new x(this.x*t.x,this.y*t.y)}distSquared(t){let e=this.x-t.x,s=this.y-t.y;return
        e*e+s*s}transform(t){let e=this.x*t.a+this.y*t.c+t.e,s=this.x*t.b+this.y*t.d+t.f;return new x(e,s)}}class
        g{constructor(t,e,s,r,n,o){void
        0===t?(this.a=1,this.b=0,this.c=0,this.d=1,this.e=0,this.f=0):(this.a=t,this.b=e,this.c=s,this.d=r,this.e=n,this.f=o)}toString(){return`affine:
        ${this.a} ${this.c} ${this.e} \n ${this.b} ${this.d} ${this.f}`}append(t){t instanceof g||console.error(&quot;mesh.js:
        argument to Affine.append is not affine!&quot;);let
        e=this.a*t.a+this.c*t.b,s=this.b*t.a+this.d*t.b,r=this.a*t.c+this.c*t.d,n=this.b*t.c+this.d*t.d,o=this.a*t.e+this.c*t.f+this.e,i=this.b*t.e+this.d*t.f+this.f;return
        new g(e,s,r,n,o,i)}}class w{constructor(t,e){this.nodes=t,this.colors=e}paintCurve(t,e){if(o(this.nodes)&gt;r){const
        s=n(...this.nodes);let r=[[],[]],o=[[],[]];for(let t=0;t&lt;4;++t)r[0][t]=this.colors[0][t],r[1][t]=(this.colors[0][t]+this.colors[1][t])/2,o[0][t]=r[1][t],o[1][t]=this.colors[1][t];let
        i=new w(s[0],r),a=new w(s[1],o);i.paintCurve(t,e),a.paintCurve(t,e)}else{let s=Math.round(this.nodes[0].x);if(s&gt;=0&amp;&amp;s&lt;e){let
        r=4*(~~this.nodes[0].y*e+s);t[r]=Math.round(this.colors[0][0]),t[r+1]=Math.round(this.colors[0][1]),t[r+2]=Math.round(this.colors[0][2]),t[r+3]=Math.round(this.colors[0][3])}}}}class
        m{constructor(t,e){this.nodes=t,this.colors=e}split(){let
        t=[[],[],[],[]],e=[[],[],[],[]],s=[[[],[]],[[],[]]],r=[[[],[]],[[],[]]];for(let s=0;s&lt;4;++s){const
        r=n(this.nodes[0][s],this.nodes[1][s],this.nodes[2][s],this.nodes[3][s]);t[0][s]=r[0][0],t[1][s]=r[0][1],t[2][s]=r[0][2],t[3][s]=r[0][3],e[0][s]=r[1][0],e[1][s]=r[1][1],e[2][s]=r[1][2],e[3][s]=r[1][3]}for(let
        t=0;t&lt;4;++t)s[0][0][t]=this.colors[0][0][t],s[0][1][t]=this.colors[0][1][t],s[1][0][t]=(this.colors[0][0][t]+this.colors[1][0][t])/2,s[1][1][t]=(this.colors[0][1][t]+this.colors[1][1][t])/2,r[0][0][t]=s[1][0][t],r[0][1][t]=s[1][1][t],r[1][0][t]=this.colors[1][0][t],r[1][1][t]=this.colors[1][1][t];return[new
        m(t,s),new m(e,r)]}paint(t,e){let s,n=!1;for(let t=0;t&lt;4;++t)if((s=o([this.nodes[0][t],this.nodes[1][t],this.nodes[2][t],this.nodes[3][t]]))&gt;r){n=!0;break}if(n){let
        s=this.split();s[0].paint(t,e),s[1].paint(t,e)}else{new
        w([...this.nodes[0]],[...this.colors[0]]).paintCurve(t,e)}}}class
        b{constructor(t){this.readMesh(t),this.type=t.getAttribute(&quot;type&quot;)||&quot;bilinear&quot;}readMesh(t){let
        e=[[]],s=[[]],r=Number(t.getAttribute(&quot;x&quot;)),n=Number(t.getAttribute(&quot;y&quot;));e[0][0]=new
        x(r,n);let o=t.children;for(let t=0,r=o.length;t&lt;r;++t){e[3*t+1]=[],e[3*t+2]=[],e[3*t+3]=[],s[t+1]=[];let
        r=o[t].children;for(let n=0,o=r.length;n&lt;o;++n){let o=r[n].children;for(let r=0,i=o.length;r&lt;i;++r){let
        i=r;0!==t&amp;&amp;++i;let h,d=o[r].getAttribute(&quot;path&quot;),c=&quot;l&quot;;null!=d&amp;&amp;(c=(h=d.match(/\s*([lLcC])\s*(.*)/))[1]);let
        u=l(h[2]);switch(c){case&quot;l&quot;:0===i?(e[3*t][3*n+3]=u[0].add(e[3*t][3*n]),e[3*t][3*n+1]=a(e[3*t][3*n],e[3*t][3*n+3]),e[3*t][3*n+2]=a(e[3*t][3*n+3],e[3*t][3*n])):1===i?(e[3*t+3][3*n+3]=u[0].add(e[3*t][3*n+3]),e[3*t+1][3*n+3]=a(e[3*t][3*n+3],e[3*t+3][3*n+3]),e[3*t+2][3*n+3]=a(e[3*t+3][3*n+3],e[3*t][3*n+3])):2===i?(0===n&amp;&amp;(e[3*t+3][3*n+0]=u[0].add(e[3*t+3][3*n+3])),e[3*t+3][3*n+1]=a(e[3*t+3][3*n],e[3*t+3][3*n+3]),e[3*t+3][3*n+2]=a(e[3*t+3][3*n+3],e[3*t+3][3*n])):(e[3*t+1][3*n]=a(e[3*t][3*n],e[3*t+3][3*n]),e[3*t+2][3*n]=a(e[3*t+3][3*n],e[3*t][3*n]));break;case&quot;L&quot;:0===i?(e[3*t][3*n+3]=u[0],e[3*t][3*n+1]=a(e[3*t][3*n],e[3*t][3*n+3]),e[3*t][3*n+2]=a(e[3*t][3*n+3],e[3*t][3*n])):1===i?(e[3*t+3][3*n+3]=u[0],e[3*t+1][3*n+3]=a(e[3*t][3*n+3],e[3*t+3][3*n+3]),e[3*t+2][3*n+3]=a(e[3*t+3][3*n+3],e[3*t][3*n+3])):2===i?(0===n&amp;&amp;(e[3*t+3][3*n+0]=u[0]),e[3*t+3][3*n+1]=a(e[3*t+3][3*n],e[3*t+3][3*n+3]),e[3*t+3][3*n+2]=a(e[3*t+3][3*n+3],e[3*t+3][3*n])):(e[3*t+1][3*n]=a(e[3*t][3*n],e[3*t+3][3*n]),e[3*t+2][3*n]=a(e[3*t+3][3*n],e[3*t][3*n]));break;case&quot;c&quot;:0===i?(e[3*t][3*n+1]=u[0].add(e[3*t][3*n]),e[3*t][3*n+2]=u[1].add(e[3*t][3*n]),e[3*t][3*n+3]=u[2].add(e[3*t][3*n])):1===i?(e[3*t+1][3*n+3]=u[0].add(e[3*t][3*n+3]),e[3*t+2][3*n+3]=u[1].add(e[3*t][3*n+3]),e[3*t+3][3*n+3]=u[2].add(e[3*t][3*n+3])):2===i?(e[3*t+3][3*n+2]=u[0].add(e[3*t+3][3*n+3]),e[3*t+3][3*n+1]=u[1].add(e[3*t+3][3*n+3]),0===n&amp;&amp;(e[3*t+3][3*n+0]=u[2].add(e[3*t+3][3*n+3]))):(e[3*t+2][3*n]=u[0].add(e[3*t+3][3*n]),e[3*t+1][3*n]=u[1].add(e[3*t+3][3*n]));break;case&quot;C&quot;:0===i?(e[3*t][3*n+1]=u[0],e[3*t][3*n+2]=u[1],e[3*t][3*n+3]=u[2]):1===i?(e[3*t+1][3*n+3]=u[0],e[3*t+2][3*n+3]=u[1],e[3*t+3][3*n+3]=u[2]):2===i?(e[3*t+3][3*n+2]=u[0],e[3*t+3][3*n+1]=u[1],0===n&amp;&amp;(e[3*t+3][3*n+0]=u[2])):(e[3*t+2][3*n]=u[0],e[3*t+1][3*n]=u[1]);break;default:console.error(&quot;mesh.js:
        &quot;+c+&quot; invalid path type.&quot;)}if(0===t&amp;&amp;0===n||r&gt;0){let
        e=window.getComputedStyle(o[r]).stopColor.match(/^rgb\s*\(\s*(\d+)\s*,\s*(\d+)\s*,\s*(\d+)\s*\)$/i),a=window.getComputedStyle(o[r]).stopOpacity,h=255;a&amp;&amp;(h=Math.floor(255*a)),e&amp;&amp;(0===i?(s[t][n]=[],s[t][n][0]=Math.floor(e[1]),s[t][n][1]=Math.floor(e[2]),s[t][n][2]=Math.floor(e[3]),s[t][n][3]=h):1===i?(s[t][n+1]=[],s[t][n+1][0]=Math.floor(e[1]),s[t][n+1][1]=Math.floor(e[2]),s[t][n+1][2]=Math.floor(e[3]),s[t][n+1][3]=h):2===i?(s[t+1][n+1]=[],s[t+1][n+1][0]=Math.floor(e[1]),s[t+1][n+1][1]=Math.floor(e[2]),s[t+1][n+1][2]=Math.floor(e[3]),s[t+1][n+1][3]=h):3===i&amp;&amp;(s[t+1][n]=[],s[t+1][n][0]=Math.floor(e[1]),s[t+1][n][1]=Math.floor(e[2]),s[t+1][n][2]=Math.floor(e[3]),s[t+1][n][3]=h))}}e[3*t+1][3*n+1]=new
        x,e[3*t+1][3*n+2]=new x,e[3*t+2][3*n+1]=new x,e[3*t+2][3*n+2]=new
        x,e[3*t+1][3*n+1].x=(-4*e[3*t][3*n].x+6*(e[3*t][3*n+1].x+e[3*t+1][3*n].x)+-2*(e[3*t][3*n+3].x+e[3*t+3][3*n].x)+3*(e[3*t+3][3*n+1].x+e[3*t+1][3*n+3].x)+-1*e[3*t+3][3*n+3].x)/9,e[3*t+1][3*n+2].x=(-4*e[3*t][3*n+3].x+6*(e[3*t][3*n+2].x+e[3*t+1][3*n+3].x)+-2*(e[3*t][3*n].x+e[3*t+3][3*n+3].x)+3*(e[3*t+3][3*n+2].x+e[3*t+1][3*n].x)+-1*e[3*t+3][3*n].x)/9,e[3*t+2][3*n+1].x=(-4*e[3*t+3][3*n].x+6*(e[3*t+3][3*n+1].x+e[3*t+2][3*n].x)+-2*(e[3*t+3][3*n+3].x+e[3*t][3*n].x)+3*(e[3*t][3*n+1].x+e[3*t+2][3*n+3].x)+-1*e[3*t][3*n+3].x)/9,e[3*t+2][3*n+2].x=(-4*e[3*t+3][3*n+3].x+6*(e[3*t+3][3*n+2].x+e[3*t+2][3*n+3].x)+-2*(e[3*t+3][3*n].x+e[3*t][3*n+3].x)+3*(e[3*t][3*n+2].x+e[3*t+2][3*n].x)+-1*e[3*t][3*n].x)/9,e[3*t+1][3*n+1].y=(-4*e[3*t][3*n].y+6*(e[3*t][3*n+1].y+e[3*t+1][3*n].y)+-2*(e[3*t][3*n+3].y+e[3*t+3][3*n].y)+3*(e[3*t+3][3*n+1].y+e[3*t+1][3*n+3].y)+-1*e[3*t+3][3*n+3].y)/9,e[3*t+1][3*n+2].y=(-4*e[3*t][3*n+3].y+6*(e[3*t][3*n+2].y+e[3*t+1][3*n+3].y)+-2*(e[3*t][3*n].y+e[3*t+3][3*n+3].y)+3*(e[3*t+3][3*n+2].y+e[3*t+1][3*n].y)+-1*e[3*t+3][3*n].y)/9,e[3*t+2][3*n+1].y=(-4*e[3*t+3][3*n].y+6*(e[3*t+3][3*n+1].y+e[3*t+2][3*n].y)+-2*(e[3*t+3][3*n+3].y+e[3*t][3*n].y)+3*(e[3*t][3*n+1].y+e[3*t+2][3*n+3].y)+-1*e[3*t][3*n+3].y)/9,e[3*t+2][3*n+2].y=(-4*e[3*t+3][3*n+3].y+6*(e[3*t+3][3*n+2].y+e[3*t+2][3*n+3].y)+-2*(e[3*t+3][3*n].y+e[3*t][3*n+3].y)+3*(e[3*t][3*n+2].y+e[3*t+2][3*n].y)+-1*e[3*t][3*n].y)/9}}this.nodes=e,this.colors=s}paintMesh(t,e){let
        s=(this.nodes.length-1)/3,r=(this.nodes[0].length-1)/3;if(&quot;bilinear&quot;===this.type||s&lt;2||r&lt;2){let
        n;for(let o=0;o&lt;s;++o)for(let s=0;s&lt;r;++s){let r=[];for(let t=3*o,e=3*o+4;t&lt;e;++t)r.push(this.nodes[t].slice(3*s,3*s+4));let
        i=[];i.push(this.colors[o].slice(s,s+2)),i.push(this.colors[o+1].slice(s,s+2)),(n=new
        m(r,i)).paint(t,e)}}else{let n,o,a,h,l,d,u;const x=s,g=r;s++,r++;let w=new Array(s);for(let t=0;t&lt;s;++t){w[t]=new
        Array(r);for(let e=0;e&lt;r;++e)w[t][e]=[],w[t][e][0]=this.nodes[3*t][3*e],w[t][e][1]=this.colors[t][e]}for(let
        t=0;t&lt;s;++t)for(let e=0;e&lt;r;++e)0!==t&amp;&amp;t!==x&amp;&amp;(n=i(w[t-1][e][0],w[t][e][0]),o=i(w[t+1][e][0],w[t][e][0]),w[t][e][2]=c(w[t-1][e][1],w[t][e][1],w[t+1][e][1],n,o)),0!==e&amp;&amp;e!==g&amp;&amp;(n=i(w[t][e-1][0],w[t][e][0]),o=i(w[t][e+1][0],w[t][e][0]),w[t][e][3]=c(w[t][e-1][1],w[t][e][1],w[t][e+1][1],n,o));for(let
        t=0;t&lt;r;++t){w[0][t][2]=[],w[x][t][2]=[];for(let e=0;e&lt;4;++e)n=i(w[1][t][0],w[0][t][0]),o=i(w[x][t][0],w[x-1][t][0]),w[0][t][2][e]=n&gt;0?2*(w[1][t][1][e]-w[0][t][1][e])/n-w[1][t][2][e]:0,w[x][t][2][e]=o&gt;0?2*(w[x][t][1][e]-w[x-1][t][1][e])/o-w[x-1][t][2][e]:0}for(let
        t=0;t&lt;s;++t){w[t][0][3]=[],w[t][g][3]=[];for(let e=0;e&lt;4;++e)n=i(w[t][1][0],w[t][0][0]),o=i(w[t][g][0],w[t][g-1][0]),w[t][0][3][e]=n&gt;0?2*(w[t][1][1][e]-w[t][0][1][e])/n-w[t][1][3][e]:0,w[t][g][3][e]=o&gt;0?2*(w[t][g][1][e]-w[t][g-1][1][e])/o-w[t][g-1][3][e]:0}for(let
        s=0;s&lt;x;++s)for(let r=0;r&lt;g;++r){let
        n=i(w[s][r][0],w[s+1][r][0]),o=i(w[s][r+1][0],w[s+1][r+1][0]),c=i(w[s][r][0],w[s][r+1][0]),x=i(w[s+1][r][0],w[s+1][r+1][0]),g=[[],[],[],[]];for(let
        t=0;t&lt;4;++t){(d=[])[0]=w[s][r][1][t],d[1]=w[s+1][r][1][t],d[2]=w[s][r+1][1][t],d[3]=w[s+1][r+1][1][t],d[4]=w[s][r][2][t]*n,d[5]=w[s+1][r][2][t]*n,d[6]=w[s][r+1][2][t]*o,d[7]=w[s+1][r+1][2][t]*o,d[8]=w[s][r][3][t]*c,d[9]=w[s+1][r][3][t]*x,d[10]=w[s][r+1][3][t]*c,d[11]=w[s+1][r+1][3][t]*x,d[12]=0,d[13]=0,d[14]=0,d[15]=0,u=f(d);for(let
        e=0;e&lt;9;++e){g[t][e]=[];for(let s=0;s&lt;9;++s)g[t][e][s]=p(u,e/8,s/8),g[t][e][s]&gt;255?g[t][e][s]=255:g[t][e][s]&lt;0&amp;&amp;(g[t][e][s]=0)}}h=[];for(let
        t=3*s,e=3*s+4;t&lt;e;++t)h.push(this.nodes[t].slice(3*r,3*r+4));l=y(h);for(let s=0;s&lt;8;++s)for(let r=0;r&lt;8;++r)(a=new
        m(l[s][r],[[[g[0][s][r],g[1][s][r],g[2][s][r],g[3][s][r]],[g[0][s][r+1],g[1][s][r+1],g[2][s][r+1],g[3][s][r+1]]],[[g[0][s+1][r],g[1][s+1][r],g[2][s+1][r],g[3][s+1][r]],[g[0][s+1][r+1],g[1][s+1][r+1],g[2][s+1][r+1],g[3][s+1][r+1]]]])).paint(t,e)}}}transform(t){if(t
        instanceof x)for(let e=0,s=this.nodes.length;e&lt;s;++e)for(let s=0,r=this.nodes[0].length;s&lt;r;++s)this.nodes[e][s]=this.nodes[e][s].add(t);else
        if(t instanceof g)for(let e=0,s=this.nodes.length;e&lt;s;++e)for(let s=0,r=this.nodes[0].length;s&lt;r;++s)this.nodes[e][s]=this.nodes[e][s].transform(t)}scale(t){for(let
        e=0,s=this.nodes.length;e&lt;s;++e)for(let s=0,r=this.nodes[0].length;s&lt;r;++s)this.nodes[e][s]=this.nodes[e][s].scale(t)}}document.querySelectorAll(&quot;rect,circle,ellipse,path,text&quot;).forEach((r,n)=&gt;{let
        o=r.getAttribute(&quot;id&quot;);o||(o=&quot;patchjs_shape&quot;+n,r.setAttribute(&quot;id&quot;,o));const
        i=r.style.fill.match(/^url\(\s*&quot;?\s*#([^\s&quot;]+)&quot;?\s*\)/),a=r.style.stroke.match(/^url\(\s*&quot;?\s*#([^\s&quot;]+)&quot;?\s*\)/);if(i&amp;&amp;i[1]){const
        a=document.getElementById(i[1]);if(a&amp;&amp;&quot;meshgradient&quot;===a.nodeName){const i=r.getBBox();let
        l=document.createElementNS(s,&quot;canvas&quot;);d(l,{width:i.width,height:i.height});const c=l.getContext(&quot;2d&quot;);let
        u=c.createImageData(i.width,i.height);const f=new b(a);&quot;objectBoundingBox&quot;===a.getAttribute(&quot;gradientUnits&quot;)&amp;&amp;f.scale(new
        x(i.width,i.height));const p=a.getAttribute(&quot;gradientTransform&quot;);null!=p&amp;&amp;f.transform(h(p)),&quot;userSpaceOnUse&quot;===a.getAttribute(&quot;gradientUnits&quot;)&amp;&amp;f.transform(new
        x(-i.x,-i.y)),f.paintMesh(u.data,l.width),c.putImageData(u,0,0);const y=document.createElementNS(t,&quot;image&quot;);d(y,{width:i.width,height:i.height,x:i.x,y:i.y});let
        g=l.toDataURL();y.setAttributeNS(e,&quot;xlink:href&quot;,g),r.parentNode.insertBefore(y,r),r.style.fill=&quot;none&quot;;const
        w=document.createElementNS(t,&quot;use&quot;);w.setAttributeNS(e,&quot;xlink:href&quot;,&quot;#&quot;+o);const
        m=&quot;patchjs_clip&quot;+n,M=document.createElementNS(t,&quot;clipPath&quot;);M.setAttribute(&quot;id&quot;,m),M.appendChild(w),r.parentElement.insertBefore(M,r),y.setAttribute(&quot;clip-path&quot;,&quot;url(#&quot;+m+&quot;)&quot;),u=null,l=null,g=null}}if(a&amp;&amp;a[1]){const
        o=document.getElementById(a[1]);if(o&amp;&amp;&quot;meshgradient&quot;===o.nodeName){const
        i=parseFloat(r.style.strokeWidth.slice(0,-2))*(parseFloat(r.style.strokeMiterlimit)||parseFloat(r.getAttribute(&quot;stroke-miterlimit&quot;))||1),a=r.getBBox(),l=Math.trunc(a.width+i),c=Math.trunc(a.height+i),u=Math.trunc(a.x-i/2),f=Math.trunc(a.y-i/2);let
        p=document.createElementNS(s,&quot;canvas&quot;);d(p,{width:l,height:c});const y=p.getContext(&quot;2d&quot;);let
        g=y.createImageData(l,c);const w=new b(o);&quot;objectBoundingBox&quot;===o.getAttribute(&quot;gradientUnits&quot;)&amp;&amp;w.scale(new
        x(l,c));const m=o.getAttribute(&quot;gradientTransform&quot;);null!=m&amp;&amp;w.transform(h(m)),&quot;userSpaceOnUse&quot;===o.getAttribute(&quot;gradientUnits&quot;)&amp;&amp;w.transform(new
        x(-u,-f)),w.paintMesh(g.data,p.width),y.putImageData(g,0,0);const M=document.createElementNS(t,&quot;image&quot;);d(M,{width:l,height:c,x:0,y:0});let
        S=p.toDataURL();M.setAttributeNS(e,&quot;xlink:href&quot;,S);const k=&quot;pattern_clip&quot;+n,A=document.createElementNS(t,&quot;pattern&quot;);d(A,{id:k,patternUnits:&quot;userSpaceOnUse&quot;,width:l,height:c,x:u,y:f}),A.appendChild(M),o.parentNode.appendChild(A),r.style.stroke=&quot;url(#&quot;+k+&quot;)&quot;,g=null,p=null,S=null}}})}();
    </script>
</svg>
