<?xml version="1.0" encoding="UTF-8" standalone="no"?>
<svg
   xmlns:dc="http://purl.org/dc/elements/1.1/"
   xmlns:cc="http://creativecommons.org/ns#"
   xmlns:rdf="http://www.w3.org/1999/02/22-rdf-syntax-ns#"
   xmlns:svg="http://www.w3.org/2000/svg"
   xmlns="http://www.w3.org/2000/svg"
   xmlns:sodipodi="http://sodipodi.sourceforge.net/DTD/sodipodi-0.dtd"
   xmlns:inkscape="http://www.inkscape.org/namespaces/inkscape"
   width="80"
   height="50"
   viewBox="0 0 21.166666 13.229167"
   version="1.1"
   id="svg8"
   inkscape:version="1.0.2-2 (e86c870879, 2021-01-15)"
   sodipodi:docname="magpie.svg">
  <defs
     id="defs2" />
  <sodipodi:namedview
     id="base"
     pagecolor="#ffffff"
     bordercolor="#666666"
     borderopacity="1.0"
     inkscape:pageopacity="0.0"
     inkscape:pageshadow="2"
     inkscape:zoom="2.8284272"
     inkscape:cx="43.944153"
     inkscape:cy="7.6242703"
     inkscape:document-units="mm"
     inkscape:current-layer="layer1"
     showgrid="false"
     inkscape:snap-nodes="false"
     inkscape:window-width="2560"
     inkscape:window-height="1377"
     inkscape:window-x="-8"
     inkscape:window-y="-8"
     inkscape:window-maximized="1"
     inkscape:document-rotation="0"
     units="px" />
  <metadata
     id="metadata5">
    <rdf:RDF>
      <cc:Work
         rdf:about="">
        <dc:format>image/svg+xml</dc:format>
        <dc:type
           rdf:resource="http://purl.org/dc/dcmitype/StillImage" />
        <dc:title></dc:title>
      </cc:Work>
    </rdf:RDF>
  </metadata>
  <g
     inkscape:label="Layer 1"
     inkscape:groupmode="layer"
     id="layer1">
    <g
       id="g965"
       style="opacity:0.804"
       transform="matrix(0.22169923,0,0,0.22169923,12.177344,43.410167)">
      <path
         sodipodi:nodetypes="cccccccccccc"
         inkscape:connector-curvature="0"
         id="path961"
         d="m 18.133102,-153.084 c 2.923888,-1.21733 4.955282,-3.01309 6.487269,-4.64028 1.981271,-2.45493 1.933746,-2.70839 3.144599,-4.82769 l 1.440035,-9.35271 -4.27544,-3.26035 -10.14956,0.28064 -10.4769657,4.0224 -7.5770911,6.7352 0.4677217,5.00462 10.5705097,6.36101 7.3432304,0.0468 z"
         style="fill:#fcfcfc;fill-opacity:1;stroke:#ffffff;stroke-width:0.264583px;stroke-linecap:butt;stroke-linejoin:miter;stroke-opacity:1" />
      <path
         sodipodi:nodetypes="ccccsccccccccccccscsccscccccscsccccsccccccsccccsscccccccccscsccscccsccccccccccccccccccsscccccccc"
         inkscape:connector-curvature="0"
         d="m 91.197266,-715.94141 c -13.863001,5.6743 -24.683205,18.54031 -30.464844,31.16407 -5.858152,14.27057 -22.623653,19.60618 -35.082031,28.75781 -8.740959,4.9695 -15.645395,12.3605 -22.5371098,18.55078 -4.7447884,4.25582 -12.1697873,10.98843 -16.5000002,14.96094 -4.33022,3.97251 -8.998047,8.12213 -10.373047,9.22265 -1.374999,1.10045 -3.625,3.05517 -5,4.3418 -16.00385,14.47551 -22.507231,24.332 -42.77539,31.69922 -12.472861,4.4183 -24.073341,8.76299 -33.164064,12.42187 -22.22231,8.37602 -46.94318,15.99421 -66.56055,23.45704 -4.45574,2.06051 -27.94596,8.53399 -28.5,12.11914 0,1.92873 6.24554,2.92876 12.80274,2.05078 53.69163,-2.90019 103.139001,-31.98883 148.962889,-44.49414 3.154191,-0.80213 9.365275,-2.37714 13.802735,-3.5 11.28038,-1.7225 28.6395722,-1.81314 39.478515,0.48633 0.391484,0.24194 0.478966,2.50082 0.195313,5.01757 -0.284531,2.52435 -0.0092,5.55754 0.613281,6.76563 1.806448,3.50585 7.160791,27.48549 6.513672,29.17187 -0.730488,1.90364 -3.14216,2.52331 -11.044922,2.83399 -6.6854697,0.26294 -10.3242186,2.35598 -10.3242186,5.94336 0,1.66896 0.4202526,1.50278 2.9023437,-1.1543 3.2623106,-3.49232 4.5980122,-3.85137 5.5078125,-1.48047 0.7309794,1.90488 6.2612014,1.38287 11.1503904,-1.05273 1.617691,-0.80587 5.189454,-1.70759 7.939453,-2.00391 12.688258,-1.36762 16.896554,-2.44137 18.658204,-4.75977 1.552117,-2.04262 2.001837,-2.15735 3.896484,-0.99023 2.5178,1.55101 3.64616,1.00852 1.539062,-0.74023 -0.800171,-0.66407 -2.835307,-1.24693 -4.523437,-1.29493 -1.864434,-0.053 -3.070313,-0.61682 -3.070313,-1.43554 0,-1.56405 2.58924,-1.8213 3.5,-0.34766 0.33992,0.55 1.112066,1 1.714844,1 0.602789,0 0.280646,-0.90001 -0.714844,-2 -2.554722,-2.82293 -5.875921,-2.48552 -9.845703,1 -3.534828,3.10364 -6.05391,3.78039 -7.195312,1.93359 -1.044688,-1.69033 0.340866,-2.34467 2.017578,-0.95312 1.013718,0.84113 1.523437,0.89403 1.523437,0.16016 0,-1.61636 -4.799491,-2.55134 -6.376953,-1.24219 -1.089388,0.90414 -1.658882,0.002 -2.927734,-4.63867 -3.992398,-14.60206 -4.478249,-23.53684 -1.417969,-26.07422 0.672949,-0.55794 4.962794,-0.99546 9.533203,-0.97656 7.280144,0.0323 8.225181,0.23853 7.626953,1.66406 -2.83466,6.75454 -2.883008,7.07882 -1.267578,8.36133 2.13182,1.69247 8.536211,11.25251 9.40625,14.04101 0.38157,1.22294 0.970213,2.44946 1.308594,2.72461 1.224998,0.9956 4.990803,9.58027 5.658203,12.90039 0.90314,4.47015 -7.525764,4.59331 -10.259765,4.59961 -7.933361,0 -8.328046,0.1129 -11.478516,3.25 -3.61457,3.59932 -3.04437,4.3714 0.923828,1.25 2.938747,-2.31163 6.273438,-2.63468 6.273438,-0.60742 0,1.80986 2.294484,2.66904 4.091796,1.53125 0.775129,-0.4907 2.591769,-0.90064 4.03711,-0.9082 1.445329,-0.008 4.208847,-0.67643 6.142578,-1.48438 2.740637,-1.14516 6.069401,-1.33134 15.095703,-0.84766 10.200839,0.54668 11.65459,0.42366 12.212891,-1.03124 0.810969,-2.11378 3.254456,-2.11344 5.591796,0.002 1.005808,0.91022 1.82006,1.24776 1.8125,0.75 -0.03016,-1.78039 -1.521042,-3.20962 -3.708984,-3.55469 -1.699748,-0.26808 -2.000536,-0.70335 -1.279297,-1.84961 0.778031,-1.23632 1.298335,-1.28041 2.960938,-0.25 2.818507,1.74679 3.256254,1.565 1.810547,-0.75 -0.957317,-1.5329 -2.330767,-2 -5.884766,-2 -2.737561,0 -5.110334,0.56848 -5.791016,1.38867 -0.634148,0.76407 -2.206643,1.59147 -3.496093,1.83789 -1.918428,0.36677 -2.345703,0.024 -2.345703,-1.88867 -10e-7,-2.79828 0.466264,-2.88716 3.091796,-0.58789 1.909369,1.67225 1.967886,1.66817 1.328125,-0.082 -0.368265,-1.00747 -0.669921,-2.24498 -0.669921,-2.75 -10e-7,-0.50498 -1.355911,-0.91797 -3.013672,-0.91797 -2.105741,0 -3.845849,0.93054 -5.773438,3.08789 l -2.759766,3.08789 -3.58789,-5.33789 c -1.973953,-2.93586 -5.745961,-9.81202 -8.382813,-15.2793 -4.679161,-9.70176 -4.766274,-10.04994 -3.597656,-14.5 1.291314,-4.91722 3.28666,-7.05859 6.576172,-7.05859 3.881095,-1.25179 7.630877,-2.95252 11.240234,-4.99023 0.06213,-1.09723 -9.24e-4,-0.86893 0.431702,-2.00982 0.752179,-1.37499 2.000687,-3.2875 2.773438,-4.25 1.414535,-1.7619 0.406678,-2.10192 -1.455079,-0.92383 -8.040556,3.73177 -30.96169,7.11766 -38.11914,1.36328 10.372332,-26.9231 30.427302,-30.29377 39.11914,-53.98828 3.177509,-7.43369 5.308383,-17.05897 9.341797,-17.75586 11.532877,5.78529 23.665733,24.13227 23.707033,35.21875 0.3295,2.58805 -0.0846,4.47718 0.43929,6.76019 2.81649,-4.6376 5.05991,-9.63583 6.50586,-14.42383 1.94683,-6.62169 2.18002,-25.46962 0.46094,-37.22656 -1.52037,-9.58043 1.30247,-21.11305 10.79493,-25.42188 1.77846,-0.74309 5.20716,-1.35156 7.61914,-1.35156 8.6267,0 16.67773,-1.24269 16.67773,-2.57422 0,-2.28412 -6.28914,-5.86534 -14.44921,-8.22656 -6.30622,-1.82476 -8.9036,-3.19043 -12.55664,-6.60742 -7.75184,-7.48678 -20.451258,-7.90854 -29.037024,-6.30319 z m -20.707032,59.75196 c 8.29259,0.37399 -3.392774,5.70418 -6.427734,8.15429 -19.763034,14.70146 -41.01184,21.57417 -62.8222656,27.30469 -13.9337974,2.6663 -11.6803204,-0.85599 -2.5546875,-5.7793 25.9620781,-10.44274 44.1446771,-28.20234 71.8046871,-29.67968 z"
         style="fill:#000000;stroke-width:3.77953"
         transform="scale(0.26458333)"
         id="path919" />
    </g>
  </g>
</svg>
