alternative;h_ups_inv_nons;a_ups_nons;a_int_nons;h_int_nat_nons;h_int_inv_nons;h_ups_nat_nons;h_ups_inv_goodmorph_nons;a_ups_goodmorph_nons;a_int_goodmorph_nons;h_int_nat_goodmorph_nons;h_int_inv_goodmorph_nons;h_ups_nat_goodmorph_nons;h_ups_inv_noimp_nons;a_ups_noimp_nons;a_int_noimp_nons;h_int_nat_noimp_nons;h_int_inv_noimp_nons;h_ups_nat_noimp_nons;h_ups_inv_goodmorphnoimp_nons;a_ups_goodmorphnoimp_nons;a_int_goodmorphnoimp_nons;h_int_nat_goodmorphnoimp_nons;h_int_inv_goodmorphnoimp_nons;h_ups_nat_goodmorphnoimp_nons;h_ups_inv_salm;a_ups_salm;a_int_salm;h_int_nat_salm;h_int_inv_salm;h_ups_nat_salm;h_ups_inv_goodmorph_salm;a_ups_goodmorph_salm;a_int_goodmorph_salm;h_int_nat_goodmorph_salm;h_int_inv_goodmorph_salm;h_ups_nat_goodmorph_salm;h_ups_inv_noimp_salm;a_ups_noimp_salm;a_int_noimp_salm;h_int_nat_noimp_salm;h_int_inv_noimp_salm;h_ups_nat_noimp_salm;h_ups_inv_goodmorphnoimp_salm;a_ups_goodmorphnoimp_salm;a_int_goodmorphnoimp_salm;h_int_nat_goodmorphnoimp_salm;h_int_inv_goodmorphnoimp_salm;h_ups_nat_goodmorphnoimp_salm;n_reg_nons;n_reg_salm;barrier_area;culvert_length;rehab_costs
nat;14258.373273068046;1.0;0.9999999999999998;123082.72109219743;123082.7210921974;14258.373273068046;14258.373273068046;1.0;0.9999999999999998;123082.72109219743;123082.7210921974;14258.373273068046;14258.373273068046;1.0;0.9999999999999998;123082.72109219743;123082.7210921974;14258.373273068046;14258.373273068046;1.0;0.9999999999999998;123082.72109219743;123082.7210921974;14258.373273068046;27339.347371302123;1.0;1.0000000000000002;154631.65065238267;154631.6506523827;27339.347371302123;27339.347371302123;1.0;1.0000000000000002;154631.65065238267;154631.6506523827;27339.347371302123;27339.347371302123;1.0;1.0000000000000002;154631.65065238267;154631.6506523827;27339.347371302123;27339.347371302123;1.0;1.0000000000000002;154631.65065238267;154631.6506523827;27339.347371302123;93;91;0.0;0.0;0.0
cur;1328.5248773829942;0.06589467218086602;0.3447623567121001;128985.68762724762;44469.40964850066;20161.339808118217;1476.538860368924;0.0732361477174437;0.39764194868809893;128985.68762724762;51290.12018097316;20161.339808118217;939.5508326612406;0.06589467218086603;0.3575536315976172;123082.72109219743;44008.673913431834;14258.373273068046;1044.228331236863;0.07323614771744372;0.41177410018826094;123082.72109219743;50682.27672646228;14258.373273068046;1328.5248773829942;0.039964873718647036;0.30152724208068366;160534.61718743286;48405.56037900494;33242.313906352305;1476.538860368924;0.044417451340135826;0.34906416530477663;160534.61718743286;56036.8821510531;33242.313906352305;939.5508326612406;0.03436624949019372;0.31626932472794334;154631.65065238267;48905.2477333963;27339.347371302123;1044.228331236863;0.03819507163265281;0.36509002437920707;154631.65065238267;56454.473106475416;27339.347371302123;212;187;0.0;0.0;0.0
alt1;15259.359946758268;0.7568623956535813;0.450865105121528;128985.68762724762;58155.14561123157;20161.339808118217;20161.339808118217;1.0;0.5378534386733747;128985.68762724762;69375.39562996489;20161.339808118217;10791.626553577273;0.756862395653581;0.4361896758671351;123082.72109219743;53687.41221805059;14258.373273068046;14258.373273068046;1.0;0.5156891928589188;123082.72109219743;63472.42909491472;14258.373273068046;15360.890328104506;0.4620884807049842;0.3515978152029832;160534.61718743286;56443.620667548676;33242.313906352305;20284.469407433975;0.6102002846305412;0.41539858549201003;160534.61718743286;66685.85290216093;33242.313906352305;10893.156934923512;0.39844246415179485;0.3480537869882991;154631.65065238267;53820.13159781348;27339.347371302123;14381.502872383804;0.5260368024541779;0.4071872784809995;154631.65065238267;62964.04099616837;27339.347371302123;200;180;64.85000000000001;0.0;1.02275
