barrier;x;y
1525;2.611326596521154e6;1.1853397728587762e6
1526;2.6112837349808663e6;1.1853270616061576e6
1528;2.61125026357916e6;1.185319138464298e6
1529;2.6108475119251683e6;1.185341720686607e6
1530;2.6107979323926233e6;1.1853480738151446e6
1532;2.6108715169017427e6;1.1853347361870036e6
1533;2.611138449939225e6;1.185381684690509e6
1535;2.610960657888774e6;1.1853369156621546e6
1537;2.611067596120931e6;1.1853573878507428e6
1538;2.6112146763774343e6;1.1853353493774123e6
1540;2.6103400254553407e6;1.1853397917740755e6
1543;2.610225346648164e6;1.1852900679486059e6
1545;2.6107580750293434e6;1.1853513762257881e6
1546;2.610748333046388e6;1.1853529269363396e6
1549;2.610582894550111e6;1.1853955237103403e6
1552;2.610479571494166e6;1.1853773334723227e6
