culvert;id;x_start;x_end;y_start;y_end
8;8;2.6077009305474795e6;2.6076975902362764e6;1.194551368848268e6;1.1945265927321166e6
62;62;2.607890085336201e6;2.60786427603234e6;1.1949305439563133e6;1.1949073508777134e6
280;280;2.6078023853258938e6;2.607732960493531e6;1.1932331071364917e6;1.1932856981031634e6
