alternative;h_ups_inv_nons;a_ups_nons;a_int_nons;h_int_nat_nons;h_int_inv_nons;h_ups_nat_nons;h_ups_inv_goodmorph_nons;a_ups_goodmorph_nons;a_int_goodmorph_nons;h_int_nat_goodmorph_nons;h_int_inv_goodmorph_nons;h_ups_nat_goodmorph_nons;h_ups_inv_noimp_nons;a_ups_noimp_nons;a_int_noimp_nons;h_int_nat_noimp_nons;h_int_inv_noimp_nons;h_ups_nat_noimp_nons;h_ups_inv_goodmorphnoimp_nons;a_ups_goodmorphnoimp_nons;a_int_goodmorphnoimp_nons;h_int_nat_goodmorphnoimp_nons;h_int_inv_goodmorphnoimp_nons;h_ups_nat_goodmorphnoimp_nons;h_ups_inv_salm;a_ups_salm;a_int_salm;h_int_nat_salm;h_int_inv_salm;h_ups_nat_salm;h_ups_inv_goodmorph_salm;a_ups_goodmorph_salm;a_int_goodmorph_salm;h_int_nat_goodmorph_salm;h_int_inv_goodmorph_salm;h_ups_nat_goodmorph_salm;h_ups_inv_noimp_salm;a_ups_noimp_salm;a_int_noimp_salm;h_int_nat_noimp_salm;h_int_inv_noimp_salm;h_ups_nat_noimp_salm;h_ups_inv_goodmorphnoimp_salm;a_ups_goodmorphnoimp_salm;a_int_goodmorphnoimp_salm;h_int_nat_goodmorphnoimp_salm;h_int_inv_goodmorphnoimp_salm;h_ups_nat_goodmorphnoimp_salm;n_reg_nons;n_reg_salm;barrier_area;culvert_length;rehab_costs
nat;3000.0;1.0;1.0;6000.0;6000.0;3000.0;3000.0;1.0;1.0;6000.0;6000.0;3000.0;3000.0;1.0;1.0;6000.0;6000.0;3000.0;3000.0;1.0;1.0;6000.0;6000.0;3000.0;6000.0;1.0;1.0;6000.0;6000.0;6000.0;6000.0;1.0;1.0;6000.0;6000.0;6000.0;6000.0;1.0;1.0;6000.0;6000.0;6000.0;6000.0;1.0;1.0;6000.0;6000.0;6000.0;2;1;0.0;0.0;0.0
cur;300.0;0.1;0.1;6000.0;600.0;3000.0;300.0;0.1;0.1;6000.0;600.0;3000.0;300.0;0.1;0.1;6000.0;600.0;3000.0;300.0;0.1;0.1;6000.0;600.0;3000.0;1500.0;0.25;0.375;6000.0;2250.0;6000.0;1500.0;0.25;0.375;6000.0;2250.0;6000.0;1500.0;0.25;0.375;6000.0;2250.0;6000.0;1500.0;0.25;0.375;6000.0;2250.0;6000.0;20;3;0.0;0.0;0.0
