alternative;h_ups_inv_nons;a_ups_nons;a_int_nons;h_int_nat_nons;h_int_inv_nons;h_ups_nat_nons;h_ups_inv_goodmorph_nons;a_ups_goodmorph_nons;a_int_goodmorph_nons;h_int_nat_goodmorph_nons;h_int_inv_goodmorph_nons;h_ups_nat_goodmorph_nons;h_ups_inv_noimp_nons;a_ups_noimp_nons;a_int_noimp_nons;h_int_nat_noimp_nons;h_int_inv_noimp_nons;h_ups_nat_noimp_nons;h_ups_inv_goodmorphnoimp_nons;a_ups_goodmorphnoimp_nons;a_int_goodmorphnoimp_nons;h_int_nat_goodmorphnoimp_nons;h_int_inv_goodmorphnoimp_nons;h_ups_nat_goodmorphnoimp_nons;h_ups_inv_salm;a_ups_salm;a_int_salm;h_int_nat_salm;h_int_inv_salm;h_ups_nat_salm;h_ups_inv_goodmorph_salm;a_ups_goodmorph_salm;a_int_goodmorph_salm;h_int_nat_goodmorph_salm;h_int_inv_goodmorph_salm;h_ups_nat_goodmorph_salm;h_ups_inv_noimp_salm;a_ups_noimp_salm;a_int_noimp_salm;h_int_nat_noimp_salm;h_int_inv_noimp_salm;h_ups_nat_noimp_salm;h_ups_inv_goodmorphnoimp_salm;a_ups_goodmorphnoimp_salm;a_int_goodmorphnoimp_salm;h_int_nat_goodmorphnoimp_salm;h_int_inv_goodmorphnoimp_salm;h_ups_nat_goodmorphnoimp_salm;n_reg_nons;n_reg_salm;barrier_area;culvert_length;rehab_costs
nat;482.842712474619;1.0;1.0;482.842712474619;482.842712474619;482.842712474619;482.842712474619;1.0;1.0;482.842712474619;482.842712474619;482.842712474619;482.842712474619;1.0;1.0;482.842712474619;482.842712474619;482.842712474619;482.842712474619;1.0;1.0;482.842712474619;482.842712474619;482.842712474619;482.842712474619;1.0;1.0;482.842712474619;482.842712474619;482.842712474619;482.842712474619;1.0;1.0;482.842712474619;482.842712474619;482.842712474619;482.842712474619;1.0;1.0;482.842712474619;482.842712474619;482.842712474619;482.842712474619;1.0;1.0;482.842712474619;482.842712474619;482.842712474619;1;1;0.0;0.0;0.0
cur;257.78174593052023;0.41293702272887917;0.32783149308277243;624.2640687119285;204.65342172375796;624.2640687119285;355.56349186104046;0.5695722526441258;0.5096805966759561;624.2640687119285;318.1752830244558;624.2640687119285;254.2462120245875;0.5265611460128481;0.4187573964820757;482.842712474619;202.19395718621493;482.842712474619;348.492424049175;0.7217514421272201;0.5983474041710037;482.842712474619;288.9076836320746;482.842712474619;257.78174593052023;0.41293702272887917;0.32783149308277243;624.2640687119285;204.65342172375796;624.2640687119285;355.56349186104046;0.5695722526441258;0.5096805966759561;624.2640687119285;318.1752830244558;624.2640687119285;254.2462120245875;0.5265611460128481;0.4187573964820757;482.842712474619;202.19395718621493;482.842712474619;348.492424049175;0.7217514421272201;0.5983474041710037;482.842712474619;288.9076836320746;482.842712474619;2;2;0.0;0.0;0.0
