culvert;id;x_start;x_end;y_start;y_end
10;10;2.61E+06;2.61E+06;1.18E+06;1.18E+06
13;13;2.61E+06;2.61E+06;1.18E+06;1.18E+06
242;242;2.61E+06;2.61E+06;1.18E+06;1.18E+06
244;244;2.61E+06;2.61E+06;1.18E+06;1.18E+06
247;247;2.61E+06;2.61E+06;1.18E+06;1.18E+06
