Depth	NH4_N14	NH4_N15	NO2_N14	NO2_N15	NO3_N14	NO3_N15	N2_N1414	N2_N1415	N2_N1515	N2O_N1414	N2O_N1415	N2O_N1515	O2	SO4
0.02044526243527689	0.0	0.0	-23.809070323966928	-0.08856277214637757	23.809070323966928	0.08856277214637757	0.0	0.0	0.0	0.0	0.0	0.0	-11.948816548056653	0.0
0.0620046013155065	0.0	0.0	-48.695111361416174	-0.18140608190776558	48.695111361416174	0.18140608190776558	0.0	0.0	0.0	0.0	0.0	0.0	-24.43825872166197	0.0
0.1049234467398047	0.0	0.0	-59.185320137949674	-0.22079483646878728	59.185320137949674	0.22079483646878728	0.0	0.0	0.0	0.0	0.0	0.0	-29.70305748720923	0.0
0.14924627145709302	0.0	0.0	-61.49558677747004	-0.22969601659927535	61.49558677747004	0.22969601659927535	0.0	0.0	0.0	0.0	0.0	0.0	-30.862641397034658	0.0
0.19501900302752978	0.0	0.0	-57.62193111339191	-0.21540699912885608	57.62193111339191	0.21540699912885608	0.0	0.0	0.0	0.0	0.0	0.0	-28.918669056260384	0.0
0.24228907141290584	0.0	0.0	-48.19516679837276	-0.18020171014105088	48.19516679837276	0.18020171014105088	0.0	0.0	0.0	0.0	0.0	0.0	-24.187684254256904	0.0
0.29110545812383803	0.0	0.0	-34.65782182581251	-0.12952334376909722	34.65782182581251	0.12952334376909722	0.0	0.0	0.0	0.0	0.0	0.0	-17.393672584790803	0.0
0.34151874697468526	0.0	0.0	-20.587850300640532	-0.07690353176566468	20.587850300640532	0.07690353176566468	0.0	0.0	0.0	0.0	0.0	0.0	-10.3323769162031	0.0
0.39358117649878205	0.0	0.0	-9.619571478189998	-0.035958995543984885	9.619571478189998	0.035958995543984885	0.0	0.0	0.0	0.0	0.0	0.0	-4.827765236866991	0.0
0.4473466940783001	0.0	0.0	-3.4141553107144946	-0.01278731022755809	3.4141553107144946	0.01278731022755809	0.0	0.0	0.0	0.0	0.0	0.0	-1.7134713104710264	0.0
0.5028710118448289	0.0	0.0	-0.9682444767231203	-0.0036332900088485377	0.9682444767231203	0.0036332900088485377	0.0	0.0	0.0	0.0	0.0	0.0	-0.4859388833659844	0.0
0.5602116644085998	0.0	0.0	-0.23593430373055413	-0.0008865160221321321	0.23593430373055413	0.0008865160221321321	0.0	0.0	0.0	0.0	0.0	0.0	-0.11841040987634313	0.0
0.619428068476173	0.0	0.0	-0.050893219035349276	-0.00019142819251203872	0.050893219035349276	0.00019142819251203872	0.0	0.0	0.0	0.0	0.0	0.0	-0.02554232361393066	0.0
0.6805815844183621	0.0	0.0	-0.009758406705237031	-3.6741603409831513e-5	0.009758406705237031	3.6741603409831513e-5	0.0	0.0	0.0	0.0	0.0	0.0	-0.004897574154323432	0.0
0.7437355798521958	0.0	0.0	-0.0016660512121223808	-6.279706308792368e-6	0.0016660512121223808	6.279706308792368e-6	0.0	0.0	0.0	0.0	0.0	0.0	-0.0008361654592155866	0.0
0.8089554953027993	0.0	0.0	-0.00025485710321835546	-9.617975511791642e-7	0.00025485710321835546	9.617975511791642e-7	0.0	0.0	0.0	0.0	0.0	0.0	-0.00012790945038476732	0.0
0.8763089120132334	0.0	0.0	-3.519506804836057e-5	-1.330109425258117e-7	3.519506804836057e-5	1.330109425258117e-7	0.0	0.0	0.0	0.0	0.0	0.0	-1.766403949544319e-5	0.0
0.9458656219725592	0.0	0.0	-4.408126193567612e-6	-1.6687178879561368e-8	4.408126193567612e-6	1.6687178879561368e-8	0.0	0.0	0.0	0.0	0.0	0.0	-2.2124066862235867e-6	0.0
1.0176977002346896	0.0	0.0	-5.016049229670043e-7	-1.9025878007707084e-9	5.016049229670043e-7	1.9025878007707084e-9	0.0	0.0	0.0	0.0	0.0	0.0	-2.5175375538388754e-7	0.0
1.0918795796029652	0.0	0.0	-5.149044472126323e-8	-1.9576002952895736e-10	5.149044472126323e-8	1.9576002952895736e-10	0.0	0.0	0.0	0.0	0.0	0.0	-2.5843102375396093e-8	0.0
1.168488127757843	0.0	0.0	-4.721260177162369e-9	-1.7999399423839376e-11	4.721260177162369e-9	1.7999399423839376e-11	0.0	0.0	0.0	0.0	0.0	0.0	-2.369629788293104e-9	0.0
1.2476027269076195	0.0	0.0	-3.8319482840199785e-10	-1.4656495762266368e-12	3.8319482840199785e-10	1.4656495762266368e-12	0.0	0.0	0.0	0.0	0.0	0.0	-1.9233023898911225e-10	0.0
1.3293053560447228	0.0	0.0	-2.7318232925304357e-11	-1.0487935021319638e-13	2.7318232925304357e-11	1.0487935021319638e-13	0.0	0.0	0.0	0.0	0.0	0.0	-1.3711556137758776e-11	0.0
1.4136806758928024	0.0	0.0	-1.7030128482208743e-12	-6.565933949803405e-15	1.7030128482208743e-12	6.565933949803405e-15	0.0	0.0	0.0	0.0	0.0	0.0	-8.547893910853388e-13	0.0
1.5008161166326492	0.0	0.0	-9.276898262683651e-14	-3.593574645280785e-16	9.276898262683651e-14	3.593574645280785e-16	0.0	0.0	0.0	0.0	0.0	0.0	-4.65641700456823e-14	0.0
1.5908019684978392	0.0	0.0	-4.42471886705477e-15	-1.7228379801083423e-17	4.42471886705477e-15	1.7228379801083423e-17	0.0	0.0	0.0	0.0	0.0	0.0	-2.2209736234279264e-15	0.0
1.6837314753339825	0.0	0.0	-1.8537311409889082e-16	-7.257955974220747e-19	1.8537311409889082e-16	7.257955974220747e-19	0.0	0.0	0.0	0.0	0.0	0.0	-9.304945484815644e-17	0.0
1.7797009312185192	0.0	0.0	-6.842162640487083e-18	-2.6948130421601944e-20	6.842162640487083e-18	2.6948130421601944e-20	0.0	0.0	0.0	0.0	0.0	0.0	-3.4345553854543428e-18	0.0
1.8788097802411838	0.0	0.0	-2.2293900595556637e-19	-8.83554150712372e-22	2.2293900595556637e-19	8.83554150712372e-22	0.0	0.0	0.0	0.0	0.0	0.0	-1.1191128005313937e-19	0.0
1.981160719548531	0.0	0.0	-6.4050506349662385e-21	-2.555122260970301e-23	6.4050506349662385e-21	2.555122260970301e-23	0.0	0.0	0.0	0.0	0.0	0.0	-3.215300928787971e-21	0.0
2.0868598057592953	0.0	0.0	-1.6126426942969854e-22	-6.477338355440809e-25	1.6126426942969854e-22	6.477338355440809e-25	0.0	0.0	0.0	0.0	0.0	0.0	-8.095600163262132e-23	0.0
2.196016564860857	0.0	0.0	-3.635112415783481e-24	-1.4704584603545707e-26	3.635112415783481e-24	1.4704584603545707e-26	0.0	0.0	0.0	0.0	0.0	0.0	-1.8249085001935134e-24	0.0
2.3087441057006837	0.0	0.0	-7.338949150457129e-26	-2.9905147416255163e-28	7.338949150457129e-26	2.9905147416255163e-28	0.0	0.0	0.0	0.0	0.0	0.0	-3.6844271489366925e-26	0.0
2.425159237190357	0.0	0.0	-1.3271701381093307e-27	-5.448933682753143e-30	1.3271701381093307e-27	5.448933682753143e-30	0.0	0.0	0.0	0.0	0.0	0.0	-6.663095358960419e-28	0.0
2.5453825893436184	0.0	0.0	-2.14961349965681e-29	-8.894265043947179e-32	2.14961349965681e-29	8.894265043947179e-32	0.0	0.0	0.0	0.0	0.0	0.0	-1.0792538823503785e-29	0.0
2.669538738273876	0.0	0.0	-3.117883424453551e-31	-1.3003591559081511e-33	3.117883424453551e-31	1.3003591559081511e-33	0.0	0.0	0.0	0.0	0.0	0.0	-1.5654435080063163e-31	0.0
2.797756335280666	0.0	0.0	-4.048847010249322e-33	-1.7024534362309365e-35	4.048847010249322e-33	1.7024534362309365e-35	0.0	0.0	0.0	0.0	0.0	0.0	-2.0329357723058155e-33	0.0
2.9301682401588547	0.0	0.0	-4.706145763609206e-35	-1.995420342755533e-37	4.706145763609206e-35	1.995420342755533e-37	0.0	0.0	0.0	0.0	0.0	0.0	-2.3630499835183807e-35	0.0
3.0669116588687064	0.0	0.0	-4.892539798183134e-37	-2.0922400741134357e-39	4.892539798183134e-37	2.0922400741134357e-39	0.0	0.0	0.0	0.0	0.0	0.0	-2.4567310994621343e-37	0.0
3.20812828570947	0.0	0.0	-4.492937575736599e-39	-1.9381930001143643e-41	4.492937575736599e-39	1.9381930001143643e-41	0.0	0.0	0.0	0.0	0.0	0.0	-2.2561597528688713e-39	0.0
3.353964450143808	0.0	0.0	-2.5380899614011765e-41	-1.1046963287622423e-43	2.5380899614011765e-41	1.1046963287622423e-43	0.0	0.0	0.0	0.0	0.0	0.0	-1.2745684623443995e-41	0.0
3.5045712684252086	0.0	0.0	2.023674794252743e-42	8.888409969718985e-45	-2.023674794252743e-42	-8.888409969718985e-45	0.0	0.0	0.0	0.0	0.0	0.0	1.0162816021112311e-42	0.0
3.660104800185498	0.0	0.0	3.879343517186198e-43	1.719751261883436e-45	-3.879343517186198e-43	-1.719751261883436e-45	0.0	0.0	0.0	0.0	0.0	0.0	1.9482705149025164e-43	0.0
3.8207262101447066	0.0	0.0	6.017610440905013e-44	2.6929634505548475e-46	-6.017610440905013e-44	-2.6929634505548475e-46	0.0	0.0	0.0	0.0	0.0	0.0	3.022270037705281e-44	0.0
3.98660193511086	0.0	0.0	8.410786043399337e-45	3.800276857631331e-47	-8.410786043399337e-45	-3.800276857631331e-47	0.0	0.0	0.0	0.0	0.0	0.0	4.2243944059878253e-45	0.0
4.157903856442733	0.0	0.0	1.0504629398320567e-45	4.792953345267085e-48	-1.0504629398320567e-45	-4.792953345267085e-48	0.0	0.0	0.0	0.0	0.0	0.0	5.2762794658866185e-46	0.0
4.3348094781542805	0.0	0.0	1.1465185446538876e-46	5.283444688083947e-49	-1.1465185446538876e-46	-5.283444688083947e-49	0.0	0.0	0.0	0.0	0.0	0.0	5.759009946709858e-47	0.0
4.517502110845298	0.0	0.0	1.0321070921187138e-47	4.804447240853653e-50	-1.0321070921187138e-47	-4.804447240853653e-50	0.0	0.0	0.0	0.0	0.0	0.0	5.1845576967978374e-48	0.0
4.706171061648892	0.0	0.0	6.672118997532224e-49	3.1380757088894026e-51	-6.672118997532224e-49	-3.1380757088894026e-51	0.0	0.0	0.0	0.0	0.0	0.0	3.351749877310559e-49	0.0
4.901011830392593	0.0	0.0	3.0606733229821874e-50	1.4562111356060437e-52	-3.0606733229821874e-50	-1.4562111356060437e-52	0.0	0.0	0.0	0.0	0.0	0.0	1.537617717169124e-50	0.0
