Depth	NH4_N14	NH4_N15	NO2_N14	NO2_N15	NO3_N14	NO3_N15	N2_N1414	N2_N1415	N2_N1515	N2O_N1414	N2O_N1415	N2O_N1515	O2	SO4
0.02044526243527689	-140.20000027120577	-0.5143117686362481	140.19392821153627	0.5142900758381108	0.0	0.0	0.0	0.0	0.0	0.0030252220471359047	2.161557519568174e-5	3.8611470807780823e-8	-211.06842118352918	0.0
0.0620046013155065	-283.6163179607342	-1.0435140915899686	283.58394304466094	1.0433980863370003	0.0	0.0	0.0	0.0	0.0	0.01612966250212403	0.00011559106900027267	2.0709198395915476e-7	-426.9735026178231	0.0
0.1049234467398047	-377.61601659230655	-1.3918930668059992	377.5370976287892	1.3916097712155817	0.0	0.0	0.0	0.0	0.0	0.03931834061815631	0.0002822822810440024	5.066546867100569e-7	-568.4722633591149	0.0
0.14924627145709302	-460.76780169195547	-1.7000000339087322	460.5938838353179	1.6993751262171712	0.0	0.0	0.0	0.0	0.0	0.0866475931376016	0.0006226703623627969	1.1186645991115314e-6	-693.6144312066317	0.0
0.19501900302752978	-543.7411109693656	-2.0058064262966644	543.3427575637285	2.004375312060587	0.0	0.0	0.0	0.0	0.0	0.1984637071904256	0.0014259912564344474	2.56148982125533e-6	-818.4204838335569	0.0
0.24228907141290584	-606.7283678258985	-2.2351183326080046	605.7725508092681	2.2316890801291507	0.0	0.0	0.0	0.0	0.0	0.47620001176998394	0.0034169930904752273	6.129694189295379e-6	-912.9656061032051	0.0
0.29110545812383803	-591.9628708937771	-2.1757747993167147	589.7242815802766	2.167761019165931	0.0	0.0	0.0	0.0	0.0	1.115302059513785	0.007985194472927538	1.4292838927929105e-5	-890.0846669928152	0.0
0.34151874697468526	-446.3175618943161	-1.636099118073287	441.866045610984	1.6202031343576846	0.0	0.0	0.0	0.0	0.0	2.2178384304194156	0.015839422493314693	2.8280611143783607e-5	-669.6967853850603	0.0
0.39358117649878205	-235.91508328998867	-0.8625462747834487	229.64602248160952	0.8402089347532794	0.0	0.0	0.0	0.0	0.0	3.1234013880596736	0.02225803225980512	3.965388518206839e-5	-352.02074527295355	0.0
0.4473466940783001	-91.24123322162117	-0.33276829158054677	85.78759552204512	0.3133676305952805	0.0	0.0	0.0	0.0	0.0	2.7171529047337786	0.01933189010849377	3.4385438386241266e-5	-134.6244830895219	0.0
0.5028710118448289	-28.995744436175187	-0.10553380776672783	26.18615204561996	0.09554986015086615	0.0	0.0	0.0	0.0	0.0	1.3998218977440675	0.009948595067095093	1.767627438328668e-5	-42.24212919682732	0.0
0.5602116644085998	-8.164198735633462	-0.029676597824365877	7.195787504275459	0.026237779930206977	0.0	0.0	0.0	0.0	0.0	0.48249229073043554	0.0034266498971327252	6.08399851308704e-6	-11.804887975560662	0.0
0.619428068476173	-2.1132595203519298	-0.007676251839807289	1.8446282770631657	0.006722800585079962	0.0	0.0	0.0	0.0	0.0	0.13384058207211263	0.0009500791445387993	1.6860550942636242e-6	-3.0466113110158597	0.0
0.6805815844183621	-0.5112573382048711	-0.0018563208590448763	0.4446778197909188	0.0016200908074940447	0.0	0.0	0.0	0.0	0.0	0.03317206178212965	0.0002353948496929263	4.176009289525535e-7	-0.7362626143631223	0.0
0.7437355798521958	-0.11628770549779084	-0.00042210232707292397	0.10098113592662268	0.00036780746190658844	0.0	0.0	0.0	0.0	0.0	0.007626233308941269	5.4102953285617584e-5	9.595594035897926e-8	-0.1673842795191284	0.0
0.8089554953027993	-0.02490418651685687	-9.03757132492085e-5	0.021604437486896413	7.867352309838309e-5	0.0	0.0	0.0	0.0	0.0	0.001644044096829406	1.1660836301644611e-5	2.067692459040261e-8	-0.03583611773510348	0.0
0.8763089120132334	-0.00502078412027852	-1.82162679841027e-5	0.004352098432931624	1.5845306174072374e-5	0.0	0.0	0.0	0.0	0.0	0.00033316155128210867	2.362584782678483e-6	4.1885136759204464e-9	-0.0072229722578154715	0.0
0.9458656219725592	-0.0009521303945889511	-3.453827769165857e-6	0.0008247492853001914	3.0022518225447163e-6	0.0	0.0	0.0	0.0	0.0	6.346556427942427e-5	4.4998072991117855e-7	7.976083549809487e-10	-0.001369459990919485	0.0
1.0176977002346896	-0.0001698885154444527	-6.161555686663407e-7	0.00014706633995167584	5.352625211914558e-7	0.0	0.0	0.0	0.0	0.0	1.1370784078729823e-5	8.060733531722036e-8	1.428560788322658e-10	-0.0002443054722495527	0.0
1.0918795796029652	-2.8445166646225746e-5	-1.0314814685973692e-7	2.460931260426605e-5	8.955410253691082e-8	0.0	0.0	0.0	0.0	0.0	1.911154002004984e-6	1.3546037949728242e-8	2.4003186548935054e-11	-4.0897748146486967e-5	0.0
1.168488127757843	-4.4574244796637e-6	-1.6160975501440435e-8	3.8541767732970034e-6	1.4023414892180815e-8	0.0	0.0	0.0	0.0	0.0	3.0055884664528297e-7	2.1300130761307045e-9	3.773766564457728e-12	-6.407685549259732e-6	0.0
1.2476027269076195	-6.529163726066883e-7	-2.3668769286699455e-9	5.64254853510814e-7	2.052755418316571e-9	0.0	0.0	0.0	0.0	0.0	4.4174253283419904e-8	3.130125290345058e-10	5.544906594343689e-13	-9.384370539999235e-7	0.0
1.3293053560447228	-8.929431594894893e-8	-3.236534805743421e-10	7.713015124174611e-8	2.8056233142071284e-10	0.0	0.0	0.0	0.0	0.0	6.060612834083862e-9	4.29390390350875e-11	7.60550592708945e-14	-1.283233262161067e-7	0.0
1.4136806758928024	-1.138956655500126e-8	-4.127677024297963e-11	9.833360028783867e-9	3.576463687352556e-11	0.0	0.0	0.0	0.0	0.0	7.753569240449129e-10	5.492678127566461e-12	9.727620943802724e-15	-1.6365405658072934e-8	0.0
1.5008161166326492	-1.353512021903091e-9	-4.904629664641434e-12	1.1680523509906657e-9	4.247801199956315e-12	0.0	0.0	0.0	0.0	0.0	9.240258023887808e-11	6.54510434669164e-13	1.1590150079774959e-15	-1.9445667276630437e-9	0.0
1.5908019684978392	-1.497173053872495e-10	-5.42456695987834e-13	1.2914811618052365e-10	4.696162176874171e-13	0.0	0.0	0.0	0.0	0.0	1.02483028819835e-11	7.258344275885456e-14	1.285177707810939e-16	-2.1506862828234287e-10	0.0
1.6837314753339825	-1.540095684172968e-11	-5.579469911262892e-14	1.3279737530308602e-11	4.828370721149961e-14	0.0	0.0	0.0	0.0	0.0	1.0568674106164244e-12	7.484490188229947e-15	1.3250856449684102e-17	-2.2120762159602364e-11	0.0
1.7797009312185192	-1.472060243769752e-12	-5.3324401633863396e-15	1.2688267704884355e-12	4.6128820687061574e-15	0.0	0.0	0.0	0.0	0.0	1.0125822691461271e-13	7.170194520911178e-16	1.2693212945319062e-18	-2.1141125102117094e-12	0.0
1.8788097802411838	-1.3063629516156528e-13	-4.7317550636631335e-16	1.1256004299699011e-13	4.0918131703965034e-16	0.0	0.0	0.0	0.0	0.0	9.00624186526074e-15	6.376843405368146e-17	1.128776364907505e-19	-1.8759408282494648e-13	0.0
1.981160719548531	-1.0750147655518472e-14	-3.893439805584171e-17	9.259480176050567e-15	3.3657521782583075e-17	0.0	0.0	0.0	0.0	0.0	7.427046085689016e-16	5.258262330101989e-18	9.30697157832586e-21	-1.543565090249089e-14	0.0
2.0868598057592953	-8.166759156067602e-16	-2.9575502604850353e-18	7.032054944962398e-16	2.55590254049562e-18	0.0	0.0	0.0	0.0	0.0	5.65350950379373e-17	4.0023103464568264e-19	7.083426718663122e-22	-1.1725141643856129e-15	0.0
2.196016564860857	-5.795943222021189e-17	-2.0988088747437871e-19	4.989153703751614e-17	1.8132522762766163e-19	0.0	0.0	0.0	0.0	0.0	4.019720118409644e-18	2.8454945876467693e-20	5.0356985124691215e-23	-8.320574424025817e-17	0.0
2.3087441057006837	-3.8433029391479665e-18	-1.3916260016082354e-20	3.307399789218708e-18	1.2019597183463747e-20	0.0	0.0	0.0	0.0	0.0	2.6700658803618996e-19	1.8899738568784267e-21	3.344487870089341e-24	-5.516928892365134e-18	0.0
2.425159237190357	-2.381637735827302e-19	-8.62313692640468e-22	2.0490160486933324e-19	7.445995657233017e-22	0.0	0.0	0.0	0.0	0.0	1.657243485262143e-20	1.17299008154103e-22	2.075593815316751e-25	-3.4184918949289896e-19	0.0
2.5453825893436184	-1.3795458762043282e-20	-4.9945880913698493e-23	1.1865906294323029e-20	4.311760702108425e-23	0.0	0.0	0.0	0.0	0.0	9.6137413621047e-22	6.804195299313567e-24	1.203929665033791e-26	-1.9799916593629037e-20	0.0
2.669538738273876	-7.471295484962357e-22	-2.7048019451781788e-24	6.424844704611025e-22	2.334503928730919e-24	0.0	0.0	0.0	0.0	0.0	5.213804286907713e-23	3.6899229697892735e-25	6.528597341660963e-28	-1.0722438376363306e-21	0.0
2.797756335280666	-3.784187937456388e-23	-1.3699040887437278e-25	3.2534758115504645e-23	1.1821144749286253e-25	0.0	0.0	0.0	0.0	0.0	2.64420425586077e-24	1.8712747337691913e-26	3.310702190915899e-29	-5.430535456493701e-23	0.0
2.9301682401588547	-1.7929976772779157e-24	-6.490479713895258e-27	1.5412333274114695e-24	5.599663033237391e-27	0.0	0.0	0.0	0.0	0.0	1.254383370226015e-25	8.876758212431026e-28	1.5704297073821228e-30	-2.5729046522141645e-24	0.0
3.0669116588687064	-7.94538929007961e-26	-2.876029803932214e-28	6.82845875821884e-26	2.480842274903103e-28	0.0	0.0	0.0	0.0	0.0	5.564962948136679e-27	3.937942233433072e-29	6.96652842902045e-32	-1.1400783178602867e-25	0.0
3.20812828570947	-3.2538349233140535e-27	-1.1777584191061085e-29	2.7959308722656133e-27	1.0157506729888115e-29	0.0	0.0	0.0	0.0	0.0	2.2814484262950544e-28	1.6143657894296094e-30	2.855835871680181e-33	-4.668656697002865e-27	0.0
3.353964450143808	-8.580163701387128e-29	-3.105560511365282e-31	7.371467950448838e-29	2.6779349628478706e-31	0.0	0.0	0.0	0.0	0.0	6.022172855596148e-30	4.261179819060102e-32	7.537833057005309e-35	-1.2310342956539438e-28	0.0
3.5045712684252086	3.3443323166877943e-29	1.2104271434377314e-31	-2.8727576786891824e-29	-1.0435935721664002e-31	0.0	0.0	0.0	0.0	0.0	-2.349560918564993e-30	-1.6624542856136407e-32	-2.94071354983545e-35	4.798033395327595e-29	0.0
3.660104800185498	3.283809609989666e-29	1.1884829828676782e-31	-2.8203433549389685e-29	-1.0245228084547059e-31	0.0	0.0	0.0	0.0	0.0	-2.3091621663396262e-30	-1.633821782772369e-32	-2.8899806786771127e-35	4.7109887313301006e-29	0.0
3.8207262101447066	2.7351242853303296e-29	9.898711950218802e-32	-2.3487590724326655e-29	-8.531907755870863e-32	0.0	0.0	0.0	0.0	0.0	-1.925016134301237e-30	-1.3619860374165132e-32	-2.409078465712297e-35	3.9236684873748164e-29	0.0
3.98660193511086	2.1528526520337713e-29	7.791181212970794e-32	-1.8484842371879896e-29	-6.714476542211457e-32	0.0	0.0	0.0	0.0	0.0	-1.516477527982193e-30	-1.0729092493433061e-32	-1.8977107080150766e-35	3.088243190111843e-29	0.0
4.157903856442733	1.5888480797910387e-29	5.749888488230628e-32	-1.364037322037654e-29	-4.954638905739523e-32	0.0	0.0	0.0	0.0	0.0	-1.1200915569240297e-30	-7.924463685788498e-33	-1.4016069561276018e-35	2.2790939487509664e-29	0.0
4.3348094781542805	1.0757513612922402e-29	3.8929390314813946e-32	-9.234223874239421e-30	-3.354100339817831e-32	0.0	0.0	0.0	0.0	0.0	-7.589601725564997e-31	-5.369393569980676e-33	-9.496673327480697e-36	1.5430325442056014e-29	0.0
4.517502110845298	6.309158593384595e-30	2.2831073486291086e-32	-5.4151009651470874e-30	-1.9668561641155624e-32	0.0	0.0	0.0	0.0	0.0	-4.454531317899588e-31	-3.151364657590494e-33	-5.573593772483108e-36	9.049374430265009e-30	0.0
4.706171061648892	2.7850290657138174e-30	1.007799882087134e-32	-2.3900849042572604e-30	-8.681009168990428e-33	0.0	0.0	0.0	0.0	0.0	-1.9677604789761912e-31	-1.3920656613187288e-33	-2.461995281091063e-36	3.9944900212478146e-30	0.0
4.901011830392593	8.121274294527527e-31	2.93872463503026e-33	-6.968800249050908e-31	-2.531081710966089e-33	0.0	0.0	0.0	0.0	0.0	-5.742059920998885e-32	-4.06206127684141e-34	-7.183981900150599e-37	1.1647717073958114e-30	0.0
