Depth	NH4_N14	NH4_N15	NO2_N14	NO2_N15	NO3_N14	NO3_N15	N2_N1414	N2_N1415	N2_N1515	N2O_N1414	N2O_N1415	N2O_N1515	O2	SO4
0.02044526243527689	322.7362240921046	1.188106278284333	0.0	0.0	0.0	0.0	0.0	0.0	0.0	0.0	0.0	0.0	-2353.197582922291	0.0
0.0620046013155065	312.79448816817796	1.1515072293195314	0.0	0.0	0.0	0.0	0.0	0.0	0.0	0.0	0.0	0.0	-2280.708450312376	0.0
0.1049234467398047	298.3290175419112	1.0982547116706283	0.0	0.0	0.0	0.0	0.0	0.0	0.0	0.0	0.0	0.0	-2175.2349770159612	0.0
0.14924627145709302	276.67308645384765	1.0185315638888712	0.0	0.0	0.0	0.0	0.0	0.0	0.0	0.0	0.0	0.0	-2017.333009749283	0.0
0.19501900302752978	243.75289267350186	0.8973406779795057	0.0	0.0	0.0	0.0	0.0	0.0	0.0	0.0	0.0	0.0	-1777.298843608903	0.0
0.24228907141290584	195.04149962188953	0.71801679801715	0.0	0.0	0.0	0.0	0.0	0.0	0.0	0.0	0.0	0.0	-1422.124791758068	0.0
0.29110545812383803	131.3672139945222	0.4836092141397511	0.0	0.0	0.0	0.0	0.0	0.0	0.0	0.0	0.0	0.0	-957.8503662449821	0.0
0.34151874697468526	68.4574308216944	0.25201603440479836	0.0	0.0	0.0	0.0	0.0	0.0	0.0	0.0	0.0	0.0	-499.15023079871946	0.0
0.39358117649878205	27.22972036246584	0.10024223902842602	0.0	0.0	0.0	0.0	0.0	0.0	0.0	0.0	0.0	0.0	-198.54267156053058	0.0
0.4473466940783001	8.9167951509621	0.03282587918612431	0.0	0.0	0.0	0.0	0.0	0.0	0.0	0.0	0.0	0.0	-65.01588365447617	0.0
0.5028710118448289	2.596848905024005	0.00955992001360933	0.0	0.0	0.0	0.0	0.0	0.0	0.0	0.0	0.0	0.0	-18.93465347345986	0.0
0.5602116644085998	0.6996907425930062	0.002575809289678416	0.0	0.0	0.0	0.0	0.0	0.0	0.0	0.0	0.0	0.0	-5.101722215703538	0.0
0.619428068476173	0.1770317778434647	0.0006517166373354843	0.0	0.0	0.0	0.0	0.0	0.0	0.0	0.0	0.0	0.0	-1.290808780122518	0.0
0.6805815844183621	0.0422510226411088	0.0001555409697348037	0.0	0.0	0.0	0.0	0.0	0.0	0.0	0.0	0.0	0.0	-0.30806893349126396	0.0
0.7437355798521958	0.009518751858734324	3.5041894899177465e-5	0.0	0.0	0.0	0.0	0.0	0.0	0.0	0.0	0.0	0.0	-0.06940498832885322	0.0
0.8089554953027993	0.0020230948843360064	7.4477283744837885e-6	0.0	0.0	0.0	0.0	0.0	0.0	0.0	0.0	0.0	0.0	-0.014751185756214619	0.0
0.8763089120132334	0.0004052099569788615	1.4917212818741893e-6	0.0	0.0	0.0	0.0	0.0	0.0	0.0	0.0	0.0	0.0	-0.002954546221209353	0.0
0.9458656219725592	7.639454998665355e-5	2.8123537951521156e-7	0.0	0.0	0.0	0.0	0.0	0.0	0.0	0.0	0.0	0.0	-0.0005570229089800745	0.0
1.0176977002346896	1.3558024848072154e-5	4.991188853511654e-8	0.0	0.0	0.0	0.0	0.0	0.0	0.0	0.0	0.0	0.0	-9.885692686476551e-5	0.0
1.0918795796029652	2.2587294098746877e-6	8.315182469420341e-9	0.0	0.0	0.0	0.0	0.0	0.0	0.0	0.0	0.0	0.0	-1.6469290370936827e-5	0.0
1.168488127757843	3.522855093032444e-7	1.2968876565660296e-9	0.0	0.0	0.0	0.0	0.0	0.0	0.0	0.0	0.0	0.0	-2.568653120123133e-6	0.0
1.2476027269076195	5.137388895092968e-8	1.8912546979871204e-10	0.0	0.0	0.0	0.0	0.0	0.0	0.0	0.0	0.0	0.0	-3.7458736354969784e-7	0.0
1.3293053560447228	6.996693993856971e-9	2.5757307177775576e-11	0.0	0.0	0.0	0.0	0.0	0.0	0.0	0.0	0.0	0.0	-5.1015665939291525e-8	0.0
1.4136806758928024	8.889212058123816e-10	3.2724336057930836e-12	0.0	0.0	0.0	0.0	0.0	0.0	0.0	0.0	0.0	0.0	-6.481476440429232e-9	0.0
1.5008161166326492	1.052450243494694e-10	3.87444187709486e-13	0.0	0.0	0.0	0.0	0.0	0.0	0.0	0.0	0.0	0.0	-7.673831396226833e-10	0.0
1.5908019684978392	1.1600728290635388e-11	4.270638709226867e-14	0.0	0.0	0.0	0.0	0.0	0.0	0.0	0.0	0.0	0.0	-8.458550275989697e-11	0.0
1.6837314753339825	1.1893769901906764e-12	4.3785176989899484e-15	0.0	0.0	0.0	0.0	0.0	0.0	0.0	0.0	0.0	0.0	-8.67221851644809e-12	0.0
1.7797009312185192	1.1332752483696607e-13	4.171987329280929e-16	0.0	0.0	0.0	0.0	0.0	0.0	0.0	0.0	0.0	0.0	-8.263158505839339e-13	0.0
1.8788097802411838	1.0027344838841792e-14	3.691420568318346e-17	0.0	0.0	0.0	0.0	0.0	0.0	0.0	0.0	0.0	0.0	-7.31133411016073e-14	0.0
1.981160719548531	8.228452177749791e-16	3.0291845052252027e-18	0.0	0.0	0.0	0.0	0.0	0.0	0.0	0.0	0.0	0.0	-5.999690251797233e-15	0.0
2.0868598057592953	6.234583417162859e-17	2.295170838432015e-19	0.0	0.0	0.0	0.0	0.0	0.0	0.0	0.0	0.0	0.0	-4.545881600079721e-16	0.0
2.196016564860857	4.413864611521475e-18	1.62489979896062e-20	0.0	0.0	0.0	0.0	0.0	0.0	0.0	0.0	0.0	0.0	-3.218323435616062e-17	0.0
2.3087441057006837	2.9201991310231095e-19	1.0750286650248656e-21	0.0	0.0	0.0	0.0	0.0	0.0	0.0	0.0	0.0	0.0	-2.129232798737286e-18	0.0
2.425159237190357	1.8057825638023552e-20	6.647724801594232e-23	0.0	0.0	0.0	0.0	0.0	0.0	0.0	0.0	0.0	0.0	-1.3166675592046987e-19	0.0
2.5453825893436184	1.0439277693771912e-21	3.843067633208835e-24	0.0	0.0	0.0	0.0	0.0	0.0	0.0	0.0	0.0	0.0	-7.6116906633412e-21	0.0
2.669538738273876	5.643280019299005e-23	2.0774911275940985e-25	0.0	0.0	0.0	0.0	0.0	0.0	0.0	0.0	0.0	0.0	-4.114738882666675e-22	0.0
2.797756335280666	2.8533905617351e-24	1.0504340658789001e-26	0.0	0.0	0.0	0.0	0.0	0.0	0.0	0.0	0.0	0.0	-2.080520025880969e-23	0.0
2.9301682401588547	1.349794179579226e-25	4.969070155236293e-28	0.0	0.0	0.0	0.0	0.0	0.0	0.0	0.0	0.0	0.0	-9.841883754337813e-25	0.0
3.0669116588687064	5.972334999571584e-27	2.198627913234562e-29	0.0	0.0	0.0	0.0	0.0	0.0	0.0	0.0	0.0	0.0	-4.354665896253161e-26	0.0
3.20812828570947	2.442323898563935e-28	8.991058768350596e-31	0.0	0.0	0.0	0.0	0.0	0.0	0.0	0.0	0.0	0.0	-1.7807950474049685e-27	0.0
3.353964450143808	6.431552248225693e-30	2.3676820371579732e-32	0.0	0.0	0.0	0.0	0.0	0.0	0.0	0.0	0.0	0.0	-4.689499372913245e-29	0.0
3.5045712684252086	-2.5036426103459432e-30	-9.216794651111993e-33	0.0	0.0	0.0	0.0	0.0	0.0	0.0	0.0	0.0	0.0	1.8255049478071465e-29	0.0
3.660104800185498	-2.4553340664428292e-30	-9.038953801459851e-33	0.0	0.0	0.0	0.0	0.0	0.0	0.0	0.0	0.0	0.0	1.790281275885255e-29	0.0
3.8207262101447066	-2.0426954578040134e-30	-7.519885023340989e-33	0.0	0.0	0.0	0.0	0.0	0.0	0.0	0.0	0.0	0.0	1.4894101297345948e-29	0.0
3.98660193511086	-1.6060408213393465e-30	-5.9124047459563906e-33	0.0	0.0	0.0	0.0	0.0	0.0	0.0	0.0	0.0	0.0	1.1710279468882027e-29	0.0
4.157903856442733	-1.1840227279410309e-30	-4.358806764426343e-33	0.0	0.0	0.0	0.0	0.0	0.0	0.0	0.0	0.0	0.0	8.63317847060371e-30	0.0
4.3348094781542805	-8.008346730932758e-31	-2.948155899284376e-33	0.0	0.0	0.0	0.0	0.0	0.0	0.0	0.0	0.0	0.0	5.839202656425833e-30	0.0
4.517502110845298	-4.692152904493796e-31	-1.7273475700416517e-33	0.0	0.0	0.0	0.0	0.0	0.0	0.0	0.0	0.0	0.0	3.421234447610534e-30	0.0
4.706171061648892	-2.069261987090994e-31	-7.617685821273973e-34	0.0	0.0	0.0	0.0	0.0	0.0	0.0	0.0	0.0	0.0	1.5087808380214079e-30	0.0
4.901011830392593	-6.028501426602694e-32	-2.219304763120931e-34	0.0	0.0	0.0	0.0	0.0	0.0	0.0	0.0	0.0	0.0	4.395619061861639e-31	0.0
