<svg width="48" height="48" viewBox="0 0 48 48" fill="none" xmlns="http://www.w3.org/2000/svg">
<path d="M0 8C0 3.58172 3.58172 0 8 0H40C44.4183 0 48 3.58172 48 8V40C48 44.4183 44.4183 48 40 48H8C3.58172 48 0 44.4183 0 40V8Z" fill="#3D539B"/>
<path fill-rule="evenodd" clip-rule="evenodd" d="M24 15C19.0294 15 15 19.0294 15 24C15 28.9706 19.0294 33 24 33C28.9706 33 33 28.9706 33 24C33 19.0294 28.9706 15 24 15ZM13 24C13 17.9249 17.9249 13 24 13C30.0751 13 35 17.9249 35 24C35 30.0751 30.0751 35 24 35C17.9249 35 13 30.0751 13 24Z" fill="white"/>
<path fill-rule="evenodd" clip-rule="evenodd" d="M24 23C24.5523 23 25 23.4477 25 24V28C25 28.5523 24.5523 29 24 29C23.4477 29 23 28.5523 23 28V24C23 23.4477 23.4477 23 24 23Z" fill="white"/>
<path d="M25 20C25 20.5523 24.5523 21 24 21C23.4477 21 23 20.5523 23 20C23 19.4477 23.4477 19 24 19C24.5523 19 25 19.4477 25 20Z" fill="white"/>
</svg>
