{
  "images" : [
    {
      "idiom" : "universal",
      "scale" : "1x",
      "filename" : "bt_back.png"
    },
    {
      "idiom" : "universal",
      "scale" : "2x",
      "filename" : "bt_back@2x.png"
    },
    {
      "idiom" : "universal",
      "scale" : "3x",
      "filename" : "bt_back@3x.png"
    }
  ],
  "info" : {
    "version" : "1",
    "author" : "xcode"
  }
}