{
  "title": "VTech CS6114 DECT 6.0 Cordless Phone with Caller ID/Call Waiting, White/Grey with 1 Handset, 3.50 x 3.50 x 7.00 Inches",
  "url": "https://www.amazon.com/dp/B004OA758C",
  "description": "Make sure this fitsby entering your model number.Caller ID/Call waiting—stores 30 calls: know who's calling with Caller ID/Call Waiting. Handset displays the name, number, time and date of incoming calls.Backlit keypad and display: the keypad and LCD screen illuminate so you can easily make and view calls, even in dim light.Interference Free Interference free for crystal-clear conversations—won’t interfere with wireless networks and other devices.30 name and number phonebook DirectoryEnglish/Spanish/French setup menuEasy-to-use standard wall mount capability. RoHS Compliant",
  "keyword": "phone",
  "sellerName": "Amazon.comAmazon.com",
  "price": "$14.97",
  "shippingPrice": "No Import Fees Deposit & $37.28 Shipping to UkrainePriceAmazonGlobal ShippingEstimated Import Fees DepositTotal"
}