{
  "requestsFinished": 18,
  "requestsFailed": 7,
  "requestsRetries": 7,
  "requestsFailedPerMinute": 13,
  "requestsFinishedPerMinute": 36,
  "requestMinDurationMillis": 1285,
  "requestMaxDurationMillis": 2987,
  "requestTotalFailedDurationMillis": 10294,
  "requestTotalFinishedDurationMillis": 32911,
  "crawlerStartedAt": "2021-06-23T12:17:06.860Z",
  "crawlerFinishedAt": "2021-06-23T12:17:36.993Z",
  "statsPersistedAt": "2021-06-23T12:17:36.993Z",
  "crawlerRuntimeMillis": 30144,
  "crawlerLastStartTimestamp": 1624450626849,
  "requestRetryHistogram": [
    18,
    null,
    null,
    7
  ],
  "statsId": 1,
  "requestAvgFailedDurationMillis": 1471,
  "requestAvgFinishedDurationMillis": 1828,
  "requestTotalDurationMillis": 43205,
  "requestsTotal": 25
}