{
  "type": "service_account",
  "project_id": "rylojournal",
  "private_key_id": "c61899b413e2fbb2c9d5fe1b7d6e522b49d1c938",
  "private_key": "-----BEGIN PRIVATE KEY-----\nMIIEvgIBADANBgkqhkiG9w0BAQEFAASCBKgwggSkAgEAAoIBAQDVF+5o5kzz1gh0\nWyZuhU8bhaat8H9xRpcyCHAeANdOhyXSjaoF4sSybZ//okzYII1Xm9yefU1ALJfM\ncrZyU3G2iwHqPkHUOcebT8hVI3i2zgnOY3HS91q8HrRrArQursU/ES99E+6fjc89\nbkH86rjew3rVMWHIy9k5zpBef9xTS8L+tEuP/CnbkslDyyqkwasktoPviTrMVGvD\nCc+4OjcrW69Nlbaq1jna9OaU+DHgYviZc7P5BL6Hw6prN00ra0Q+8e5w9TgC9J5Z\nsgJM03IsBZU0fkC57KS9i9TtpMmWs8q6Qi8pRmd4+uPFnH8xwyOkK4vSJqqxrxc0\nVGvIhSZnAgMBAAECggEABEYHl6j5ZXEnGED1DgW0ZsaREi9JjwRYZz4jaXv2KsgB\nFS5BeP6+7R56X/kUS3KpAwHINJF/aXMQ1Ekp/t73ioP9Ki0iICx3JAE/RkiA1Oxg\nO/hjQaoznU7hqr0SJKwynnzXaU3Asl3OCIWxOG5IqNxeFpp37eamA50bPhntrunu\nWkkA9RQWZKclUPKxyn1Ecl6dOGY38iYAdR38HT3pzpq4/36cnt9uBSMYO9mxSDTt\n/pTm+MftY0gpWQHurn+YcW/WfuR8i4KqEI+8YDgxIXYAPqqBrK6UwNpaGgEkp65S\nHdPwP6mnB0bMvQpoRKyPbIZfr49BYQUJzCifZ/DuwQKBgQDtPdPUy6jj/pV3iTmo\nLARa58T+fVk1xYTPg4qpCcbnrAF1h8hcxqvO0gGEMEfXiJcNXBifaPfZexh9H0iN\nraGacOIKb7MBHGLDeH4db/UUqCEvD96AxXr0z7+PFQZW3CGVz6S4swVtyqnoQd8U\nk0oh4gKnJbn4jyI6oGk/+Kx7BwKBgQDl8U53ArWsK8TGgsurJNhFE6OgQe14EUYs\n8W91hXou3n6YpqYtxxHEdNWC7nl3H9rQAFiinaOu3HO88W/x2rTmDJhgY5+vuh7C\nrv1N2wFKsIj6CuWsPu2sqbxgAas9ZQEjbDHuhXcu3lRbDPaezZOsCmVczFB3IRsE\numcA2flBoQKBgQDiIcC8YLPHPm8x1XdDuVEdZTX8bXaPLop9UiDlJxCU2vs5EAgH\nhsdVCA+x9GNGKkfw0AwYRnGYtyCMgzkg8pPLJjYPRJEXSftJ3pw3avPskKWwuiuY\nCqQ8nZk1xRCZ0pGgvp9//gP6tuZlIASHFC3hRhDJSciOB8DUqPopo9qkGQKBgCwU\n+snuBw4exfaYlJsW0S9M+I18lh3ykdWD465QDIB3vyVcrXcRNuLG0zfqp/aicLx3\nlIZ4WiznrniGgMOI/i0sNPolnzN9JvCDw6PtXG4JMfldpXJEDiSP1cFCEKYQewtj\nbp8fjx25GcrqzUzcdHcC9zO3J6Xu/tMFOUH8h8CBAoGBAMk5XEBBZvOu6767hJUl\nd/ofI3jEs9YWLpik7Tv5X2YRRQthAXAvbGx74tuCt2x8/yvRXu/3EZqUX19iGR+v\nMmixnPKSXZ5Sm17tvOT8mPnD70LCPEyOWTRpjEF6qWNTzItD/aVO9SwJHT0bPnrY\nocgjXSgwP9MX890ZZpJLUgsh\n-----END PRIVATE KEY-----\n",
  "client_email": "firebase-adminsdk-d8a5z@rylojournal.iam.gserviceaccount.com",
  "client_id": "109313097206861621405",
  "auth_uri": "https://accounts.google.com/o/oauth2/auth",
  "token_uri": "https://oauth2.googleapis.com/token",
  "auth_provider_x509_cert_url": "https://www.googleapis.com/oauth2/v1/certs",
  "client_x509_cert_url": "https://www.googleapis.com/robot/v1/metadata/x509/firebase-adminsdk-d8a5z%40rylojournal.iam.gserviceaccount.com"
}
