<?xml version="1.0" encoding="utf-8"?>
<svg xmlns="http://www.w3.org/2000/svg" style="margin: auto; background: none; display: block; shape-rendering: auto;" width="270" height="200" preserveAspectRatio="xMidYMid">
<style type="text/css">
  text {
    text-anchor: middle; font-size: 80px; opacity: 0;
  }
</style>
<g style="transform-origin:135px 100px;transform:scale(1)">
<g transform="translate(135,100)">
  <g transform="translate(0,0)"><g class="path" style="transform: matrix(0.01, 0, 0, 0.01, 0, 0); transform-origin: -104.12px -3.73142px; animation: 1s linear 0s 1 normal forwards running bounce-in-9102422f-e169-4fba-804a-5076178b7a26;"><path d="M6.56 0.80L6.56 0.80L6.56 0.80Q3.28 0.80 0 0.08L0 0.08L2.56-9.52L2.56-9.52Q5.20-8.64 7.68-8.64L7.68-8.64L7.68-8.64Q12.56-8.64 12.56-16.72L12.56-16.72L11.44-53.60L22.80-55.60L21.68-19.52L21.68-19.52Q21.68-10.80 17.44-5L17.44-5L17.44-5Q13.20 0.80 6.56 0.80" fill="#403294" stroke="none" stroke-width="none" transform="translate(-115.51998901367188,23.668576605660576)" style="fill: rgb(64, 50, 148);"></path></g><g class="path" style="transform: matrix(0.01, 0, 0, 0.01, 0, 0); transform-origin: -68px 3.50858px; animation: 1s linear 0.111429s 1 normal forwards running bounce-in-9102422f-e169-4fba-804a-5076178b7a26;"><path d="M30.48-16.72L30.48-16.72Q30.48-26.96 36-34.08L36-34.08L36-34.08Q41.52-41.20 48.92-41.20L48.92-41.20L48.92-41.20Q56.32-41.20 60.44-36.40L60.44-36.40L60.44-36.40Q64.56-31.60 64.56-23.68L64.56-23.68L64.56-23.68Q64.56-13.12 59.24-6.12L59.24-6.12L59.24-6.12Q53.92 0.88 45.84 0.88L45.84 0.88L45.84 0.88Q39.20 0.88 34.84-4.12L34.84-4.12L34.84-4.12Q30.48-9.12 30.48-16.72L30.48-16.72zM55.60-19.52L55.60-19.52L55.60-19.52Q55.60-31.12 47.68-31.12L47.68-31.12L47.68-31.12Q39.44-31.12 39.44-20.24L39.44-20.24L39.44-20.24Q39.44-14.56 41.76-11.36L41.76-11.36L41.76-11.36Q44.08-8.16 47.88-8.16L47.88-8.16L47.88-8.16Q51.68-8.16 53.64-11.08L53.64-11.08L53.64-11.08Q55.60-14 55.60-19.52" fill="#403294" stroke="none" stroke-width="none" transform="translate(-115.51998901367188,23.668576605660576)" style="fill: rgb(82, 67, 170);"></path></g><g class="path" style="transform: matrix(0.01, 0, 0, 0.01, 0, 0); transform-origin: -27.52px 3.42858px; animation: 1s linear 0.222857s 1 normal forwards running bounce-in-9102422f-e169-4fba-804a-5076178b7a26;"><path d="M81.04 0L81.04 0L81.04 0Q76.72 0 74.04-2.84L74.04-2.84L74.04-2.84Q71.36-5.68 71.36-10.32L71.36-10.32L71.84-19.52L70.96-38.72L81.68-40.72L80.64-16.40L80.64-16.40Q80.64-12.96 81.88-11.36L81.88-11.36L81.88-11.36Q83.12-9.76 85.84-9.76L85.84-9.76L85.84-9.76Q88.56-9.76 93.36-12.48L93.36-12.48L93.36-17.28L92.48-38.32L103.28-40.32L102.32-20.32L102.40-13.76L102.40-13.76Q102.40-8.64 105.04-3.44L105.04-3.44L96.72 0.24L96.72 0.24Q94.08-4.96 93.52-8.08L93.52-8.08L93.52-8.08Q86.32 0 81.04 0" fill="#403294" stroke="none" stroke-width="none" transform="translate(-115.51998901367188,23.668576605660576)" style="fill: rgb(101, 84, 192);"></path></g><g class="path" style="transform: matrix(0.01, 0, 0, 0.01, 0, 0); transform-origin: 8.00001px 3.30858px; animation: 1s linear 0.334286s 1 normal forwards running bounce-in-9102422f-e169-4fba-804a-5076178b7a26;"><path d="M111.36-38.64L111.36-38.64L121.04-40.72L121.04-40.72Q121.76-34.56 122.00-29.04L122.00-29.04L122.00-29.04Q129.28-40.32 135.68-40.32L135.68-40.32L134.80-27.84L134.80-27.84Q130.16-27.84 127.48-27L127.48-27L127.48-27Q124.80-26.16 122.00-23.68L122.00-23.68L122.00-20.80L122.88-2L112.16 0L113.12-19.44L113.12-19.44Q112.80-30.16 111.36-38.64" fill="#403294" stroke="none" stroke-width="none" transform="translate(-115.51998901367188,23.668576605660576)" style="fill: rgb(135, 119, 217);"></path></g><g class="path" style="transform: matrix(0.01, 0, 0, 0.01, 0, 0); transform-origin: 41.28px 3.50858px; animation: 1s linear 0.445714s 1 normal forwards running bounce-in-9102422f-e169-4fba-804a-5076178b7a26;"><path d="M163.92-20.24L163.92-20.24Q163.92-25.76 162.96-27.60L162.96-27.60L162.96-27.60Q162-29.44 158.48-29.44L158.48-29.44L158.48-29.44Q154.96-29.44 150.48-26.64L150.48-26.64L150.48-20.80L151.36-2L140.64 0L141.60-19.44L141.60-19.44Q141.28-30.16 139.84-38.64L139.84-38.64L149.52-40.72L149.52-40.72Q150.08-36.08 150.32-31.68L150.32-31.68L150.32-31.68Q151.52-33.28 153.04-34.84L153.04-34.84L153.04-34.84Q154.56-36.40 157.84-38.36L157.84-38.36L157.84-38.36Q161.12-40.32 164.76-40.32L164.76-40.32L164.76-40.32Q168.40-40.32 170.88-37.48L170.88-37.48L170.88-37.48Q173.36-34.64 173.36-29.76L173.36-29.76L172.88-20.80L173.76-1.60L162.96 0.40L163.92-20.24" fill="#403294" stroke="none" stroke-width="none" transform="translate(-115.51998901367188,23.668576605660576)" style="fill: rgb(153, 141, 217);"></path></g><g class="path" style="transform: matrix(0.01, 0, 0, 0.01, 0, 0); transform-origin: 80.96px 3.18858px; animation: 1s linear 0.557143s 1 normal forwards running bounce-in-9102422f-e169-4fba-804a-5076178b7a26;"><path d="M190.56 0L190.56 0Q185.84 0 182.84-3L182.84-3L182.84-3Q179.84-6 179.84-11.08L179.84-11.08L179.84-11.08Q179.84-16.16 184.48-19.88L184.48-19.88L184.48-19.88Q189.12-23.60 195.76-23.60L195.76-23.60L201.20-23.60L201.20-24.96L201.20-24.96Q201.20-28.88 199.60-30.32L199.60-30.32L199.60-30.32Q198.00-31.76 193.60-31.76L193.60-31.76L193.60-31.76Q191.76-31.76 189.24-31L189.24-31L189.24-31Q186.72-30.24 183.60-28.64L183.60-28.64L181.28-34.96L181.28-34.96Q184.72-37.36 189.64-39.28L189.64-39.28L189.64-39.28Q194.56-41.20 197.76-41.20L197.76-41.20L197.76-41.20Q210.32-41.20 210.32-29.04L210.32-29.04L210.32-13.36L210.32-13.36Q210.32-8.88 213.12-3.36L213.12-3.36L204.64 0.24L204.64 0.24Q202.64-3.60 201.68-6.64L201.68-6.64L201.68-6.64Q197.28 0 190.56 0L190.56 0zM193.92-8.16L193.92-8.16L193.92-8.16Q197.12-8.16 201.20-11.44L201.20-11.44L201.20-16.80L201.20-16.80Q196.96-17.76 194.32-17.76L194.32-17.76L194.32-17.76Q189.28-17.76 189.28-13.28L189.28-13.28L189.28-13.28Q189.28-10.96 190.56-9.56L190.56-9.56L190.56-9.56Q191.84-8.16 193.92-8.16" fill="#403294" stroke="none" stroke-width="none" transform="translate(-115.51998901367188,23.668576605660576)" style="fill: rgb(192, 182, 242);"></path></g><g class="path" style="transform: matrix(0.01, 0, 0, 0.01, 0, 0); transform-origin: 110.04px -7.29142px; animation: 1s linear 0.668571s 1 normal forwards running bounce-in-9102422f-e169-4fba-804a-5076178b7a26;"><path d="M220.08-59.92L231.04-61.92L230.00-20.80L230.88-2L220.08 0L221.04-19.44L220.08-59.92" fill="#403294" stroke="none" stroke-width="none" transform="translate(-115.51998901367188,23.668576605660576)" style="fill: rgb(64, 50, 148);"></path></g></g>
</g>
</g>
<style id="bounce-in-9102422f-e169-4fba-804a-5076178b7a26" data-anikit="">@keyframes bounce-in-9102422f-e169-4fba-804a-5076178b7a26
{
  0% {
    animation-timing-function: cubic-bezier(0.0383,0.3388,0.0421,0.6652);
    transform: matrix(0.01,0,0,0.01,0,0);
    opacity: 1;
  }
  4.7% {
    animation-timing-function: cubic-bezier(0.3296,0.3336,0.5772,0.6672);
    transform: matrix(0.556,0,0,0.556,0,0);
    opacity: 1;
  }
  8.4% {
    animation-timing-function: cubic-bezier(0.0781,0.1617,0.0874,0.9301);
    transform: matrix(0.979,0,0,0.979,0,0);
    opacity: 1;
  }
  12.4% {
    animation-timing-function: cubic-bezier(0.8341,0.1496,0.8634,0.7673);
    transform: matrix(1.153,0,0,1.153,0,0);
    opacity: 1;
  }
  16.3% {
    animation-timing-function: cubic-bezier(0.3264,0.3332,0.5758,0.6695);
    transform: matrix(1.008,0,0,1.008,0,0);
    opacity: 1;
  }
  21.2% {
    animation-timing-function: cubic-bezier(0.0921,0.1883,0.3277,1);
    transform: matrix(0.704,0,0,0.704,0,0);
    opacity: 1;
  }
  24.5% {
    animation-timing-function: cubic-bezier(0.6905,0.0944,0.8759,0.7624);
    transform: matrix(0.626,0,0,0.626,0,0);
    opacity: 1;
  }
  27.7% {
    animation-timing-function: cubic-bezier(0.3688,0.332,0.624,0.6684);
    transform: matrix(0.704,0,0,0.704,0,0);
    opacity: 1;
  }
  32.6% {
    animation-timing-function: cubic-bezier(0.1368,0.2364,0.2451,0.9049);
    transform: matrix(0.958,0,0,0.958,0,0);
    opacity: 1;
  }
  37.4% {
    animation-timing-function: cubic-bezier(0.5936,0.0846,0.3495,1);
    transform: matrix(1.085,0,0,1.085,0,0);
    opacity: 1;
  }
  49.5% {
    animation-timing-function: cubic-bezier(0.5522,0.0981,0.3807,1);
    transform: matrix(0.802,0,0,0.802,0,0);
    opacity: 1;
  }
  62.4% {
    animation-timing-function: cubic-bezier(0.4497,0.1349,0.4911,1);
    transform: matrix(1.044,0,0,1.044,0,0);
    opacity: 1;
  }
  74.1% {
    animation-timing-function: cubic-bezier(0.429,0,0.5239,1);
    transform: matrix(0.914,0,0,0.914,0,0);
    opacity: 1;
  }
  87% {
    animation-timing-function: cubic-bezier(0.3501,0,0.6422,1);
    transform: matrix(1.013,0,0,1.013,0,0);
    opacity: 1;
  }
  95.8% {
    animation-timing-function: cubic-bezier(0.3653,0,0.6776,1);
    transform: matrix(0.992,0,0,0.992,0,0);
    opacity: 1;
  }
  100% {
    transform: matrix(1,0,0,1,0,0);
    opacity: 1;
  }
}</style></svg>