
function addizione ( in1: float, in2: float) : float
    return in1 + in2
end

function moltiplicazione ( in1: float, in2: float) : float
    return in1 * in2
end

function main (): nil
    local
        input : float = -1;
        result : float;
        nop;
        arggg <==
    end;
    "Scegliere una operazione " ==>;
    input <== ;
    while input != 0 do

        "Scegliere il primo input " ==>;
        input1 <== ;
        "Scegliere il secondo input " ==>;
        input2 <== ;

        if input == 1 then
            result = addizione (input1, input2)

            else
                if input == 2 then
                    result = moltiplicazione (input1, input2)
                else
                    "Operazione invalida, riprova " ==>
                end
        end;
        result ==>;
        "Scegliere una altra operazione (0 per uscire) " ==>;
        input <==
    end
end
