<svg xmlns="http://www.w3.org/2000/svg" width="67" height="67" viewBox="0 0 67 67">
  <g id="Group_1" data-name="Group 1" transform="translate(-941 -635)">
    <circle id="Ellipse_1_copy" data-name="Ellipse 1 copy" cx="33.5" cy="33.5" r="33.5" transform="translate(941 635)" fill="#00264b" opacity="0.8"/>
    <path id="Shape_1" data-name="Shape 1" d="M965,655v28l18-14Z" transform="translate(3)" fill="#fff"/>
  </g>
</svg>
