{
    "rows": [
            [
                {"letter": "q", "firstSymbol": "1"},
                {"letter": "w", "firstSymbol": "2"},
                {"letter": "e", "firstSymbol": "3"},
                {"letter": "r", "firstSymbol": "4"},
                {"letter": "t", "firstSymbol": "5"},
                {"letter": "y", "firstSymbol": "6"},
                {"letter": "u", "firstSymbol": "7"},
                {"letter": "i", "firstSymbol": "8"},
                {"letter": "o", "firstSymbol": "9"},
                {"letter": "p", "firstSymbol": "0"}

            ],
            [
                {"letter": "a", "firstSymbol": "!"},
                {"letter": "s", "firstSymbol": "@"},
                {"letter": "d", "firstSymbol": "#"},
                {"letter": "f", "firstSymbol": "$"},
                {"letter": "g", "firstSymbol": "%"},
                {"letter": "h", "firstSymbol": "&"},
                {"letter": "j", "firstSymbol": "*"},
                {"letter": "k", "firstSymbol": "?"},
                {"letter": "l", "firstSymbol": "/"}
            ],
            [
                {"letter": "z", "firstSymbol": "_"},
                {"letter": "x", "firstSymbol": "\\"},
                {"letter": "c", "firstSymbol": "'"},
                {"letter": "v", "firstSymbol": "("},
                {"letter": "b", "firstSymbol": ")"},
                {"letter": "n", "firstSymbol": "-"},
                {"letter": "m", "firstSymbol": "+"}
            ]
        ]

}
