..............
----------------------------------------------------------------------
Ran 14 tests in 0.008s

OK
Name             Stmts   Miss Branch BrPart  Cover   Missing
------------------------------------------------------------
Collatz.py          35      0     14      0   100%
TestCollatz.py      65      0      0      0   100%
------------------------------------------------------------
TOTAL              100      0     14      0   100%
