<svg id="_002-instagram" data-name="002-instagram" xmlns="http://www.w3.org/2000/svg" width="17.768" height="17.772" viewBox="0 0 17.768 17.772">
  <path id="Path_54089" data-name="Path 54089" d="M18.172,5.225a6.494,6.494,0,0,0-.413-2.156,4.553,4.553,0,0,0-2.6-2.6A6.511,6.511,0,0,0,13,.056C12.051.01,11.749,0,9.336,0S6.621.01,5.674.052A6.5,6.5,0,0,0,3.518.465,4.336,4.336,0,0,0,1.941,1.493,4.376,4.376,0,0,0,.917,3.066,6.511,6.511,0,0,0,.5,5.222C.459,6.173.449,6.475.449,8.888S.459,11.6.5,12.55a6.494,6.494,0,0,0,.413,2.156,4.552,4.552,0,0,0,2.6,2.6,6.512,6.512,0,0,0,2.156.413c.948.042,1.25.052,3.663.052s2.715-.01,3.663-.052a6.492,6.492,0,0,0,2.156-.413,4.546,4.546,0,0,0,2.6-2.6,6.516,6.516,0,0,0,.413-2.156c.042-.948.052-1.25.052-3.663s0-2.715-.045-3.663Zm-1.6,7.256a4.871,4.871,0,0,1-.306,1.649,2.948,2.948,0,0,1-1.687,1.687,4.888,4.888,0,0,1-1.649.305c-.937.042-1.219.052-3.59.052s-2.656-.01-3.59-.052A4.869,4.869,0,0,1,4.1,15.817a2.735,2.735,0,0,1-1.021-.663,2.763,2.763,0,0,1-.663-1.021,4.889,4.889,0,0,1-.305-1.649c-.042-.937-.052-1.219-.052-3.59s.01-2.656.052-3.59a4.869,4.869,0,0,1,.305-1.649,2.7,2.7,0,0,1,.667-1.021A2.759,2.759,0,0,1,4.1,1.972a4.892,4.892,0,0,1,1.649-.306c.937-.042,1.219-.052,3.59-.052s2.656.01,3.59.052a4.871,4.871,0,0,1,1.649.306,2.733,2.733,0,0,1,1.021.663,2.762,2.762,0,0,1,.663,1.021A4.891,4.891,0,0,1,16.572,5.3c.042.937.052,1.219.052,3.59s-.01,2.649-.052,3.586Zm0,0" transform="translate(-0.449 0)" fill="#183152"/>
  <path id="Path_54090" data-name="Path 54090" d="M129.514,124.5a4.565,4.565,0,1,0,4.565,4.565A4.567,4.567,0,0,0,129.514,124.5Zm0,7.527a2.961,2.961,0,1,1,2.961-2.961A2.962,2.962,0,0,1,129.514,132.027Zm0,0" transform="translate(-120.627 -120.178)" fill="#183152"/>
  <path id="Path_54091" data-name="Path 54091" d="M364.581,89.668a1.066,1.066,0,1,1-1.066-1.066A1.066,1.066,0,0,1,364.581,89.668Zm0,0" transform="translate(-349.882 -85.526)" fill="#183152"/>
</svg>
