<svg width="40" height="40" viewBox="0 0 40 40" fill="none" xmlns="http://www.w3.org/2000/svg">
<path d="M8.33333 6.6665H15L18.3333 14.9998L14.1667 17.4998C15.9516 21.1191 18.8808 24.0482 22.5 25.8332L25 21.6665L33.3333 24.9998V31.6665C33.3333 32.5506 32.9821 33.3984 32.357 34.0235C31.7319 34.6486 30.8841 34.9998 30 34.9998C23.4988 34.6048 17.3669 31.844 12.7614 27.2385C8.15584 22.6329 5.39508 16.5011 5 9.99984C5 9.11578 5.35119 8.26794 5.97631 7.64281C6.60143 7.01769 7.44928 6.6665 8.33333 6.6665" stroke="#C4C4C4" stroke-width="3" stroke-linecap="round" stroke-linejoin="round"/>
</svg>
