<svg width="40" height="41" viewBox="0 0 40 41" fill="none" xmlns="http://www.w3.org/2000/svg">
<rect x="5" y="5.5" width="30" height="30" rx="4" stroke="#E1001A" stroke-width="3"/>
<path d="M12.9179 15.2118C14.1309 15.2118 14.9066 14.3873 14.9066 13.3686C14.8834 12.3004 14.1309 11.5 12.9412 11.5C11.7522 11.5 10.9765 12.3004 11.0005 13.3686C10.9765 14.3873 11.7522 15.2118 12.9179 15.2118Z" fill="#E1001A"/>
<path d="M11.0981 16.6678V28.533H14.7858V16.6678H11.0981Z" fill="#E1001A"/>
<path d="M17.644 16.6694C17.6928 17.7128 17.7416 18.9746 17.7416 20.4547H17.7431V28.5353H21.4308V21.6924C21.4308 21.3518 21.4789 21.0128 21.5764 20.7697C21.8187 20.0908 22.4248 19.3872 23.4443 19.3872C24.7788 19.3872 25.3121 20.4299 25.3121 21.9595V28.5353H28.9999V21.4974C28.9999 18.0047 27.18 16.4031 24.754 16.4031C22.7886 16.4031 21.5756 17.5426 21.0903 18.295H21.0175L20.8472 16.6694H17.644Z" fill="#E1001A"/>
</svg>
