<svg width="40" height="40" viewBox="0 0 40 40" fill="none" xmlns="http://www.w3.org/2000/svg">
<rect width="40" height="40" rx="4" fill="black"/>
<path d="M10.5573 12.949C12.1746 12.949 13.2088 11.8498 13.2088 10.4915C13.1778 9.06722 12.1746 8 10.5882 8C9.00291 8 7.96872 9.06722 8.00072 10.4915C7.96872 11.8498 9.00293 12.949 10.5573 12.949Z" fill="white"/>
<path d="M8.13075 14.8904V30.7107H13.0478V14.8904H8.13075Z" fill="white"/>
<path d="M16.8587 14.8925C16.9237 16.2838 16.9888 17.9661 16.9888 19.9396H16.9907V30.7138H21.9078V21.5899C21.9078 21.1358 21.9718 20.6837 22.1018 20.3596C22.4249 19.4545 23.2331 18.5163 24.5923 18.5163C26.3717 18.5163 27.0829 19.9065 27.0829 21.946V30.7138H31.9999V21.3298C31.9999 16.6729 29.5734 14.5374 26.3387 14.5374C23.7182 14.5374 22.1008 16.0568 21.4537 17.06H21.3566L21.1296 14.8925H16.8587Z" fill="white"/>
</svg>
