<svg width="34" height="33" viewBox="0 0 34 33" fill="none" xmlns="http://www.w3.org/2000/svg">
<path d="M2 11.5L17 21.5L32 11.5L17 1.5L2 11.5Z" stroke="#E1001A" stroke-width="3" stroke-linecap="round" stroke-linejoin="round"/>
<path d="M32 11.5V28.1667C32 29.0507 31.6488 29.8986 31.0237 30.5237C30.3986 31.1488 29.5507 31.5 28.6667 31.5H5.33333C4.44928 31.5 3.60143 31.1488 2.97631 30.5237C2.35119 29.8986 2 29.0507 2 28.1667V11.5" stroke="#E1001A" stroke-width="3" stroke-linecap="round" stroke-linejoin="round"/>
<path d="M2 28.1666L12 18.1666" stroke="#E1001A" stroke-width="3" stroke-linecap="round" stroke-linejoin="round"/>
<path d="M22 18.1666L32 28.1666" stroke="#E1001A" stroke-width="3" stroke-linecap="round" stroke-linejoin="round"/>
</svg>
