{
  "metadata": {
    "name": "test.csv",
    "asset_type": "data_asset",
    "origin_country": "us",
    "asset_category": "USER",
    "created_at": "2021-12-06T20:16:49Z",
    "created": 1638821809587,
    "asset_id": "data_asset.testcsv",
    "asset_attributes": [
      "data_asset"
    ]
  },
  "entity": {
    "data_asset": {
      "dataset": false,
      "mime_type": "text/csv"
    }
  },
  "attachments": [
    {
      "asset_type": "data_asset",
      "name": "test.csv",
      "mime": "text/csv",
      "object_key": "data_asset/test.csv",
      "object_key_is_read_only": true,
      "created_at": "2021-12-06T20:16:49Z",
      "id": "ce42b9da-dfd7-4ca6-95e9-a7891e88fefb",
      "is_managed": false,
      "is_referenced": true,
      "is_remote": false
    }
  ]
}