COQAUX1 337448689c47670018b65a7a9d848904 /Users/pbarroso/Downloads/slf/LibListZ.v
0 0 VernacProof "tac:no using:yes"
1455 1459 proof_build_time "0.000"
0 0 length_eq "0.000"
1455 1459 proof_check_time "0.000"
0 0 VernacProof "tac:no using:yes"
1638 1642 proof_build_time "0.016"
0 0 abs_length "0.016"
1638 1642 proof_check_time "0.002"
0 0 VernacProof "tac:no using:yes"
1749 1753 proof_build_time "0.051"
0 0 length_nonneg "0.051"
1749 1753 proof_check_time "0.001"
0 0 VernacProof "tac:no using:yes"
1816 1820 proof_build_time "0.000"
0 0 length_nil "0.000"
1816 1820 proof_check_time "0.000"
0 0 VernacProof "tac:no using:yes"
1933 1937 proof_build_time "0.009"
0 0 length_cons "0.009"
1933 1937 proof_check_time "0.001"
0 0 VernacProof "tac:no using:yes"
2016 2020 proof_build_time "0.000"
0 0 length_one "0.000"
2016 2020 proof_check_time "0.000"
0 0 VernacProof "tac:no using:yes"
2147 2151 proof_build_time "0.009"
0 0 length_app "0.009"
2147 2151 proof_check_time "0.000"
0 0 VernacProof "tac:no using:yes"
2265 2269 proof_build_time "0.008"
0 0 length_last "0.008"
2265 2269 proof_check_time "0.001"
0 0 VernacProof "tac:no using:yes"
2700 2704 proof_build_time "0.003"
2700 2704 proof_check_time "0.000"
0 0 VernacProof "tac:no using:yes"
2811 2815 proof_build_time "0.004"
2811 2815 proof_check_time "0.001"
0 0 VernacProof "tac:no using:yes"
3276 3280 proof_build_time "0.003"
0 0 length_zero_inv "0.003"
3276 3280 proof_check_time "0.001"
0 0 VernacProof "tac:no using:yes"
3438 3442 proof_build_time "0.023"
0 0 length_zero_eq_eq_nil "0.023"
3438 3442 proof_check_time "0.001"
0 0 VernacProof "tac:no using:yes"
3556 3560 proof_build_time "0.001"
0 0 length_neq_inv "0.001"
3556 3560 proof_check_time "0.000"
0 0 VernacProof "tac:no using:yes"
3724 3728 proof_build_time "0.004"
0 0 length_pos_inv_cons "0.004"
3724 3728 proof_check_time "0.001"
0 0 VernacProof "tac:no using:yes"
3891 3895 proof_build_time "0.004"
0 0 length_pos_inv_last "0.004"
3891 3895 proof_check_time "0.001"
0 0 VernacProof "tac:no using:yes"
4314 4322 proof_build_time "0.000"
4314 4322 proof_check_time "0.000"
0 0 VernacProof "tac:no using:yes"
4506 4510 proof_build_time "0.000"
0 0 index_eq_inbound "0.000"
4506 4510 proof_check_time "0.000"
0 0 VernacProof "tac:no using:yes"
4633 4637 proof_build_time "0.000"
0 0 index_of_inbound "0.000"
4633 4637 proof_check_time "0.000"
0 0 VernacProof "tac:no using:yes"
4734 4738 proof_build_time "0.000"
0 0 index_eq_index_length "0.000"
4734 4738 proof_check_time "0.000"
0 0 VernacProof "tac:no using:yes"
4874 4878 proof_build_time "0.000"
0 0 index_of_index_length "0.000"
4874 4878 proof_check_time "0.000"
0 0 VernacProof "tac:no using:yes"
5086 5090 proof_build_time "0.001"
0 0 index_of_index_length' "0.001"
5086 5090 proof_check_time "0.000"
0 0 VernacProof "tac:no using:yes"
5553 5561 proof_build_time "0.000"
5553 5561 proof_check_time "0.000"
0 0 VernacProof "tac:no using:yes"
6000 6004 proof_build_time "0.097"
0 0 read_cons_case "0.097"
6000 6004 proof_check_time "0.003"
0 0 VernacProof "tac:no using:yes"
6115 6119 proof_build_time "0.003"
0 0 read_zero "0.003"
6115 6119 proof_check_time "0.000"
0 0 VernacProof "tac:no using:yes"
6283 6287 proof_build_time "0.015"
0 0 read_succ "0.015"
6283 6287 proof_check_time "0.002"
0 0 VernacProof "tac:no using:yes"
6509 6513 proof_build_time "0.014"
0 0 read_last_case "0.014"
6509 6513 proof_check_time "0.002"
0 0 VernacProof "tac:no using:no"
6727 6731 proof_build_time "0.012"
0 0 read_middle "0.012"
6706 6726 context_used ""
6727 6731 proof_check_time "0.002"
0 0 VernacProof "tac:no using:yes"
7198 7202 proof_build_time "0.061"
0 0 read_app "0.061"
7198 7202 proof_check_time "0.005"
0 0 VernacProof "tac:no using:yes"
7685 7689 proof_build_time "0.026"
0 0 eq_of_extens_range "0.026"
7685 7689 proof_check_time "0.003"
0 0 VernacProof "tac:no using:yes"
7858 7862 proof_build_time "0.012"
0 0 eq_of_extens "0.012"
7858 7862 proof_check_time "0.000"
0 0 VernacProof "tac:no using:yes"
8328 8336 proof_build_time "0.000"
8328 8336 proof_check_time "0.000"
0 0 VernacProof "tac:no using:yes"
8701 8705 proof_build_time "0.010"
0 0 length_update "0.010"
8701 8705 proof_check_time "0.001"
0 0 VernacProof "tac:no using:yes"
8861 8865 proof_build_time "0.001"
0 0 index_update_eq "0.001"
8861 8865 proof_check_time "0.000"
0 0 VernacProof "tac:no using:yes"
8987 8991 proof_build_time "0.000"
0 0 index_update "0.000"
8987 8991 proof_check_time "0.000"
0 0 VernacProof "tac:no using:yes"
9369 9373 proof_build_time "0.038"
0 0 read_update_case "0.038"
9369 9373 proof_check_time "0.005"
0 0 VernacProof "tac:no using:yes"
9509 9513 proof_build_time "0.003"
0 0 read_update_same "0.003"
9509 9513 proof_check_time "0.000"
0 0 VernacProof "tac:no using:yes"
9679 9683 proof_build_time "0.004"
0 0 read_update_neq "0.004"
9679 9683 proof_check_time "0.001"
0 0 VernacProof "tac:no using:yes"
10034 10038 proof_build_time "0.005"
0 0 update_zero "0.005"
10034 10038 proof_check_time "0.000"
0 0 VernacProof "tac:no using:yes"
10328 10332 proof_build_time "0.033"
0 0 update_cons_pos "0.033"
10328 10332 proof_check_time "0.003"
0 0 VernacProof "tac:no using:yes"
10667 10671 proof_build_time "0.007"
0 0 update_update_same "0.007"
10667 10671 proof_check_time "0.001"
0 0 VernacProof "tac:no using:yes"
11047 11051 proof_build_time "0.066"
0 0 update_update_neq "0.066"
11047 11051 proof_check_time "0.002"
0 0 VernacProof "tac:no using:yes"
11329 11333 proof_build_time "0.010"
0 0 update_app_l "0.010"
11329 11333 proof_check_time "0.002"
0 0 VernacProof "tac:no using:yes"
11748 11752 proof_build_time "0.055"
0 0 update_app_r "0.055"
11748 11752 proof_check_time "0.007"
0 0 VernacProof "tac:no using:yes"
11949 11953 proof_build_time "0.050"
0 0 update_middle "0.050"
11949 11953 proof_check_time "0.001"
0 0 VernacProof "tac:no using:yes"
12634 12638 proof_build_time "0.014"
0 0 length_make "0.014"
12634 12638 proof_check_time "0.001"
0 0 VernacProof "tac:no using:yes"
12819 12823 proof_build_time "0.005"
0 0 index_make "0.005"
12819 12823 proof_check_time "0.001"
0 0 VernacProof "tac:no using:yes"
13076 13080 proof_build_time "0.036"
0 0 read_make "0.036"
13076 13080 proof_check_time "0.004"
0 0 VernacProof "tac:no using:yes"
13290 13294 proof_build_time "0.022"
0 0 make_zero "0.022"
13290 13294 proof_check_time "0.001"
0 0 VernacProof "tac:no using:yes"
13716 13720 proof_build_time "0.030"
0 0 make_succ_l "0.030"
13716 13720 proof_check_time "0.003"
0 0 VernacProof "tac:no using:yes"
14271 14275 proof_build_time "0.046"
0 0 make_succ_r "0.046"
14271 14275 proof_check_time "0.005"
0 0 VernacProof "tac:no using:yes"
14464 14468 proof_build_time "0.010"
0 0 make_eq_cons_make_pred "0.010"
14464 14468 proof_check_time "0.001"
0 0 VernacProof "tac:no using:yes"
14912 14916 proof_build_time "0.008"
0 0 length_rev "0.008"
14912 14916 proof_check_time "0.000"
0 0 VernacProof "tac:no using:yes"
15516 15520 proof_build_time "0.003"
0 0 length_map "0.003"
15516 15520 proof_check_time "0.000"
0 0 VernacProof "tac:no using:yes"
15683 15687 proof_build_time "0.001"
0 0 index_map_eq "0.001"
15683 15687 proof_check_time "0.000"
0 0 VernacProof "tac:no using:yes"
15819 15823 proof_build_time "0.000"
0 0 index_map "0.000"
15819 15823 proof_check_time "0.000"
0 0 VernacProof "tac:no using:yes"
16025 16029 proof_build_time "0.007"
0 0 map_make "0.007"
16025 16029 proof_check_time "0.001"
0 0 VernacProof "tac:no using:yes"
16380 16384 proof_build_time "0.022"
0 0 map_update "0.022"
16380 16384 proof_check_time "0.003"
0 0 VernacProof "tac:no using:yes"
16715 16719 proof_build_time "0.020"
0 0 read_map "0.020"
16715 16719 proof_check_time "0.010"
0 0 VernacProof "tac:no using:yes"
17262 17266 proof_build_time "0.006"
0 0 length_filter "0.006"
17262 17266 proof_check_time "0.001"
0 0 VernacProof "tac:no using:yes"
17523 17527 proof_build_time "0.008"
0 0 filter_length_two_disjoint "0.008"
17523 17527 proof_check_time "0.001"
0 0 VernacProof "tac:no using:yes"
17751 17755 proof_build_time "0.008"
0 0 filter_length_partition "0.008"
17751 17755 proof_check_time "0.001"
0 0 VernacProof "tac:no using:yes"
17937 17941 proof_build_time "0.007"
0 0 length_filter_eq_mem_ge_one "0.007"
17937 17941 proof_check_time "0.001"
0 0 VernacProof "tac:no using:yes"
18408 18412 proof_build_time "0.001"
0 0 length_remove "0.001"
18408 18412 proof_check_time "0.000"
0 0 VernacProof "tac:no using:yes"
18584 18588 proof_build_time "0.009"
0 0 length_remove_mem "0.009"
18584 18588 proof_check_time "0.001"
0 0 VernacProof "tac:no using:yes"
19108 19112 proof_build_time "0.000"
0 0 take_nil "0.000"
19108 19112 proof_check_time "0.000"
0 0 VernacProof "tac:no using:yes"
19179 19183 proof_build_time "0.000"
0 0 take_zero "0.000"
19179 19183 proof_check_time "0.000"
0 0 VernacProof "tac:no using:yes"
19372 19376 proof_build_time "0.011"
0 0 take_succ "0.011"
19372 19376 proof_check_time "0.001"
0 0 VernacProof "tac:no using:yes"
19592 19596 proof_build_time "0.016"
0 0 take_cons_pos "0.016"
19592 19596 proof_check_time "0.002"
0 0 VernacProof "tac:no using:yes"
19712 19716 proof_build_time "0.003"
0 0 take_neg "0.003"
19712 19716 proof_check_time "0.000"
0 0 VernacProof "tac:no using:yes"
19857 19861 proof_build_time "0.004"
0 0 take_ge "0.004"
19857 19861 proof_check_time "0.001"
0 0 VernacProof "tac:no using:yes"
19997 20001 proof_build_time "0.000"
0 0 take_is_prefix "0.000"
19997 20001 proof_check_time "0.000"
0 0 VernacProof "tac:no using:yes"
20230 20234 proof_build_time "0.017"
0 0 take_app_l "0.017"
20230 20234 proof_check_time "0.002"
0 0 VernacProof "tac:no using:yes"
20440 20444 proof_build_time "0.019"
0 0 take_app_r "0.019"
20440 20444 proof_check_time "0.002"
0 0 VernacProof "tac:no using:yes"
20621 20625 proof_build_time "0.003"
0 0 take_prefix_length "0.003"
20621 20625 proof_check_time "0.000"
0 0 VernacProof "tac:no using:yes"
20785 20789 proof_build_time "0.003"
0 0 take_full_length "0.003"
20785 20789 proof_check_time "0.000"
0 0 VernacProof "tac:no using:yes"
21556 21560 proof_build_time "0.000"
0 0 drop_nil "0.000"
21556 21560 proof_check_time "0.000"
0 0 VernacProof "tac:no using:yes"
21625 21629 proof_build_time "0.000"
0 0 drop_zero "0.000"
21625 21629 proof_check_time "0.000"
0 0 VernacProof "tac:no using:yes"
21813 21817 proof_build_time "0.011"
0 0 drop_succ "0.011"
21813 21817 proof_check_time "0.001"
0 0 VernacProof "tac:no using:yes"
21967 21971 proof_build_time "0.003"
0 0 drop_neg "0.003"
21967 21971 proof_check_time "0.000"
0 0 VernacProof "tac:no using:yes"
22142 22146 proof_build_time "0.014"
0 0 drop_cons_pos "0.014"
22142 22146 proof_check_time "0.002"
0 0 VernacProof "tac:no using:yes"
22280 22284 proof_build_time "0.000"
0 0 drop_is_suffix "0.000"
22280 22284 proof_check_time "0.000"
0 0 VernacProof "tac:no using:yes"
22545 22549 proof_build_time "0.021"
0 0 drop_app_l "0.021"
22545 22549 proof_check_time "0.001"
0 0 VernacProof "tac:no using:yes"
22776 22780 proof_build_time "0.021"
0 0 drop_app_r "0.021"
22776 22780 proof_check_time "0.002"
0 0 VernacProof "tac:no using:yes"
22950 22954 proof_build_time "0.003"
0 0 drop_app_length "0.003"
22950 22954 proof_check_time "0.000"
0 0 VernacProof "tac:no using:yes"
23112 23116 proof_build_time "0.003"
0 0 drop_at_length "0.003"
23112 23116 proof_check_time "0.000"
0 0 VernacProof "tac:no using:yes"
24110 24114 proof_build_time "0.037"
0 0 take_app_drop_spec "0.037"
24110 24114 proof_check_time "0.009"
0 0 VernacProof "tac:no using:yes"
24316 24320 proof_build_time "0.010"
0 0 take_spec "0.010"
24316 24320 proof_check_time "0.002"
0 0 VernacProof "tac:no using:yes"
24468 24472 proof_build_time "0.009"
0 0 length_take_nonneg "0.009"
24468 24472 proof_check_time "0.001"
0 0 VernacProof "tac:no using:yes"
24676 24680 proof_build_time "0.058"
0 0 length_take "0.058"
24676 24680 proof_check_time "0.002"
0 0 VernacProof "tac:no using:yes"
24874 24878 proof_build_time "0.009"
0 0 drop_spec "0.009"
24874 24878 proof_check_time "0.002"
0 0 VernacProof "tac:no using:yes"
25084 25088 proof_build_time "0.024"
0 0 length_drop_nonneg "0.024"
25084 25088 proof_check_time "0.002"
0 0 VernacProof "tac:no using:yes"
25296 25300 proof_build_time "0.025"
0 0 length_drop "0.025"
25296 25300 proof_check_time "0.003"
0 0 VernacProof "tac:no using:yes"
25518 25522 proof_build_time "0.032"
0 0 list_eq_take_app_drop "0.032"
25518 25522 proof_check_time "0.002"
0 0 VernacProof "tac:no using:yes"
26318 26322 proof_build_time "0.000"
0 0 count_nil "0.000"
26318 26322 proof_check_time "0.000"
0 0 VernacProof "tac:no using:yes"
26436 26440 proof_build_time "0.028"
0 0 count_one "0.028"
26436 26440 proof_check_time "0.001"
0 0 VernacProof "tac:no using:yes"
26568 26572 proof_build_time "0.045"
0 0 count_cons "0.045"
26568 26572 proof_check_time "0.004"
0 0 VernacProof "tac:no using:yes"
26693 26697 proof_build_time "0.016"
0 0 count_app "0.016"
26693 26697 proof_check_time "0.003"
0 0 VernacProof "tac:no using:yes"
26824 26828 proof_build_time "0.054"
0 0 count_last "0.054"
26824 26828 proof_check_time "0.004"
0 0 VernacProof "tac:no using:yes"
26930 26934 proof_build_time "0.012"
0 0 count_rev "0.012"
26930 26934 proof_check_time "0.002"
0 0 VernacProof "tac:no using:yes"
27066 27070 proof_build_time "0.011"
0 0 count_eq_length_filter "0.011"
27066 27070 proof_check_time "0.001"
0 0 VernacProof "tac:no using:yes"
27182 27186 proof_build_time "0.003"
0 0 count_nonneg "0.003"
27182 27186 proof_check_time "0.002"
0 0 VernacProof "tac:no using:yes"
27294 27298 proof_build_time "0.012"
0 0 count_le_length "0.012"
27294 27298 proof_check_time "0.001"
0 0 VernacProof "tac:no using:yes"
27538 27542 proof_build_time "0.007"
0 0 Forall_eq_count_eq_length "0.007"
27538 27542 proof_check_time "0.001"
0 0 VernacProof "tac:no using:yes"
27674 27678 proof_build_time "0.004"
0 0 count_Forall "0.004"
27674 27678 proof_check_time "0.000"
0 0 VernacProof "tac:no using:yes"
27823 27827 proof_build_time "0.004"
0 0 Forall_of_count_eq_length "0.004"
27823 27827 proof_check_time "0.000"
0 0 VernacProof "tac:no using:yes"
28081 28085 proof_build_time "0.007"
0 0 Forall_not_eq_count_eq_zero "0.007"
28081 28085 proof_check_time "0.001"
0 0 VernacProof "tac:no using:yes"
28242 28246 proof_build_time "0.002"
0 0 Forall_not_of_count_eq_zero "0.002"
28242 28246 proof_check_time "0.000"
0 0 VernacProof "tac:no using:yes"
28403 28407 proof_build_time "0.002"
0 0 count_eq_zero_of_Forall_not "0.002"
28403 28407 proof_check_time "0.000"
0 0 VernacProof "tac:no using:yes"
28617 28621 proof_build_time "0.007"
0 0 Exists_eq_count_pos "0.007"
28617 28621 proof_check_time "0.001"
0 0 VernacProof "tac:no using:yes"
28747 28751 proof_build_time "0.003"
0 0 Exists_of_count_pos "0.003"
28747 28751 proof_check_time "0.000"
0 0 VernacProof "tac:no using:yes"
28877 28881 proof_build_time "0.003"
0 0 count_pos_of_Exists "0.003"
28877 28881 proof_check_time "0.000"
0 0 VernacProof "tac:no using:yes"
29115 29119 proof_build_time "0.007"
0 0 count_pos_eq_exists_mem "0.007"
29115 29119 proof_check_time "0.001"
0 0 VernacProof "tac:no using:yes"
29254 29258 proof_build_time "0.001"
0 0 count_pos_of_mem "0.001"
29254 29258 proof_check_time "0.000"
0 0 VernacProof "tac:no using:yes"
29406 29410 proof_build_time "0.000"
0 0 exists_mem_of_count_pos "0.000"
29406 29410 proof_check_time "0.000"
0 0 VernacProof "tac:no using:yes"
30033 30041 proof_build_time "0.000"
30033 30041 proof_check_time "0.000"
0 0 vo_compile_time "2.172"
