COQAUX1 b5e861e1721009e6cf46ad4c1dd67f62 /Users/pbarroso/Downloads/slf/LibUnit.v
0 0 VernacProof "tac:no using:yes"
1137 1141 proof_build_time "0.001"
0 0 Inhab_unit "0.001"
1137 1141 proof_check_time "0.000"
0 0 VernacProof "tac:no using:yes"
1588 1592 proof_build_time "0.001"
0 0 unit_eq "0.001"
1588 1592 proof_check_time "0.000"
0 0 vo_compile_time "0.233"
