COQAUX1 3dbeb0b89c3935fc48bbbe94803c8dd5 /Users/pbarroso/Downloads/slf/Rich.v
0 0 VernacProof "tac:no using:yes"
5841 5845 proof_build_time "0.013"
0 0 hoare_assert "0.013"
5841 5845 proof_check_time "0.002"
0 0 VernacProof "tac:no using:yes"
6095 6099 proof_build_time "0.084"
0 0 triple_assert "0.084"
6095 6099 proof_check_time "0.002"
0 0 VernacProof "tac:no using:yes"
7386 7390 proof_build_time "0.007"
0 0 hoare_if_trm "0.007"
7386 7390 proof_check_time "0.001"
0 0 VernacProof "tac:no using:yes"
7705 7709 proof_build_time "0.017"
0 0 triple_if_trm "0.017"
7705 7709 proof_check_time "0.001"
0 0 VernacProof "tac:no using:yes"
8215 8219 proof_build_time "0.030"
0 0 wp_if_trm "0.030"
8215 8219 proof_check_time "0.001"
0 0 VernacProof "tac:no using:yes"
10159 10163 proof_build_time "0.006"
0 0 hoare_while "0.006"
10159 10163 proof_check_time "0.001"
0 0 VernacProof "tac:no using:yes"
10370 10374 proof_build_time "0.001"
0 0 triple_while "0.001"
10370 10374 proof_check_time "0.000"
0 0 VernacProof "tac:no using:yes"
10598 10602 proof_build_time "0.010"
0 0 wp_while "0.010"
10598 10602 proof_check_time "0.001"
0 0 VernacProof "tac:no using:yes"
12552 12556 proof_build_time "0.035"
0 0 triple_while_inv_not_framable "0.035"
12552 12556 proof_check_time "0.002"
0 0 VernacProof "tac:no using:yes"
13579 13583 proof_build_time "0.003"
0 0 triple_while' "0.003"
13579 13583 proof_check_time "0.000"
0 0 VernacProof "tac:no using:yes"
14551 14555 proof_build_time "0.007"
0 0 triple_while_inv "0.007"
14551 14555 proof_check_time "0.001"
0 0 VernacProof "tac:no using:yes"
15407 15411 proof_build_time "0.006"
0 0 triple_while_inv_conseq_frame "0.006"
15407 15411 proof_check_time "0.001"
0 0 VernacProof "tac:no using:yes"
16047 16051 proof_build_time "0.016"
0 0 wp_while_inv_conseq "0.016"
16047 16051 proof_check_time "0.002"
0 0 VernacProof "tac:no using:yes"
18148 18152 proof_build_time "0.007"
0 0 hoare_for "0.007"
18148 18152 proof_check_time "0.001"
0 0 VernacProof "tac:no using:yes"
18407 18411 proof_build_time "0.001"
0 0 triple_for "0.001"
18407 18411 proof_check_time "0.001"
0 0 VernacProof "tac:no using:yes"
19598 19602 proof_build_time "0.054"
0 0 triple_for' "0.054"
19598 19602 proof_check_time "0.004"
0 0 VernacProof "tac:no using:yes"
20094 20103 proof_build_time "0.000"
0 0 triple_for_ge "0.000"
20094 20103 proof_check_time "0.000"
0 0 VernacProof "tac:no using:yes"
21004 21013 proof_build_time "0.000"
0 0 triple_for_inv_conseq_frame "0.000"
21004 21013 proof_check_time "0.000"
0 0 VernacProof "tac:no using:yes"
22578 22582 proof_build_time "0.011"
0 0 wpgen_if_trm_sound "0.011"
22578 22582 proof_check_time "0.001"
0 0 VernacProof "tac:no using:yes"
24960 24964 proof_build_time "0.024"
0 0 wpgen_while_sound "0.024"
24960 24964 proof_check_time "0.001"
0 0 VernacProof "tac:no using:yes"
26048 26052 proof_build_time "0.019"
0 0 mkstruct_apply "0.019"
26048 26052 proof_check_time "0.002"
0 0 VernacProof "tac:no using:yes"
26756 26760 proof_build_time "0.011"
0 0 xwhile_lemma "0.011"
26756 26760 proof_check_time "0.001"
0 0 VernacProof "tac:no using:yes"
29559 29563 proof_build_time "0.686"
0 0 triple_mlength_loop "0.686"
29559 29563 proof_check_time "0.136"
0 0 VernacProof "tac:no using:yes"
30720 30724 proof_build_time "0.006"
0 0 triple_while_inv_conseq_frame_hgc "0.006"
30720 30724 proof_check_time "0.001"
0 0 VernacProof "tac:no using:yes"
34616 34620 proof_build_time "0.080"
0 0 eval_like_app_fix2 "0.080"
34616 34620 proof_check_time "0.002"
0 0 VernacProof "tac:no using:yes"
35008 35012 proof_build_time "0.004"
0 0 triple_app_fix2 "0.004"
35008 35012 proof_check_time "0.001"
0 0 VernacProof "tac:no using:yes"
35374 35378 proof_build_time "0.002"
0 0 wp_app_fix2 "0.002"
35374 35378 proof_check_time "0.001"
0 0 VernacProof "tac:no using:yes"
36498 36502 proof_build_time "0.048"
0 0 xwp_lemma_fix2 "0.048"
36498 36502 proof_check_time "0.010"
0 0 VernacProof "tac:no using:yes"
43016 43020 proof_build_time "0.004"
0 0 triple_apps_fixs "0.004"
43016 43020 proof_check_time "0.001"
0 0 VernacProof "tac:no using:yes"
44632 44636 proof_build_time "0.037"
0 0 trms_to_vals_spec "0.037"
44632 44636 proof_check_time "0.004"
0 0 VernacProof "tac:no using:yes"
45004 45010 proof_build_time "0.001"
45004 45010 proof_check_time "0.000"
0 0 VernacProof "tac:no using:yes"
45559 45563 proof_build_time "0.002"
0 0 triple_apps_fixs' "0.002"
45559 45563 proof_check_time "0.001"
0 0 VernacProof "tac:no using:yes"
50769 50775 proof_build_time "0.000"
50769 50775 proof_check_time "0.000"
0 0 vo_compile_time "1.809"
