COQAUX1 04f9d98145d6ba686c5a7b0c4900a625 /Users/pbarroso/Downloads/slf/LibListExec.v
0 0 VernacProof "tac:no using:yes"
1488 1492 proof_build_time "0.018"
0 0 is_nil_eq "0.018"
1488 1492 proof_check_time "0.001"
0 0 VernacProof "tac:no using:no"
1733 1737 proof_build_time "0.018"
0 0 is_not_nil_eq "0.018"
1689 1732 context_used ""
1733 1737 proof_check_time "0.001"
0 0 VernacProof "tac:no using:yes"
2135 2139 proof_build_time "0.024"
0 0 length_eq "0.024"
2135 2139 proof_check_time "0.001"
0 0 VernacProof "tac:no using:yes"
2531 2535 proof_build_time "0.071"
0 0 app_eq "0.071"
2531 2535 proof_check_time "0.001"
0 0 VernacProof "tac:no using:yes"
3039 3043 proof_build_time "0.015"
0 0 rev_eq "0.015"
3039 3043 proof_check_time "0.001"
0 0 VernacProof "tac:no using:yes"
3515 3519 proof_build_time "0.073"
0 0 fold_right_eq "0.073"
3515 3519 proof_check_time "0.000"
0 0 VernacProof "tac:no using:yes"
3917 3921 proof_build_time "0.057"
0 0 map_eq "0.057"
3917 3921 proof_check_time "0.001"
0 0 VernacProof "tac:no using:yes"
4565 4569 proof_build_time "0.043"
0 0 combine_eq "0.043"
4565 4569 proof_check_time "0.001"
0 0 VernacProof "tac:no using:yes"
5111 5115 proof_build_time "0.061"
0 0 mem_exec_eq "0.061"
5111 5115 proof_check_time "0.001"
0 0 vo_compile_time "0.656"
