COQAUX1 f90f35b5e3fe110c3a4a52c69945e714 /Users/pbarroso/Downloads/slf/LibSepSimpl.v
0 0 VernacProof "tac:no using:no"
7121 7125 proof_build_time "0.001"
0 0 himpl_of_eq "0.001"
7101 7120 context_used ""
7121 7125 proof_check_time "0.000"
0 0 VernacProof "tac:no using:no"
7233 7237 proof_build_time "0.001"
0 0 himpl_of_eq_sym "0.001"
7213 7232 context_used ""
7233 7237 proof_check_time "0.000"
0 0 VernacProof "tac:no using:yes"
7426 7430 proof_build_time "0.000"
0 0 qimpl_refl "0.000"
7426 7430 proof_check_time "0.000"
0 0 VernacProof "tac:no using:yes"
7618 7622 proof_build_time "0.001"
0 0 qimpl_trans "0.001"
7618 7622 proof_check_time "0.000"
0 0 VernacProof "tac:no using:yes"
7799 7803 proof_build_time "0.001"
0 0 qimpl_antisym "0.001"
7799 7803 proof_check_time "0.000"
0 0 VernacProof "tac:no using:yes"
8087 8091 proof_build_time "0.002"
0 0 hstar_comm_assoc "0.002"
8087 8091 proof_check_time "0.000"
0 0 VernacProof "tac:no using:yes"
8694 8698 proof_build_time "0.000"
0 0 repr_eq "0.000"
8694 8698 proof_check_time "0.000"
0 0 VernacProof "tac:no using:yes"
9533 9537 proof_build_time "0.001"
0 0 repr_id "0.001"
9533 9537 proof_check_time "0.000"
0 0 VernacProof "tac:no using:yes"
10021 10025 proof_build_time "0.005"
0 0 star_post_empty "0.005"
10021 10025 proof_check_time "0.000"
0 0 VernacProof "tac:no using:yes"
13203 13207 proof_build_time "0.000"
0 0 hstars_flip_0 "0.000"
13203 13207 proof_check_time "0.000"
0 0 VernacProof "tac:no using:yes"
13286 13290 proof_build_time "0.000"
0 0 hstars_flip_1 "0.000"
13286 13290 proof_check_time "0.000"
0 0 VernacProof "tac:no using:yes"
13432 13436 proof_build_time "0.005"
0 0 hstars_flip_2 "0.005"
13432 13436 proof_check_time "0.000"
0 0 VernacProof "tac:no using:yes"
13624 13628 proof_build_time "0.008"
0 0 hstars_flip_3 "0.008"
13624 13628 proof_check_time "0.000"
0 0 VernacProof "tac:no using:yes"
13831 13835 proof_build_time "0.010"
0 0 hstars_flip_4 "0.010"
13831 13835 proof_check_time "0.001"
0 0 VernacProof "tac:no using:yes"
14053 14057 proof_build_time "0.059"
0 0 hstars_flip_5 "0.059"
14053 14057 proof_check_time "0.001"
0 0 VernacProof "tac:no using:yes"
14294 14298 proof_build_time "0.007"
0 0 hstars_flip_6 "0.007"
14294 14298 proof_check_time "0.001"
0 0 VernacProof "tac:no using:yes"
14550 14554 proof_build_time "0.007"
0 0 hstars_flip_7 "0.007"
14550 14554 proof_check_time "0.001"
0 0 VernacProof "tac:no using:yes"
14821 14825 proof_build_time "0.007"
0 0 hstars_flip_8 "0.007"
14821 14825 proof_check_time "0.001"
0 0 VernacProof "tac:no using:yes"
15107 15111 proof_build_time "0.008"
0 0 hstars_flip_9 "0.008"
15107 15111 proof_check_time "0.001"
0 0 VernacProof "tac:no using:yes"
16973 16977 proof_build_time "0.000"
0 0 hstars_pick_1 "0.000"
16973 16977 proof_check_time "0.000"
0 0 VernacProof "tac:no using:yes"
17103 17107 proof_build_time "0.000"
0 0 hstars_pick_2 "0.000"
17103 17107 proof_check_time "0.000"
0 0 VernacProof "tac:no using:yes"
17270 17274 proof_build_time "0.001"
0 0 hstars_pick_3 "0.001"
17270 17274 proof_check_time "0.000"
0 0 VernacProof "tac:no using:yes"
17452 17456 proof_build_time "0.001"
0 0 hstars_pick_4 "0.001"
17452 17456 proof_check_time "0.000"
0 0 VernacProof "tac:no using:yes"
17649 17653 proof_build_time "0.001"
0 0 hstars_pick_5 "0.001"
17649 17653 proof_check_time "0.000"
0 0 VernacProof "tac:no using:yes"
17865 17869 proof_build_time "0.001"
0 0 hstars_pick_6 "0.001"
17865 17869 proof_check_time "0.000"
0 0 VernacProof "tac:no using:yes"
18096 18100 proof_build_time "0.001"
0 0 hstars_pick_7 "0.001"
18096 18100 proof_check_time "0.000"
0 0 VernacProof "tac:no using:yes"
18342 18346 proof_build_time "0.013"
0 0 hstars_pick_8 "0.013"
18342 18346 proof_check_time "0.000"
0 0 VernacProof "tac:no using:yes"
18603 18607 proof_build_time "0.002"
0 0 hstars_pick_9 "0.002"
18603 18607 proof_check_time "0.000"
0 0 VernacProof "tac:no using:yes"
18677 18681 proof_build_time "0.000"
0 0 hstars_pick_last_1 "0.000"
18677 18681 proof_check_time "0.000"
0 0 VernacProof "tac:no using:yes"
18791 18795 proof_build_time "0.000"
0 0 hstars_pick_last_2 "0.000"
18791 18795 proof_check_time "0.000"
0 0 VernacProof "tac:no using:yes"
18945 18949 proof_build_time "0.001"
0 0 hstars_pick_last_3 "0.001"
18945 18949 proof_check_time "0.000"
0 0 VernacProof "tac:no using:yes"
19114 19118 proof_build_time "0.001"
0 0 hstars_pick_last_4 "0.001"
19114 19118 proof_check_time "0.000"
0 0 VernacProof "tac:no using:yes"
19298 19302 proof_build_time "0.001"
0 0 hstars_pick_last_5 "0.001"
19298 19302 proof_check_time "0.000"
0 0 VernacProof "tac:no using:yes"
19501 19505 proof_build_time "0.001"
0 0 hstars_pick_last_6 "0.001"
19501 19505 proof_check_time "0.000"
0 0 VernacProof "tac:no using:yes"
19719 19723 proof_build_time "0.001"
0 0 hstars_pick_last_7 "0.001"
19719 19723 proof_check_time "0.000"
0 0 VernacProof "tac:no using:yes"
19952 19956 proof_build_time "0.001"
0 0 hstars_pick_last_8 "0.001"
19952 19956 proof_check_time "0.000"
0 0 VernacProof "tac:no using:yes"
20200 20204 proof_build_time "0.001"
0 0 hstars_pick_last_9 "0.001"
20200 20204 proof_check_time "0.000"
0 0 VernacProof "tac:no using:yes"
24450 24454 proof_build_time "0.004"
0 0 Xsimpl_trans_l "0.004"
24450 24454 proof_check_time "0.001"
0 0 VernacProof "tac:no using:yes"
24735 24739 proof_build_time "0.003"
0 0 Xsimpl_trans_r "0.003"
24735 24739 proof_check_time "0.001"
0 0 VernacProof "tac:no using:yes"
25074 25078 proof_build_time "0.001"
0 0 Xsimpl_trans "0.001"
25074 25078 proof_check_time "0.001"
0 0 VernacProof "tac:no using:yes"
25361 25365 proof_build_time "0.002"
0 0 hstars_simpl_start "0.002"
25361 25365 proof_check_time "0.000"
0 0 VernacProof "tac:no using:yes"
25529 25533 proof_build_time "0.003"
0 0 hstars_simpl_keep "0.003"
25529 25533 proof_check_time "0.000"
0 0 VernacProof "tac:no using:yes"
25705 25709 proof_build_time "0.001"
0 0 hstars_simpl_cancel "0.001"
25705 25709 proof_check_time "0.000"
0 0 VernacProof "tac:no using:yes"
25835 25839 proof_build_time "0.000"
0 0 hstars_simpl_pick_lemma "0.000"
25835 25839 proof_check_time "0.000"
0 0 VernacProof "tac:no using:yes"
26883 26887 proof_build_time "0.000"
0 0 xpull_protect "0.000"
26883 26887 proof_check_time "0.000"
0 0 VernacProof "tac:no using:yes"
27052 27056 proof_build_time "0.003"
0 0 xsimpl_start "0.003"
27052 27056 proof_check_time "0.001"
0 0 VernacProof "tac:no using:yes"
27559 27563 proof_build_time "0.012"
0 0 xsimpl_l_hempty "0.012"
27559 27563 proof_check_time "0.001"
0 0 VernacProof "tac:no using:yes"
27775 27779 proof_build_time "0.001"
0 0 xsimpl_l_hpure "0.001"
27775 27779 proof_check_time "0.001"
0 0 VernacProof "tac:no using:yes"
28081 28085 proof_build_time "0.003"
0 0 xsimpl_l_hexists "0.003"
28081 28085 proof_check_time "0.001"
0 0 VernacProof "tac:no using:yes"
28244 28248 proof_build_time "0.009"
0 0 xsimpl_l_acc_wand "0.009"
28244 28248 proof_check_time "0.001"
0 0 VernacProof "tac:no using:yes"
28408 28412 proof_build_time "0.008"
0 0 xsimpl_l_acc_other "0.008"
28408 28412 proof_check_time "0.001"
0 0 VernacProof "tac:no using:yes"
28691 28695 proof_build_time "0.009"
0 0 xsimpl_l_cancel_hwand_hempty "0.009"
28691 28695 proof_check_time "0.002"
0 0 VernacProof "tac:no using:yes"
28910 28914 proof_build_time "0.010"
0 0 xsimpl_l_cancel_hwand "0.010"
28910 28914 proof_check_time "0.001"
0 0 VernacProof "tac:no using:yes"
29251 29255 proof_build_time "0.013"
0 0 xsimpl_l_cancel_qwand "0.013"
29251 29255 proof_check_time "0.002"
0 0 VernacProof "tac:no using:yes"
29415 29419 proof_build_time "0.011"
0 0 xsimpl_l_keep_wand "0.011"
29415 29419 proof_check_time "0.001"
0 0 VernacProof "tac:no using:yes"
29623 29627 proof_build_time "0.001"
0 0 xsimpl_l_hwand_reorder "0.001"
29623 29627 proof_check_time "0.000"
0 0 VernacProof "tac:no using:yes"
29886 29890 proof_build_time "0.013"
0 0 xsimpl_l_cancel_hwand_hstar "0.013"
29886 29890 proof_check_time "0.002"
0 0 VernacProof "tac:no using:yes"
30099 30103 proof_build_time "0.009"
0 0 xsimpl_l_cancel_hwand_hstar_hempty "0.009"
30099 30103 proof_check_time "0.002"
0 0 VernacProof "tac:no using:yes"
30539 30543 proof_build_time "0.007"
0 0 xsimpl_r_hempty "0.007"
30539 30543 proof_check_time "0.001"
0 0 VernacProof "tac:no using:yes"
30737 30741 proof_build_time "0.019"
0 0 xsimpl_r_hwand_same "0.019"
30737 30741 proof_check_time "0.001"
0 0 VernacProof "tac:no using:yes"
30941 30945 proof_build_time "0.008"
0 0 xsimpl_r_hpure "0.008"
30941 30945 proof_check_time "0.001"
0 0 VernacProof "tac:no using:yes"
31157 31161 proof_build_time "0.009"
0 0 xsimpl_r_hexists "0.009"
31157 31161 proof_check_time "0.002"
0 0 VernacProof "tac:no using:yes"
31396 31400 proof_build_time "0.009"
0 0 xsimpl_r_id "0.009"
31396 31400 proof_check_time "0.002"
0 0 VernacProof "tac:no using:yes"
31578 31582 proof_build_time "0.001"
0 0 xsimpl_r_id_unify "0.001"
31578 31582 proof_check_time "0.001"
0 0 VernacProof "tac:no using:yes"
31737 31741 proof_build_time "0.009"
0 0 xsimpl_r_keep "0.009"
31737 31741 proof_check_time "0.002"
0 0 VernacProof "tac:no using:yes"
32003 32007 proof_build_time "0.007"
0 0 xsimpl_r_hgc_or_htop "0.007"
32003 32007 proof_check_time "0.001"
0 0 VernacProof "tac:no using:yes"
32216 32220 proof_build_time "0.009"
0 0 xsimpl_r_htop_replace_hgc "0.009"
32216 32220 proof_check_time "0.001"
0 0 VernacProof "tac:no using:yes"
32401 32405 proof_build_time "0.008"
0 0 xsimpl_r_hgc_drop "0.008"
32401 32405 proof_check_time "0.001"
0 0 VernacProof "tac:no using:yes"
32580 32584 proof_build_time "0.018"
0 0 xsimpl_r_htop_drop "0.018"
32580 32584 proof_check_time "0.001"
0 0 VernacProof "tac:no using:yes"
33071 33075 proof_build_time "0.014"
0 0 xsimpl_lr_cancel_same "0.014"
33071 33075 proof_check_time "0.002"
0 0 VernacProof "tac:no using:yes"
33413 33417 proof_build_time "0.012"
0 0 xsimpl_lr_cancel_htop "0.012"
33413 33417 proof_check_time "0.001"
0 0 VernacProof "tac:no using:yes"
33764 33768 proof_build_time "0.022"
0 0 xsimpl_lr_cancel_hgc "0.022"
33764 33768 proof_check_time "0.002"
0 0 VernacProof "tac:no using:yes"
34007 34011 proof_build_time "0.001"
0 0 xsimpl_lr_cancel_eq "0.001"
34007 34011 proof_check_time "0.001"
0 0 VernacProof "tac:no using:yes"
34288 34292 proof_build_time "0.001"
0 0 xsimpl_lr_cancel_eq_repr "0.001"
34288 34292 proof_check_time "0.001"
0 0 VernacProof "tac:no using:yes"
34550 34554 proof_build_time "0.017"
0 0 xsimpl_lr_hwand "0.017"
34550 34554 proof_check_time "0.001"
0 0 VernacProof "tac:no using:yes"
34787 34791 proof_build_time "0.004"
0 0 xsimpl_lr_hwand_hfalse "0.004"
34787 34791 proof_check_time "0.000"
0 0 VernacProof "tac:no using:yes"
35080 35084 proof_build_time "0.006"
0 0 xsimpl_lr_qwand "0.006"
35080 35084 proof_check_time "0.001"
0 0 VernacProof "tac:no using:yes"
35339 35343 proof_build_time "0.002"
0 0 xsimpl_lr_qwand_unit "0.002"
35339 35343 proof_check_time "0.001"
0 0 VernacProof "tac:no using:yes"
35621 35625 proof_build_time "0.007"
0 0 xsimpl_lr_hforall "0.007"
35621 35625 proof_check_time "0.001"
0 0 VernacProof "tac:no using:yes"
35754 35758 proof_build_time "0.003"
0 0 himpl_lr_refl "0.003"
35754 35758 proof_check_time "0.000"
0 0 VernacProof "tac:no using:yes"
35955 35959 proof_build_time "0.005"
0 0 himpl_lr_qwand_unify "0.005"
35955 35959 proof_check_time "0.001"
0 0 VernacProof "tac:no using:yes"
36228 36232 proof_build_time "0.061"
0 0 himpl_lr_htop "0.061"
36228 36232 proof_check_time "0.001"
0 0 VernacProof "tac:no using:yes"
36526 36530 proof_build_time "0.008"
0 0 himpl_lr_hgc "0.008"
36526 36530 proof_check_time "0.001"
0 0 VernacProof "tac:no using:yes"
36694 36698 proof_build_time "0.004"
0 0 xsimpl_lr_exit_nogc "0.004"
36694 36698 proof_check_time "0.001"
0 0 VernacProof "tac:no using:yes"
36883 36887 proof_build_time "0.004"
0 0 xsimpl_lr_exit "0.004"
36883 36887 proof_check_time "0.001"
0 0 VernacProof "tac:no using:yes"
37127 37131 proof_build_time "0.001"
0 0 xsimpl_flip_acc_l "0.001"
37127 37131 proof_check_time "0.001"
0 0 VernacProof "tac:no using:yes"
37321 37325 proof_build_time "0.001"
0 0 xsimpl_flip_acc_r "0.001"
37321 37325 proof_check_time "0.001"
0 0 VernacProof "tac:no using:yes"
38057 38061 proof_build_time "0.001"
0 0 xsimpl_pick_lemma "0.001"
38057 38061 proof_check_time "0.001"
0 0 VernacProof "tac:no using:yes"
51210 51214 proof_build_time "0.006"
0 0 xchange_lemma "0.006"
51210 51214 proof_check_time "0.000"
0 0 VernacProof "tac:no using:yes"
55431 55437 proof_build_time "0.004"
55431 55437 proof_check_time "0.000"
0 0 VernacProof "tac:no using:yes"
55706 55712 proof_build_time "0.001"
55706 55712 proof_check_time "0.000"
0 0 VernacProof "tac:no using:yes"
55840 55846 proof_build_time "0.000"
55840 55846 proof_check_time "0.000"
0 0 VernacProof "tac:no using:yes"
56109 56115 proof_build_time "0.001"
56109 56115 proof_check_time "0.000"
0 0 VernacProof "tac:no using:yes"
56521 56525 proof_build_time "0.001"
0 0 demo_hstars_pick_1 "0.001"
56521 56525 proof_check_time "0.000"
0 0 VernacProof "tac:no using:yes"
56966 56970 proof_build_time "0.009"
0 0 demo_hstars_simpl_1 "0.009"
56966 56970 proof_check_time "0.001"
0 0 VernacProof "tac:no using:yes"
57148 57154 proof_build_time "0.005"
57148 57154 proof_check_time "0.000"
0 0 VernacProof "tac:no using:yes"
57810 57816 proof_build_time "0.006"
57810 57816 proof_check_time "0.000"
0 0 VernacProof "tac:no using:yes"
58860 58866 proof_build_time "0.037"
58860 58866 proof_check_time "0.000"
0 0 VernacProof "tac:no using:yes"
59149 59155 proof_build_time "0.014"
59149 59155 proof_check_time "0.000"
0 0 VernacProof "tac:no using:yes"
59301 59307 proof_build_time "0.006"
59301 59307 proof_check_time "0.000"
0 0 VernacProof "tac:no using:yes"
59654 59660 proof_build_time "0.014"
59654 59660 proof_check_time "0.000"
0 0 VernacProof "tac:no using:yes"
59962 59966 proof_build_time "0.012"
0 0 xsimpl_demo_hint "0.012"
59962 59966 proof_check_time "0.002"
0 0 VernacProof "tac:no using:yes"
60195 60201 proof_build_time "0.008"
60195 60201 proof_check_time "0.000"
0 0 VernacProof "tac:no using:yes"
60329 60335 proof_build_time "0.000"
60329 60335 proof_check_time "0.000"
0 0 VernacProof "tac:no using:yes"
60546 60552 proof_build_time "0.009"
60546 60552 proof_check_time "0.000"
0 0 VernacProof "tac:no using:yes"
60799 60805 proof_build_time "0.010"
60799 60805 proof_check_time "0.000"
0 0 VernacProof "tac:no using:yes"
60928 60934 proof_build_time "0.019"
60928 60934 proof_check_time "0.000"
0 0 VernacProof "tac:no using:yes"
61069 61073 proof_build_time "0.006"
0 0 xsimpl_demo_hgc_multiple "0.006"
61069 61073 proof_check_time "0.001"
0 0 VernacProof "tac:no using:yes"
61488 61492 proof_build_time "0.013"
0 0 xsimpl_demo_hwand "0.013"
61488 61492 proof_check_time "0.002"
0 0 VernacProof "tac:no using:yes"
61638 61642 proof_build_time "0.004"
0 0 xsimpl_demo_qwand "0.004"
61638 61642 proof_check_time "0.001"
0 0 VernacProof "tac:no using:yes"
61761 61765 proof_build_time "0.004"
0 0 xsimpl_demo_hwand_r "0.004"
61761 61765 proof_check_time "0.001"
0 0 VernacProof "tac:no using:yes"
61907 61911 proof_build_time "0.004"
0 0 xsimpl_demo_qwand_r "0.004"
61907 61911 proof_check_time "0.001"
0 0 VernacProof "tac:no using:yes"
62082 62086 proof_build_time "0.007"
0 0 xsimpl_demo_hwand_multiple_1 "0.007"
62082 62086 proof_check_time "0.001"
0 0 VernacProof "tac:no using:yes"
62251 62255 proof_build_time "0.006"
0 0 xsimpl_demo_hwand_multiple_2 "0.006"
62251 62255 proof_check_time "0.002"
0 0 VernacProof "tac:no using:yes"
62365 62371 proof_build_time "0.003"
62365 62371 proof_check_time "0.000"
0 0 VernacProof "tac:no using:yes"
62516 62522 proof_build_time "0.005"
62516 62522 proof_check_time "0.000"
0 0 VernacProof "tac:no using:yes"
63103 63107 proof_build_time "0.018"
0 0 xsimpl_demo_hwand_iter "0.018"
63103 63107 proof_check_time "0.003"
0 0 VernacProof "tac:no using:yes"
63373 63377 proof_build_time "0.009"
0 0 xsimpl_demo_repr_1 "0.009"
63373 63377 proof_check_time "0.002"
0 0 VernacProof "tac:no using:yes"
63537 63541 proof_build_time "0.005"
0 0 xsimpl_demo_repr_2 "0.005"
63537 63541 proof_check_time "0.001"
0 0 VernacProof "tac:no using:yes"
63748 63752 proof_build_time "0.005"
0 0 xsimpl_demo_repr_3 "0.005"
63748 63752 proof_check_time "0.001"
0 0 VernacProof "tac:no using:yes"
63890 63894 proof_build_time "0.004"
0 0 xsimpl_demo_repr_4 "0.004"
63890 63894 proof_check_time "0.001"
0 0 VernacProof "tac:no using:yes"
63991 63997 proof_build_time "0.005"
63991 63997 proof_check_time "0.000"
0 0 VernacProof "tac:no using:yes"
64263 64269 proof_build_time "0.019"
64263 64269 proof_check_time "0.000"
0 0 VernacProof "tac:no using:yes"
64398 64404 proof_build_time "0.008"
64398 64404 proof_check_time "0.000"
0 0 VernacProof "tac:no using:yes"
64678 64684 proof_build_time "0.008"
64678 64684 proof_check_time "0.000"
0 0 VernacProof "tac:no using:yes"
64811 64817 proof_build_time "0.008"
64811 64817 proof_check_time "0.000"
0 0 VernacProof "tac:no using:yes"
65143 65147 proof_build_time "0.030"
0 0 xchange_demo_1 "0.030"
65143 65147 proof_check_time "0.003"
0 0 VernacProof "tac:no using:yes"
65415 65419 proof_build_time "0.029"
0 0 xchange_demo_2 "0.029"
65415 65419 proof_check_time "0.005"
0 0 VernacProof "tac:no using:yes"
65550 65554 proof_build_time "0.005"
0 0 xchange_demo_4 "0.005"
65550 65554 proof_check_time "0.001"
0 0 VernacProof "tac:no using:yes"
65791 65795 proof_build_time "0.009"
0 0 xsimpl_demo_hfalse "0.009"
65791 65795 proof_check_time "0.002"
0 0 VernacProof "tac:no using:yes"
66046 66050 proof_build_time "0.019"
0 0 xchange_demo_hforall_l "0.019"
66046 66050 proof_check_time "0.002"
0 0 vo_compile_time "1.475"
