COQAUX1 5602f3c7d481921a78f8a4fee3792fd6 /Users/pbarroso/Downloads/slf/LibString.v
0 0 VernacProof "tac:no using:yes"
768 772 proof_build_time "0.001"
0 0 Inhab_string "0.001"
768 772 proof_check_time "0.000"
0 0 vo_compile_time "0.242"
