COQAUX1 306359fad3036a23c57ba4162212e950 /Users/pbarroso/Downloads/slf/LibSepReference.v
0 0 VernacProof "tac:no using:yes"
5312 5316 proof_build_time "0.001"
0 0 Inhab_val "0.001"
5312 5316 proof_check_time "0.000"
0 0 VernacProof "tac:no using:yes"
10751 10755 proof_build_time "0.002"
0 0 eval_add "0.002"
10751 10755 proof_check_time "0.000"
0 0 VernacProof "tac:no using:yes"
10939 10943 proof_build_time "0.002"
0 0 eval_div "0.002"
10939 10943 proof_check_time "0.000"
0 0 VernacProof "tac:no using:yes"
16220 16224 proof_build_time "0.000"
0 0 himpl_refl "0.000"
16220 16224 proof_check_time "0.000"
0 0 VernacProof "tac:no using:yes"
16381 16385 proof_build_time "0.000"
0 0 himpl_trans "0.000"
16381 16385 proof_check_time "0.000"
0 0 VernacProof "tac:no using:yes"
16526 16530 proof_build_time "0.001"
0 0 himpl_trans_r "0.001"
16526 16530 proof_check_time "0.000"
0 0 VernacProof "tac:no using:yes"
16677 16681 proof_build_time "0.002"
0 0 himpl_antisym "0.002"
16677 16681 proof_check_time "0.000"
0 0 VernacProof "tac:no using:yes"
16883 16887 proof_build_time "0.003"
0 0 hprop_op_comm "0.003"
16883 16887 proof_check_time "0.000"
0 0 VernacProof "tac:no using:yes"
16974 16978 proof_build_time "0.000"
0 0 qimpl_refl "0.000"
16974 16978 proof_check_time "0.000"
0 0 VernacProof "tac:no using:yes"
17175 17179 proof_build_time "0.000"
0 0 hempty_intro "0.000"
17175 17179 proof_check_time "0.000"
0 0 VernacProof "tac:no using:yes"
17258 17262 proof_build_time "0.000"
0 0 hempty_inv "0.000"
17258 17262 proof_check_time "0.000"
0 0 VernacProof "tac:no using:yes"
17526 17530 proof_build_time "0.001"
0 0 hstar_intro "0.001"
17526 17530 proof_check_time "0.000"
0 0 VernacProof "tac:no using:yes"
17696 17700 proof_build_time "0.000"
0 0 hstar_inv "0.000"
17696 17700 proof_check_time "0.000"
0 0 VernacProof "tac:no using:yes"
17921 17925 proof_build_time "0.010"
0 0 hstar_comm "0.010"
17921 17925 proof_check_time "0.001"
0 0 VernacProof "tac:no using:yes"
18305 18309 proof_build_time "0.156"
0 0 hstar_assoc "0.156"
18305 18309 proof_check_time "0.004"
0 0 VernacProof "tac:no using:yes"
18592 18596 proof_build_time "0.006"
0 0 hstar_hempty_l "0.006"
18592 18596 proof_check_time "0.001"
0 0 VernacProof "tac:no using:yes"
18742 18746 proof_build_time "0.001"
0 0 hstar_hempty_r "0.001"
18742 18746 proof_check_time "0.000"
0 0 VernacProof "tac:no using:yes"
19029 19033 proof_build_time "0.004"
0 0 hstar_hexists "0.004"
19029 19033 proof_check_time "0.001"
0 0 VernacProof "tac:no using:yes"
19217 19221 proof_build_time "0.001"
0 0 hstar_hforall "0.001"
19217 19221 proof_check_time "0.001"
0 0 VernacProof "tac:no using:yes"
19357 19361 proof_build_time "0.003"
0 0 himpl_frame_l "0.003"
19357 19361 proof_check_time "0.001"
0 0 VernacProof "tac:no using:yes"
19528 19532 proof_build_time "0.001"
0 0 himpl_frame_r "0.001"
19528 19532 proof_check_time "0.000"
0 0 VernacProof "tac:no using:yes"
19740 19744 proof_build_time "0.004"
0 0 himpl_frame_lr "0.004"
19740 19744 proof_check_time "0.000"
0 0 VernacProof "tac:no using:yes"
19926 19930 proof_build_time "0.015"
0 0 himpl_hstar_trans_l "0.015"
19926 19930 proof_check_time "0.000"
0 0 VernacProof "tac:no using:yes"
20112 20116 proof_build_time "0.006"
0 0 himpl_hstar_trans_r "0.006"
20112 20116 proof_check_time "0.000"
0 0 VernacProof "tac:no using:yes"
20324 20328 proof_build_time "0.000"
0 0 hpure_intro "0.000"
20324 20328 proof_check_time "0.000"
0 0 VernacProof "tac:no using:yes"
20430 20434 proof_build_time "0.000"
0 0 hpure_inv "0.000"
20430 20434 proof_check_time "0.000"
0 0 VernacProof "tac:no using:yes"
20651 20655 proof_build_time "0.002"
0 0 hstar_hpure_l "0.002"
20651 20655 proof_check_time "0.000"
0 0 VernacProof "tac:no using:yes"
20806 20810 proof_build_time "0.002"
0 0 hstar_hpure_r "0.002"
20806 20810 proof_check_time "0.000"
0 0 VernacProof "tac:no using:yes"
20962 20966 proof_build_time "0.001"
0 0 himpl_hstar_hpure_r "0.001"
20962 20966 proof_check_time "0.000"
0 0 VernacProof "tac:no using:yes"
21107 21111 proof_build_time "0.001"
0 0 hpure_inv_hempty "0.001"
21107 21111 proof_check_time "0.000"
0 0 VernacProof "tac:no using:yes"
21265 21269 proof_build_time "0.001"
0 0 hpure_intro_hempty "0.001"
21265 21269 proof_check_time "0.000"
0 0 VernacProof "tac:no using:yes"
21396 21400 proof_build_time "0.000"
0 0 himpl_hempty_hpure "0.000"
21396 21400 proof_check_time "0.000"
0 0 VernacProof "tac:no using:yes"
21556 21560 proof_build_time "0.001"
0 0 himpl_hstar_hpure_l "0.001"
21556 21560 proof_check_time "0.000"
0 0 VernacProof "tac:no using:yes"
21728 21732 proof_build_time "0.003"
0 0 hempty_eq_hpure_true "0.003"
21728 21732 proof_check_time "0.000"
0 0 VernacProof "tac:no using:yes"
21937 21941 proof_build_time "0.006"
0 0 hfalse_hstar_any "0.006"
21937 21941 proof_check_time "0.000"
0 0 VernacProof "tac:no using:yes"
22164 22168 proof_build_time "0.000"
0 0 hexists_intro "0.000"
22164 22168 proof_check_time "0.000"
0 0 VernacProof "tac:no using:yes"
22306 22310 proof_build_time "0.000"
0 0 hexists_inv "0.000"
22306 22310 proof_check_time "0.000"
0 0 VernacProof "tac:no using:yes"
22460 22464 proof_build_time "0.001"
0 0 himpl_hexists_l "0.001"
22460 22464 proof_check_time "0.000"
0 0 VernacProof "tac:no using:yes"
22601 22605 proof_build_time "0.001"
0 0 himpl_hexists_r "0.001"
22601 22605 proof_check_time "0.000"
0 0 VernacProof "tac:no using:yes"
22786 22790 proof_build_time "0.003"
0 0 himpl_hexists "0.003"
22786 22790 proof_check_time "0.000"
0 0 VernacProof "tac:no using:yes"
23021 23025 proof_build_time "0.000"
0 0 hforall_intro "0.000"
23021 23025 proof_check_time "0.000"
0 0 VernacProof "tac:no using:yes"
23144 23148 proof_build_time "0.000"
0 0 hforall_inv "0.000"
23144 23148 proof_check_time "0.000"
0 0 VernacProof "tac:no using:yes"
23295 23299 proof_build_time "0.001"
0 0 himpl_hforall_r "0.001"
23295 23299 proof_check_time "0.000"
0 0 VernacProof "tac:no using:yes"
23436 23440 proof_build_time "0.000"
0 0 himpl_hforall_l "0.000"
23436 23440 proof_check_time "0.000"
0 0 VernacProof "tac:no using:yes"
23571 23575 proof_build_time "0.002"
0 0 hforall_specialize "0.002"
23571 23575 proof_check_time "0.000"
0 0 VernacProof "tac:no using:yes"
23756 23760 proof_build_time "0.004"
0 0 himpl_hforall "0.004"
23756 23760 proof_check_time "0.000"
0 0 VernacProof "tac:no using:yes"
24345 24349 proof_build_time "0.023"
0 0 hwand_equiv "0.023"
24345 24349 proof_check_time "0.001"
0 0 VernacProof "tac:no using:yes"
24478 24482 proof_build_time "0.001"
0 0 himpl_hwand_r "0.001"
24478 24482 proof_check_time "0.000"
0 0 VernacProof "tac:no using:yes"
24618 24622 proof_build_time "0.001"
0 0 himpl_hwand_r_inv "0.001"
24618 24622 proof_check_time "0.000"
0 0 VernacProof "tac:no using:yes"
24753 24757 proof_build_time "0.004"
0 0 hwand_cancel "0.004"
24753 24757 proof_check_time "0.000"
0 0 VernacProof "tac:no using:yes"
24932 24936 proof_build_time "0.000"
0 0 himpl_hempty_hwand_same "0.000"
24932 24936 proof_check_time "0.000"
0 0 VernacProof "tac:no using:yes"
25146 25150 proof_build_time "0.012"
0 0 hwand_hempty_l "0.012"
25146 25150 proof_check_time "0.000"
0 0 VernacProof "tac:no using:yes"
25407 25411 proof_build_time "0.020"
0 0 hwand_hpure_l "0.020"
25407 25411 proof_check_time "0.000"
0 0 VernacProof "tac:no using:yes"
25636 25640 proof_build_time "0.003"
0 0 hwand_curry "0.003"
25636 25640 proof_check_time "0.000"
0 0 VernacProof "tac:no using:yes"
25900 25904 proof_build_time "0.007"
0 0 hwand_uncurry "0.007"
25900 25904 proof_check_time "0.000"
0 0 VernacProof "tac:no using:yes"
26087 26091 proof_build_time "0.003"
0 0 hwand_curry_eq "0.003"
26087 26091 proof_check_time "0.000"
0 0 VernacProof "tac:no using:yes"
26424 26428 proof_build_time "0.009"
0 0 hwand_inv "0.009"
26424 26428 proof_check_time "0.002"
0 0 VernacProof "tac:no using:yes"
26921 26925 proof_build_time "0.013"
0 0 qwand_equiv "0.013"
26921 26925 proof_check_time "0.000"
0 0 VernacProof "tac:no using:yes"
27070 27074 proof_build_time "0.003"
0 0 qwand_cancel "0.003"
27070 27074 proof_check_time "0.000"
0 0 VernacProof "tac:no using:yes"
27216 27220 proof_build_time "0.001"
0 0 himpl_qwand_r "0.001"
27216 27220 proof_check_time "0.000"
0 0 VernacProof "tac:no using:yes"
27394 27398 proof_build_time "0.001"
0 0 qwand_specialize "0.001"
27394 27398 proof_check_time "0.000"
0 0 VernacProof "tac:no using:yes"
27614 27618 proof_build_time "0.000"
0 0 htop_intro "0.000"
27614 27618 proof_check_time "0.000"
0 0 VernacProof "tac:no using:yes"
27719 27723 proof_build_time "0.000"
0 0 himpl_htop_r "0.000"
27719 27723 proof_check_time "0.000"
0 0 VernacProof "tac:no using:yes"
27785 27789 proof_build_time "0.000"
0 0 htop_eq "0.000"
27785 27789 proof_check_time "0.000"
0 0 VernacProof "tac:no using:yes"
27983 27987 proof_build_time "0.013"
0 0 hstar_htop_htop "0.013"
27983 27987 proof_check_time "0.000"
0 0 VernacProof "tac:no using:yes"
28190 28194 proof_build_time "0.000"
0 0 hsingle_intro "0.000"
28190 28194 proof_check_time "0.000"
0 0 VernacProof "tac:no using:yes"
28288 28292 proof_build_time "0.000"
0 0 hsingle_inv "0.000"
28288 28292 proof_check_time "0.000"
0 0 VernacProof "tac:no using:yes"
28511 28515 proof_build_time "0.443"
0 0 hstar_hsingle_same_loc "0.443"
28511 28515 proof_check_time "0.002"
0 0 VernacProof "tac:no using:yes"
28831 28835 proof_build_time "0.000"
0 0 haffine_hany "0.000"
28831 28835 proof_check_time "0.000"
0 0 VernacProof "tac:no using:yes"
28909 28913 proof_build_time "0.001"
0 0 haffine_hempty "0.001"
28909 28913 proof_check_time "0.000"
0 0 VernacProof "tac:no using:yes"
29102 29106 proof_build_time "0.001"
0 0 haffine_hgc "0.001"
29102 29106 proof_check_time "0.000"
0 0 VernacProof "tac:no using:yes"
29210 29214 proof_build_time "0.001"
0 0 himpl_hgc_r "0.001"
29210 29214 proof_check_time "0.000"
0 0 VernacProof "tac:no using:yes"
29295 29299 proof_build_time "0.000"
0 0 hstar_hgc_hgc "0.000"
29295 29299 proof_check_time "0.000"
0 0 VernacProof "tac:no using:yes"
32145 32149 proof_build_time "0.001"
0 0 haffine_hempty "0.001"
32145 32149 proof_check_time "0.000"
0 0 VernacProof "tac:no using:yes"
32241 32245 proof_build_time "0.001"
0 0 haffine_hpure "0.001"
32241 32245 proof_check_time "0.000"
0 0 VernacProof "tac:no using:yes"
32379 32383 proof_build_time "0.001"
0 0 haffine_hstar "0.001"
32379 32383 proof_check_time "0.000"
0 0 VernacProof "tac:no using:yes"
32535 32539 proof_build_time "0.001"
0 0 haffine_hexists "0.001"
32535 32539 proof_check_time "0.000"
0 0 VernacProof "tac:no using:yes"
32702 32706 proof_build_time "0.001"
0 0 haffine_hforall "0.001"
32702 32706 proof_check_time "0.000"
0 0 VernacProof "tac:no using:yes"
32842 32846 proof_build_time "0.001"
0 0 haffine_hstar_hpure "0.001"
32842 32846 proof_check_time "0.000"
0 0 VernacProof "tac:no using:yes"
32925 32929 proof_build_time "0.001"
0 0 haffine_hgc "0.001"
32925 32929 proof_check_time "0.000"
0 0 VernacProof "tac:no using:yes"
34191 34195 proof_build_time "0.008"
0 0 eval_ref_sep "0.008"
34191 34195 proof_check_time "0.001"
0 0 VernacProof "tac:no using:yes"
34488 34492 proof_build_time "0.004"
0 0 eval_get_sep "0.004"
34488 34492 proof_check_time "0.001"
0 0 VernacProof "tac:no using:yes"
34910 34914 proof_build_time "0.012"
0 0 eval_set_sep "0.012"
34910 34914 proof_check_time "0.002"
0 0 VernacProof "tac:no using:yes"
35329 35333 proof_build_time "0.017"
0 0 eval_free_sep "0.017"
35329 35333 proof_check_time "0.001"
0 0 VernacProof "tac:no using:yes"
35946 35950 proof_build_time "0.003"
0 0 hoare_conseq "0.003"
35946 35950 proof_check_time "0.001"
0 0 VernacProof "tac:no using:yes"
36119 36123 proof_build_time "0.001"
0 0 hoare_hexists "0.001"
36119 36123 proof_check_time "0.000"
0 0 VernacProof "tac:no using:yes"
36365 36369 proof_build_time "0.003"
0 0 hoare_hpure "0.003"
36365 36369 proof_check_time "0.001"
0 0 VernacProof "tac:no using:yes"
36651 36655 proof_build_time "0.015"
0 0 hoare_hforall "0.015"
36651 36655 proof_check_time "0.000"
0 0 VernacProof "tac:no using:yes"
36808 36812 proof_build_time "0.001"
0 0 hoare_hwand_hpure_l "0.001"
36808 36812 proof_check_time "0.000"
0 0 VernacProof "tac:no using:yes"
37139 37143 proof_build_time "0.009"
0 0 hoare_eval_like "0.009"
37139 37143 proof_check_time "0.000"
0 0 VernacProof "tac:no using:yes"
37314 37318 proof_build_time "0.002"
0 0 hoare_val "0.002"
37314 37318 proof_check_time "0.000"
0 0 VernacProof "tac:no using:yes"
37510 37514 proof_build_time "0.001"
0 0 hoare_fun "0.001"
37510 37514 proof_check_time "0.000"
0 0 VernacProof "tac:no using:yes"
37712 37716 proof_build_time "0.001"
0 0 hoare_fix "0.001"
37712 37716 proof_check_time "0.000"
0 0 VernacProof "tac:no using:yes"
37988 37992 proof_build_time "0.005"
0 0 hoare_app_fun "0.005"
37988 37992 proof_check_time "0.001"
0 0 VernacProof "tac:no using:yes"
38281 38285 proof_build_time "0.005"
0 0 hoare_app_fix "0.005"
38281 38285 proof_check_time "0.001"
0 0 VernacProof "tac:no using:yes"
38564 38568 proof_build_time "0.010"
0 0 hoare_seq "0.010"
38564 38568 proof_check_time "0.001"
0 0 VernacProof "tac:no using:yes"
38868 38872 proof_build_time "0.022"
0 0 hoare_let "0.022"
38868 38872 proof_check_time "0.001"
0 0 VernacProof "tac:no using:yes"
39107 39111 proof_build_time "0.005"
0 0 hoare_if "0.005"
39107 39111 proof_check_time "0.001"
0 0 VernacProof "tac:no using:yes"
39551 39555 proof_build_time "0.006"
0 0 hoare_ref "0.006"
39551 39555 proof_check_time "0.001"
0 0 VernacProof "tac:no using:yes"
39860 39864 proof_build_time "0.004"
0 0 hoare_get "0.004"
39860 39864 proof_check_time "0.001"
0 0 VernacProof "tac:no using:yes"
40364 40368 proof_build_time "0.662"
0 0 hoare_set "0.662"
40364 40368 proof_check_time "0.002"
0 0 VernacProof "tac:no using:yes"
40700 40704 proof_build_time "0.006"
0 0 hoare_free "0.006"
40700 40704 proof_check_time "0.001"
0 0 VernacProof "tac:no using:yes"
40956 40960 proof_build_time "0.002"
0 0 hoare_unop "0.002"
40956 40960 proof_check_time "0.000"
0 0 VernacProof "tac:no using:yes"
41198 41202 proof_build_time "0.002"
0 0 hoare_binop "0.002"
41198 41202 proof_check_time "0.001"
0 0 VernacProof "tac:no using:no"
41598 41602 proof_build_time "0.005"
0 0 hoare_add "0.005"
41596 41597 context_used ""
41598 41602 proof_check_time "0.001"
0 0 VernacProof "tac:no using:yes"
42751 42755 proof_build_time "0.022"
0 0 triple_conseq "0.022"
42751 42755 proof_check_time "0.002"
0 0 VernacProof "tac:no using:yes"
42926 42930 proof_build_time "0.015"
0 0 triple_frame "0.015"
42926 42930 proof_check_time "0.001"
0 0 VernacProof "tac:no using:yes"
43266 43270 proof_build_time "0.004"
0 0 triple_frame' "0.004"
43266 43270 proof_check_time "0.000"
0 0 VernacProof "tac:no using:yes"
43517 43521 proof_build_time "0.002"
0 0 triple_hexists "0.002"
43517 43521 proof_check_time "0.000"
0 0 VernacProof "tac:no using:yes"
43716 43720 proof_build_time "0.002"
0 0 triple_hpure "0.002"
43716 43720 proof_check_time "0.000"
0 0 VernacProof "tac:no using:yes"
43956 43960 proof_build_time "0.007"
0 0 triple_hforall "0.007"
43956 43960 proof_check_time "0.000"
0 0 VernacProof "tac:no using:yes"
44143 44147 proof_build_time "0.004"
0 0 triple_hwand_hpure_l "0.004"
44143 44147 proof_check_time "0.000"
0 0 VernacProof "tac:no using:yes"
44397 44401 proof_build_time "0.005"
0 0 triple_conseq_frame "0.005"
44397 44401 proof_check_time "0.000"
0 0 VernacProof "tac:no using:yes"
44620 44624 proof_build_time "0.006"
0 0 triple_ramified_frame "0.006"
44620 44624 proof_check_time "0.000"
0 0 VernacProof "tac:no using:yes"
44876 44880 proof_build_time "0.008"
0 0 hexists_named_eq "0.008"
44876 44880 proof_check_time "0.001"
0 0 VernacProof "tac:no using:yes"
45093 45097 proof_build_time "0.002"
0 0 triple_named_heap "0.002"
45093 45097 proof_check_time "0.000"
0 0 VernacProof "tac:no using:yes"
45374 45378 proof_build_time "0.003"
0 0 triple_eval_like "0.003"
45374 45378 proof_check_time "0.000"
0 0 VernacProof "tac:no using:yes"
45524 45528 proof_build_time "0.008"
0 0 triple_val "0.008"
45524 45528 proof_check_time "0.001"
0 0 VernacProof "tac:no using:yes"
45694 45698 proof_build_time "0.007"
0 0 triple_fun "0.007"
45694 45698 proof_check_time "0.001"
0 0 VernacProof "tac:no using:yes"
45870 45874 proof_build_time "0.009"
0 0 triple_fix "0.009"
45870 45874 proof_check_time "0.001"
0 0 VernacProof "tac:no using:yes"
46110 46114 proof_build_time "0.019"
0 0 triple_seq "0.019"
46110 46114 proof_check_time "0.001"
0 0 VernacProof "tac:no using:yes"
46384 46388 proof_build_time "0.021"
0 0 triple_let "0.021"
46384 46388 proof_check_time "0.001"
0 0 VernacProof "tac:no using:yes"
46659 46663 proof_build_time "0.009"
0 0 triple_let_val "0.009"
46659 46663 proof_check_time "0.001"
0 0 VernacProof "tac:no using:yes"
46845 46849 proof_build_time "0.002"
0 0 triple_if "0.002"
46845 46849 proof_check_time "0.000"
0 0 VernacProof "tac:no using:yes"
47125 47129 proof_build_time "0.004"
0 0 triple_app_fun "0.004"
47125 47129 proof_check_time "0.001"
0 0 VernacProof "tac:no using:yes"
47302 47306 proof_build_time "0.001"
0 0 triple_app_fun_direct "0.001"
47302 47306 proof_check_time "0.000"
0 0 VernacProof "tac:no using:yes"
47599 47603 proof_build_time "0.004"
0 0 triple_app_fix "0.004"
47599 47603 proof_check_time "0.001"
0 0 VernacProof "tac:no using:yes"
47807 47811 proof_build_time "0.001"
0 0 triple_app_fix_direct "0.001"
47807 47811 proof_check_time "0.000"
0 0 VernacProof "tac:no using:yes"
48154 48158 proof_build_time "0.010"
0 0 triple_ref "0.010"
48154 48158 proof_check_time "0.001"
0 0 VernacProof "tac:no using:yes"
48353 48357 proof_build_time "0.015"
0 0 triple_get "0.015"
48353 48357 proof_check_time "0.001"
0 0 VernacProof "tac:no using:yes"
48552 48556 proof_build_time "0.014"
0 0 triple_set "0.014"
48552 48556 proof_check_time "0.001"
0 0 VernacProof "tac:no using:yes"
48746 48750 proof_build_time "0.015"
0 0 triple_free "0.015"
48746 48750 proof_check_time "0.001"
0 0 VernacProof "tac:no using:yes"
48973 48977 proof_build_time "0.009"
0 0 triple_unop "0.009"
48973 48977 proof_check_time "0.001"
0 0 VernacProof "tac:no using:yes"
49186 49190 proof_build_time "0.010"
0 0 triple_binop "0.010"
49186 49190 proof_check_time "0.001"
0 0 VernacProof "tac:no using:yes"
49365 49369 proof_build_time "0.001"
0 0 triple_add "0.001"
49365 49369 proof_check_time "0.000"
0 0 VernacProof "tac:no using:yes"
49562 49566 proof_build_time "0.001"
0 0 triple_div "0.001"
49562 49566 proof_check_time "0.000"
0 0 VernacProof "tac:no using:yes"
49740 49744 proof_build_time "0.001"
0 0 triple_neg "0.001"
49740 49744 proof_check_time "0.000"
0 0 VernacProof "tac:no using:yes"
49908 49912 proof_build_time "0.000"
0 0 triple_opp "0.000"
49908 49912 proof_check_time "0.000"
0 0 VernacProof "tac:no using:yes"
50082 50086 proof_build_time "0.001"
0 0 triple_eq "0.001"
50082 50086 proof_check_time "0.000"
0 0 VernacProof "tac:no using:yes"
50260 50264 proof_build_time "0.001"
0 0 triple_neq "0.001"
50260 50264 proof_check_time "0.000"
0 0 VernacProof "tac:no using:yes"
50439 50443 proof_build_time "0.001"
0 0 triple_sub "0.001"
50439 50443 proof_check_time "0.000"
0 0 VernacProof "tac:no using:yes"
50618 50622 proof_build_time "0.001"
0 0 triple_mul "0.001"
50618 50622 proof_check_time "0.000"
0 0 VernacProof "tac:no using:yes"
50814 50818 proof_build_time "0.001"
0 0 triple_mod "0.001"
50814 50818 proof_check_time "0.000"
0 0 VernacProof "tac:no using:yes"
50990 50994 proof_build_time "0.001"
0 0 triple_le "0.001"
50990 50994 proof_check_time "0.000"
0 0 VernacProof "tac:no using:yes"
51165 51169 proof_build_time "0.001"
0 0 triple_lt "0.001"
51165 51169 proof_check_time "0.000"
0 0 VernacProof "tac:no using:yes"
51341 51345 proof_build_time "0.001"
0 0 triple_ge "0.001"
51341 51345 proof_check_time "0.000"
0 0 VernacProof "tac:no using:yes"
51516 51520 proof_build_time "0.001"
0 0 triple_gt "0.001"
51516 51520 proof_check_time "0.000"
0 0 VernacProof "tac:no using:yes"
51752 51756 proof_build_time "0.002"
0 0 triple_ptr_add "0.002"
51752 51756 proof_check_time "0.000"
0 0 VernacProof "tac:no using:yes"
52054 52058 proof_build_time "0.019"
0 0 triple_ptr_add_nat "0.019"
52054 52058 proof_check_time "0.002"
0 0 VernacProof "tac:no using:yes"
53085 53089 proof_build_time "0.012"
0 0 wp_equiv "0.012"
53085 53089 proof_check_time "0.001"
0 0 VernacProof "tac:no using:yes"
53439 53443 proof_build_time "0.034"
0 0 wp_ramified "0.034"
53439 53443 proof_check_time "0.004"
0 0 VernacProof "tac:no using:yes"
53668 53672 proof_build_time "0.013"
0 0 wp_conseq "0.013"
53668 53672 proof_check_time "0.001"
0 0 VernacProof "tac:no using:yes"
53804 53808 proof_build_time "0.007"
0 0 wp_frame "0.007"
53804 53808 proof_check_time "0.001"
0 0 VernacProof "tac:no using:yes"
53958 53962 proof_build_time "0.006"
0 0 wp_ramified_frame "0.006"
53958 53962 proof_check_time "0.001"
0 0 VernacProof "tac:no using:yes"
54118 54122 proof_build_time "0.009"
0 0 wp_ramified_trans "0.009"
54118 54122 proof_check_time "0.001"
0 0 VernacProof "tac:no using:yes"
54449 54453 proof_build_time "0.015"
0 0 wp_eval_like "0.015"
54449 54453 proof_check_time "0.001"
0 0 VernacProof "tac:no using:yes"
54587 54591 proof_build_time "0.011"
0 0 wp_val "0.011"
54587 54591 proof_check_time "0.001"
0 0 VernacProof "tac:no using:yes"
54741 54745 proof_build_time "0.012"
0 0 wp_fun "0.012"
54741 54745 proof_check_time "0.001"
0 0 VernacProof "tac:no using:yes"
54901 54905 proof_build_time "0.014"
0 0 wp_fix "0.014"
54901 54905 proof_check_time "0.001"
0 0 VernacProof "tac:no using:yes"
55094 55098 proof_build_time "0.011"
0 0 wp_app_fun "0.011"
55094 55098 proof_check_time "0.001"
0 0 VernacProof "tac:no using:yes"
55384 55388 proof_build_time "0.011"
0 0 wp_app_fix "0.011"
55384 55388 proof_check_time "0.001"
0 0 VernacProof "tac:no using:yes"
55889 55893 proof_build_time "0.034"
0 0 wp_seq "0.034"
55889 55893 proof_check_time "0.002"
0 0 VernacProof "tac:no using:yes"
56340 56344 proof_build_time "0.035"
0 0 wp_let "0.035"
56340 56344 proof_check_time "0.002"
0 0 VernacProof "tac:no using:yes"
56528 56532 proof_build_time "0.010"
0 0 wp_if "0.010"
56528 56532 proof_check_time "0.001"
0 0 VernacProof "tac:no using:yes"
56690 56694 proof_build_time "0.009"
0 0 wp_if_case "0.009"
56690 56694 proof_check_time "0.000"
0 0 VernacProof "tac:no using:yes"
59348 59352 proof_build_time "0.024"
0 0 lookup_app "0.024"
59348 59352 proof_check_time "0.001"
0 0 VernacProof "tac:no using:yes"
59563 59567 proof_build_time "0.048"
0 0 lookup_rem "0.048"
59563 59567 proof_check_time "0.003"
0 0 VernacProof "tac:no using:yes"
59764 59768 proof_build_time "0.031"
0 0 rem_app "0.031"
59764 59768 proof_check_time "0.001"
0 0 VernacProof "tac:no using:yes"
59956 59960 proof_build_time "0.004"
0 0 ctx_equiv_rem "0.004"
59956 59960 proof_check_time "0.000"
0 0 VernacProof "tac:no using:yes"
60167 60171 proof_build_time "0.006"
0 0 ctx_disjoint_rem "0.006"
60167 60171 proof_check_time "0.001"
0 0 VernacProof "tac:no using:yes"
60428 60432 proof_build_time "0.005"
0 0 ctx_disjoint_equiv_app "0.005"
60428 60432 proof_check_time "0.001"
0 0 VernacProof "tac:no using:yes"
61901 61905 proof_build_time "0.003"
0 0 isubst_nil "0.003"
61901 61905 proof_check_time "0.001"
0 0 VernacProof "tac:no using:yes"
62357 62361 proof_build_time "0.057"
0 0 subst_eq_isubst_one "0.057"
62357 62361 proof_check_time "0.006"
0 0 VernacProof "tac:no using:yes"
62655 62659 proof_build_time "0.016"
0 0 isubst_ctx_equiv "0.016"
62655 62659 proof_check_time "0.001"
0 0 VernacProof "tac:no using:yes"
63249 63253 proof_build_time "0.014"
0 0 isubst_app "0.014"
63249 63253 proof_check_time "0.003"
0 0 VernacProof "tac:no using:yes"
63581 63585 proof_build_time "0.001"
0 0 isubst_app_swap "0.001"
63581 63585 proof_check_time "0.000"
0 0 VernacProof "tac:no using:yes"
64015 64019 proof_build_time "0.028"
0 0 isubst_rem "0.028"
64015 64019 proof_check_time "0.002"
0 0 VernacProof "tac:no using:yes"
64505 64509 proof_build_time "0.111"
0 0 isubst_rem_2 "0.111"
64505 64509 proof_check_time "0.006"
0 0 VernacProof "tac:no using:yes"
65526 65530 proof_build_time "0.009"
0 0 mkstruct_ramified "0.009"
65526 65530 proof_check_time "0.002"
0 0 VernacProof "tac:no using:yes"
65678 65682 proof_build_time "0.005"
0 0 mkstruct_erase "0.005"
65678 65682 proof_check_time "0.001"
0 0 VernacProof "tac:no using:yes"
65904 65908 proof_build_time "0.021"
0 0 mkstruct_conseq "0.021"
65904 65908 proof_check_time "0.002"
0 0 VernacProof "tac:no using:yes"
66064 66068 proof_build_time "0.016"
0 0 mkstruct_frame "0.016"
66064 66068 proof_check_time "0.003"
0 0 VernacProof "tac:no using:yes"
66263 66267 proof_build_time "0.023"
0 0 mkstruct_monotone "0.023"
66263 66267 proof_check_time "0.003"
0 0 VernacProof "tac:no using:yes"
69234 69238 proof_build_time "0.002"
0 0 wp_sound "0.002"
69234 69238 proof_check_time "0.000"
0 0 VernacProof "tac:no using:yes"
69505 69509 proof_build_time "0.011"
0 0 mkstruct_wp "0.011"
69505 69509 proof_check_time "0.001"
0 0 VernacProof "tac:no using:yes"
69715 69719 proof_build_time "0.002"
0 0 mkstruct_sound "0.002"
69715 69719 proof_check_time "0.000"
0 0 VernacProof "tac:no using:yes"
69896 69900 proof_build_time "0.007"
0 0 wpgen_fail_sound "0.007"
69896 69900 proof_check_time "0.000"
0 0 VernacProof "tac:no using:yes"
70044 70048 proof_build_time "0.002"
0 0 wpgen_val_sound "0.002"
70044 70048 proof_check_time "0.000"
0 0 VernacProof "tac:no using:yes"
70410 70414 proof_build_time "0.026"
0 0 wpgen_fun_sound "0.026"
70410 70414 proof_check_time "0.003"
0 0 VernacProof "tac:no using:yes"
70801 70805 proof_build_time "0.028"
0 0 wpgen_fix_sound "0.028"
70801 70805 proof_check_time "0.002"
0 0 VernacProof "tac:no using:yes"
71101 71105 proof_build_time "0.013"
0 0 wpgen_seq_sound "0.013"
71101 71105 proof_check_time "0.000"
0 0 VernacProof "tac:no using:yes"
71439 71443 proof_build_time "0.024"
0 0 wpgen_let_sound "0.024"
71439 71443 proof_check_time "0.001"
0 0 VernacProof "tac:no using:yes"
71739 71743 proof_build_time "0.024"
0 0 wpgen_if_sound "0.024"
71739 71743 proof_check_time "0.001"
0 0 VernacProof "tac:no using:yes"
72514 72518 proof_build_time "0.023"
0 0 wpgen_sound "0.023"
72514 72518 proof_check_time "0.002"
0 0 VernacProof "tac:no using:yes"
72673 72677 proof_build_time "0.002"
0 0 himpl_wpgen_wp "0.002"
72673 72677 proof_check_time "0.000"
0 0 VernacProof "tac:no using:yes"
72882 72886 proof_build_time "0.008"
0 0 triple_of_wpgen "0.008"
72882 72886 proof_check_time "0.001"
0 0 VernacProof "tac:no using:yes"
73430 73434 proof_build_time "0.007"
0 0 xstruct_lemma "0.007"
73430 73434 proof_check_time "0.001"
0 0 VernacProof "tac:no using:yes"
73540 73544 proof_build_time "0.000"
0 0 xval_lemma "0.000"
73540 73544 proof_check_time "0.000"
0 0 VernacProof "tac:no using:yes"
73682 73686 proof_build_time "0.006"
0 0 xlet_lemma "0.006"
73682 73686 proof_check_time "0.001"
0 0 VernacProof "tac:no using:yes"
73816 73820 proof_build_time "0.008"
0 0 xseq_lemma "0.008"
73816 73820 proof_check_time "0.001"
0 0 VernacProof "tac:no using:yes"
74016 74020 proof_build_time "0.013"
0 0 xif_lemma "0.013"
74016 74020 proof_check_time "0.001"
0 0 VernacProof "tac:no using:yes"
74237 74241 proof_build_time "0.019"
0 0 xapp_lemma "0.019"
74237 74241 proof_check_time "0.002"
0 0 VernacProof "tac:no using:yes"
74609 74613 proof_build_time "0.020"
0 0 xfun_spec_lemma "0.020"
74609 74613 proof_check_time "0.002"
0 0 VernacProof "tac:no using:yes"
74924 74928 proof_build_time "0.017"
0 0 xfun_nospec_lemma "0.017"
74924 74928 proof_check_time "0.002"
0 0 VernacProof "tac:no using:yes"
75223 75227 proof_build_time "0.021"
0 0 xwp_lemma_fun "0.021"
75223 75227 proof_check_time "0.004"
0 0 VernacProof "tac:no using:yes"
75578 75582 proof_build_time "0.024"
0 0 xwp_lemma_fix "0.024"
75578 75582 proof_check_time "0.005"
0 0 VernacProof "tac:no using:yes"
75798 75802 proof_build_time "0.016"
0 0 xtriple_lemma "0.016"
75798 75802 proof_check_time "0.001"
0 0 VernacProof "tac:no using:yes"
77638 77642 proof_build_time "0.011"
0 0 xapp_simpl_lemma "0.011"
77638 77642 proof_check_time "0.001"
0 0 VernacProof "tac:no using:yes"
89312 89316 proof_build_time "0.009"
0 0 hor_sym "0.009"
89312 89316 proof_check_time "0.000"
0 0 VernacProof "tac:no using:yes"
89422 89426 proof_build_time "0.000"
0 0 himpl_hor_r_l "0.000"
89422 89426 proof_check_time "0.000"
0 0 VernacProof "tac:no using:yes"
89533 89537 proof_build_time "0.000"
0 0 himpl_hor_r_r "0.000"
89533 89537 proof_check_time "0.000"
0 0 VernacProof "tac:no using:yes"
89712 89716 proof_build_time "0.007"
0 0 himpl_hor_l "0.007"
89712 89716 proof_check_time "0.000"
0 0 VernacProof "tac:no using:yes"
89908 89912 proof_build_time "0.002"
0 0 triple_hor "0.002"
89908 89912 proof_check_time "0.000"
0 0 VernacProof "tac:no using:yes"
90426 90430 proof_build_time "0.009"
0 0 hand_sym "0.009"
90426 90430 proof_check_time "0.000"
0 0 VernacProof "tac:no using:yes"
90555 90559 proof_build_time "0.001"
0 0 himpl_hand_l_r "0.001"
90555 90559 proof_check_time "0.000"
0 0 VernacProof "tac:no using:yes"
90685 90689 proof_build_time "0.001"
0 0 himpl_hand_l_l "0.001"
90685 90689 proof_check_time "0.000"
0 0 VernacProof "tac:no using:yes"
90866 90870 proof_build_time "0.008"
0 0 himpl_hand_r "0.008"
90866 90870 proof_check_time "0.000"
0 0 VernacProof "tac:no using:yes"
91024 91028 proof_build_time "0.002"
0 0 triple_hand_l "0.002"
91024 91028 proof_check_time "0.000"
0 0 VernacProof "tac:no using:yes"
91183 91187 proof_build_time "0.001"
0 0 triple_hand_r "0.001"
91183 91187 proof_check_time "0.000"
0 0 VernacProof "tac:no using:yes"
94033 94037 proof_build_time "0.014"
0 0 eval_like_app_fun2 "0.014"
94033 94037 proof_check_time "0.001"
0 0 VernacProof "tac:no using:yes"
94436 94440 proof_build_time "0.027"
0 0 eval_like_app_fix2 "0.027"
94436 94440 proof_check_time "0.002"
0 0 VernacProof "tac:no using:yes"
94881 94885 proof_build_time "0.027"
0 0 eval_like_app_fun3 "0.027"
94881 94885 proof_check_time "0.002"
0 0 VernacProof "tac:no using:yes"
95370 95374 proof_build_time "0.038"
0 0 eval_like_app_fix3 "0.038"
95370 95374 proof_check_time "0.005"
0 0 VernacProof "tac:no using:yes"
95824 95828 proof_build_time "0.002"
0 0 wp_app_fun2 "0.002"
95824 95828 proof_check_time "0.000"
0 0 VernacProof "tac:no using:yes"
96102 96106 proof_build_time "0.002"
0 0 wp_app_fix2 "0.002"
96102 96106 proof_check_time "0.001"
0 0 VernacProof "tac:no using:yes"
96412 96416 proof_build_time "0.002"
0 0 wp_app_fun3 "0.002"
96412 96416 proof_check_time "0.001"
0 0 VernacProof "tac:no using:yes"
96761 96765 proof_build_time "0.002"
0 0 wp_app_fix3 "0.002"
96761 96765 proof_check_time "0.001"
0 0 VernacProof "tac:no using:yes"
97483 97487 proof_build_time "0.037"
0 0 xwp_lemma_fun2 "0.037"
97483 97487 proof_check_time "0.006"
0 0 VernacProof "tac:no using:yes"
97998 98002 proof_build_time "0.045"
0 0 xwp_lemma_fix2 "0.045"
97998 98002 proof_check_time "0.009"
0 0 VernacProof "tac:no using:yes"
98558 98562 proof_build_time "0.050"
0 0 xwp_lemma_fun3 "0.050"
98558 98562 proof_check_time "0.011"
0 0 VernacProof "tac:no using:yes"
99199 99203 proof_build_time "0.058"
0 0 xwp_lemma_fix3 "0.058"
99199 99203 proof_check_time "0.014"
0 0 VernacProof "tac:no using:yes"
100324 100328 proof_build_time "0.005"
0 0 triple_app_fun2 "0.005"
100324 100328 proof_check_time "0.001"
0 0 VernacProof "tac:no using:yes"
100623 100627 proof_build_time "0.003"
0 0 triple_app_fix2 "0.003"
100623 100627 proof_check_time "0.001"
0 0 VernacProof "tac:no using:yes"
110467 110471 proof_build_time "0.057"
0 0 triple_incr "0.057"
110467 110471 proof_check_time "0.006"
0 0 VernacProof "tac:no using:yes"
111058 111062 proof_build_time "0.055"
0 0 triple_incr' "0.055"
111058 111062 proof_check_time "0.006"
0 0 VernacProof "tac:no using:yes"
111596 111600 proof_build_time "0.053"
0 0 triple_decr "0.053"
111596 111600 proof_check_time "0.006"
0 0 VernacProof "tac:no using:yes"
112172 112176 proof_build_time "0.074"
0 0 triple_mysucc "0.074"
112172 112176 proof_check_time "0.009"
0 0 VernacProof "tac:no using:yes"
112919 112923 proof_build_time "0.120"
0 0 triple_myrec "0.120"
112919 112923 proof_check_time "0.019"
0 0 VernacProof "tac:no using:yes"
113642 113646 proof_build_time "0.060"
0 0 triple_myfun "0.060"
113642 113646 proof_check_time "0.006"
0 0 vo_compile_time "4.573"
