[
  {
    "name": "CollectionOrder",
    "policy": "OR('ArtistMSP.member', 'GalleryMSP.member')",
    "requiredPeerCount": 1,
    "maxPeerCount": 1,
    "blockToLive": 1000000,
    "memberOnlyRead": true
  }
]
