(module PinHeader_1x03_P2.54mm_Vertical_SMD_Pin1Right_low_leakage (layer F.Cu) (tedit 5E82DFB5)
  (descr "surface-mounted straight pin header, 1x03, 2.54mm pitch, single row, style 2 (pin 1 right)")
  (tags "Surface mounted pin header SMD 1x03 2.54mm single row style2 pin1 right")
  (attr smd)
  (fp_text reference REF** (at 0 -4.87) (layer F.SilkS)
    (effects (font (size 1 1) (thickness 0.15)))
  )
  (fp_text value PinHeader_1x03_P2.54mm_Vertical_SMD_Pin1Right (at 0 4.87) (layer F.Fab)
    (effects (font (size 1 1) (thickness 0.15)))
  )
  (fp_text user %R (at 0 0 90) (layer F.Fab)
    (effects (font (size 1 1) (thickness 0.15)))
  )
  (fp_line (start 2.54 2.86) (end 1.27 2.86) (layer F.Fab) (width 0.1))
  (fp_line (start 2.54 2.22) (end 2.54 2.86) (layer F.Fab) (width 0.1))
  (fp_line (start 1.27 2.22) (end 2.54 2.22) (layer F.Fab) (width 0.1))
  (fp_line (start 2.54 -2.22) (end 1.27 -2.22) (layer F.Fab) (width 0.1))
  (fp_line (start 2.54 -2.86) (end 2.54 -2.22) (layer F.Fab) (width 0.1))
  (fp_line (start 1.27 -2.86) (end 2.54 -2.86) (layer F.Fab) (width 0.1))
  (fp_line (start -2.54 0.32) (end -1.27 0.32) (layer F.Fab) (width 0.1))
  (fp_line (start -2.54 -0.32) (end -2.54 0.32) (layer F.Fab) (width 0.1))
  (fp_line (start -1.27 -0.32) (end -2.54 -0.32) (layer F.Fab) (width 0.1))
  (fp_line (start -1.27 -3.81) (end -1.27 3.81) (layer F.Fab) (width 0.1))
  (fp_line (start 1.27 -2.86) (end 0.32 -3.81) (layer F.Fab) (width 0.1))
  (fp_line (start 1.27 3.81) (end 1.27 -2.86) (layer F.Fab) (width 0.1))
  (fp_line (start -1.27 -3.81) (end 0.32 -3.81) (layer F.Fab) (width 0.1))
  (fp_line (start 1.27 3.81) (end -1.27 3.81) (layer F.Fab) (width 0.1))
  (pad 3 smd rect (at 1.655 2.54) (size 2.51 1) (layers F.Cu F.Paste F.Mask))
  (pad 1 smd rect (at 1.655 -2.54) (size 2.51 1) (layers F.Cu F.Paste F.Mask))
  (pad 2 smd rect (at -1.655 0) (size 2.51 1) (layers F.Cu F.Paste F.Mask))
  (model ${KISYS3DMOD}/Connector_PinHeader_2.54mm.3dshapes/PinHeader_1x03_P2.54mm_Vertical_SMD_Pin1Right.wrl
    (at (xyz 0 0 0))
    (scale (xyz 1 1 1))
    (rotate (xyz 0 0 0))
  )
)
