EESchema Schematic File Version 4
EELAYER 30 0
EELAYER END
$Descr USLetter 11000 8500
encoding utf-8
Sheet 1 1
Title "4pstat"
Date ""
Rev "REV-B"
Comp "PVOS"
Comment1 ""
Comment2 ""
Comment3 ""
Comment4 ""
$EndDescr
Text Notes 7800 7150 0    197  ~ 0
EC-4P v_0.4
Text Notes 1275 3100 0    118  ~ 0
Probe Connectors
Wire Wire Line
	2850 3800 3300 3800
Wire Wire Line
	3300 3900 3300 3800
Connection ~ 3150 4100
Wire Wire Line
	3150 4000 3300 4000
Wire Wire Line
	3150 4100 3150 4000
Wire Wire Line
	3150 4200 3150 4100
Wire Wire Line
	3300 4200 3150 4200
Connection ~ 3150 4450
Wire Wire Line
	3150 4300 3300 4300
Wire Wire Line
	3150 4300 3150 4450
$Comp
L Connector:Conn_01x02_Female J19
U 1 1 5F83BD27
P 3500 4200
F 0 "J19" H 3528 4130 50  0000 L CNN
F 1 "Conn_01x02_Female" H 3528 4085 50  0001 L CNN
F 2 "Connector_PinSocket_2.54mm:PinSocket_1x02_P2.54mm_Vertical" H 3500 4200 50  0001 C CNN
F 3 "~" H 3500 4200 50  0001 C CNN
	1    3500 4200
	1    0    0    -1  
$EndComp
$Comp
L Connector:Conn_01x02_Female J18
U 1 1 5FEB9F86
P 3500 3900
F 0 "J18" H 3600 3800 50  0000 C CNN
F 1 "Conn_01x02_Female" H 3975 3925 50  0001 C CNN
F 2 "Connector_PinSocket_2.54mm:PinSocket_1x02_P2.54mm_Vertical" H 3500 3900 50  0001 C CNN
F 3 "~" H 3500 3900 50  0001 C CNN
	1    3500 3900
	1    0    0    -1  
$EndComp
Connection ~ 2850 4100
Wire Wire Line
	2850 4100 3150 4100
$Comp
L power:GND #PWR0103
U 1 1 5F7E2914
P 3150 4450
F 0 "#PWR0103" H 3150 4200 50  0001 C CNN
F 1 "GND" H 3155 4277 50  0000 C CNN
F 2 "" H 3150 4450 50  0001 C CNN
F 3 "" H 3150 4450 50  0001 C CNN
	1    3150 4450
	1    0    0    -1  
$EndComp
Connection ~ 2850 4450
Wire Wire Line
	2850 4450 2850 4400
Wire Wire Line
	3150 4450 2850 4450
Connection ~ 2850 3800
$Comp
L Device:C C8
U 1 1 5FE6255A
P 2850 4250
F 0 "C8" H 2965 4296 50  0000 L CNN
F 1 "C" H 2965 4205 50  0000 L CNN
F 2 "Capacitor_SMD:C_0805_2012Metric" H 2888 4100 50  0001 C CNN
F 3 "~" H 2850 4250 50  0001 C CNN
	1    2850 4250
	1    0    0    -1  
$EndComp
$Comp
L Device:R R9
U 1 1 5FE62554
P 2850 3950
F 0 "R9" H 2920 3996 50  0000 L CNN
F 1 "R" H 2920 3905 50  0000 L CNN
F 2 "Resistor_SMD:R_0805_2012Metric" V 2780 3950 50  0001 C CNN
F 3 "~" H 2850 3950 50  0001 C CNN
	1    2850 3950
	1    0    0    -1  
$EndComp
Wire Wire Line
	1750 3800 1725 3800
Connection ~ 1750 3800
Wire Wire Line
	1125 4050 1125 3900
Wire Wire Line
	1750 4050 1125 4050
Wire Wire Line
	1750 3800 1750 4050
Wire Wire Line
	1825 3800 1750 3800
Wire Wire Line
	1125 3550 1125 3700
Wire Wire Line
	2125 3825 2125 3800
Wire Wire Line
	1125 3550 1025 3550
Wire Wire Line
	1750 3800 1750 3625
Wire Wire Line
	1675 3625 1750 3625
Text GLabel 1675 3625 0    59   Output ~ 0
PT1
Text GLabel 1025 3550 0    118  Input ~ 0
P1
$Comp
L Device:R R4
U 1 1 5E526760
P 1975 3800
F 0 "R4" V 1875 3800 50  0000 C CNN
F 1 "50" V 1975 3800 50  0000 C CNN
F 2 "Resistor_SMD:R_0603_1608Metric" V 1905 3800 50  0001 C CNN
F 3 "~" H 1975 3800 50  0001 C CNN
	1    1975 3800
	0    -1   1    0   
$EndComp
$Comp
L Jumper:Jumper_3_Bridged12 JP2
U 1 1 5E52675A
P 2125 4075
F 0 "JP2" V 2050 4150 50  0000 L CNN
F 1 "Jumper_3_Bridged12" V 2170 4142 50  0001 L CNN
F 2 "Jumper:SolderJumper-3_P1.3mm_Bridged2Bar12_Pad1.0x1.5mm" H 2125 4075 50  0001 C CNN
F 3 "~" H 2125 4075 50  0001 C CNN
	1    2125 4075
	0    -1   1    0   
$EndComp
$Comp
L dk_Coaxial-Connectors-RF:CONSMA001-SMD-G J1
U 1 1 5E3F6391
P 2275 3450
F 0 "J1" H 2275 3575 60  0000 C CNN
F 1 "CONSMA001-SMD-G" H 1725 3450 60  0001 C CNN
F 2 "digikey-footprints:RF_SMA_Receptical_Vertical_CONSMA001-SMD-G" H 2475 3650 60  0001 L CNN
F 3 "https://linxtechnologies.com/wp/wp-content/uploads/consma001-smd-g.pdf" H 2475 3750 60  0001 L CNN
F 4 "CONSMA001-SMD-G-ND" H 2475 3850 60  0001 L CNN "Digi-Key_PN"
F 5 "CONSMA001-SMD-G" H 2475 3950 60  0001 L CNN "MPN"
F 6 "Connectors, Interconnects" H 2475 4050 60  0001 L CNN "Category"
F 7 "Coaxial Connectors (RF)" H 2475 4150 60  0001 L CNN "Family"
F 8 "https://linxtechnologies.com/wp/wp-content/uploads/consma001-smd-g.pdf" H 2475 4250 60  0001 L CNN "DK_Datasheet_Link"
F 9 "/product-detail/en/linx-technologies-inc/CONSMA001-SMD-G/CONSMA001-SMD-G-ND/4496569" H 2475 4350 60  0001 L CNN "DK_Detail_Page"
F 10 "CONN SMA RCPT STR 50 OHM SMD" H 2475 4450 60  0001 L CNN "Description"
F 11 "Linx Technologies Inc." H 2475 4550 60  0001 L CNN "Manufacturer"
F 12 "Active" H 2475 4650 60  0001 L CNN "Status"
	1    2275 3450
	-1   0    0    -1  
$EndComp
$Comp
L Connector:Conn_01x02_Female J24
U 1 1 5F9AE0EE
P 2525 4250
F 0 "J24" H 2553 4180 50  0000 L CNN
F 1 "Conn_01x02_Female" H 2417 4016 50  0001 C CNN
F 2 "Connector_PinSocket_2.54mm:PinSocket_1x02_P2.54mm_Vertical" H 2525 4250 50  0001 C CNN
F 3 "~" H 2525 4250 50  0001 C CNN
	1    2525 4250
	1    0    0    -1  
$EndComp
Wire Notes Line
	6500 1450 7150 1450
Wire Notes Line
	6500 6425 6500 1450
Wire Notes Line
	7150 6425 6500 6425
Wire Notes Line
	7150 1450 7150 6425
Wire Wire Line
	7975 4125 7025 4125
Wire Wire Line
	7650 2850 7650 2075
Connection ~ 7650 2850
Wire Wire Line
	7000 2850 7650 2850
Wire Wire Line
	7650 2075 8075 2075
Wire Wire Line
	7650 3725 7650 2850
$Comp
L ina2331:INA2331 U6
U 2 1 5E8B36AD
P 8225 3925
F 0 "U6" H 8725 4175 50  0000 L CNN
F 1 "INA2331" H 8875 3725 50  0000 L CNN
F 2 "Package_SO:TSSOP-14_4.4x5mm_P0.65mm" H 8225 3925 50  0001 C CNN
F 3 "" H 8225 3925 50  0001 C CNN
	2    8225 3925
	1    0    0    -1  
$EndComp
Wire Wire Line
	7975 3725 7650 3725
Text Notes 6550 1300 0    118  ~ 0
Probes
Connection ~ 8675 4825
Wire Wire Line
	8675 4675 8675 4825
Wire Wire Line
	8575 4675 8675 4675
Connection ~ 8375 4825
Wire Wire Line
	8375 4675 8375 4825
Wire Wire Line
	8475 4675 8375 4675
Wire Wire Line
	8675 4825 8675 5200
Wire Wire Line
	8675 5200 8825 5200
Wire Wire Line
	8375 5200 8100 5200
Connection ~ 8375 5200
Wire Wire Line
	8375 5200 8375 4825
Wire Wire Line
	8675 5200 8675 5375
Connection ~ 8675 5200
Wire Wire Line
	8575 5200 8675 5200
Wire Wire Line
	8375 5200 8475 5200
Wire Wire Line
	8375 5375 8375 5200
$Comp
L Device:C C9
U 1 1 5E561971
P 8525 5375
F 0 "C9" V 8575 5250 50  0000 C CNN
F 1 "0p4" V 8575 5500 50  0000 C CNN
F 2 "Capacitor_SMD:C_0805_2012Metric" H 8563 5225 50  0001 C CNN
F 3 "~" H 8525 5375 50  0001 C CNN
	1    8525 5375
	0    1    1    0   
$EndComp
$Comp
L Connector:Conn_01x02_Female J9
U 1 1 5FAB2964
P 8475 4475
F 0 "J9" V 8413 4287 50  0000 R CNN
F 1 "Conn_01x02_Female" V 8325 4275 50  0000 R CNN
F 2 "Connector_PinSocket_2.54mm:PinSocket_1x02_P2.54mm_Vertical" H 8475 4475 50  0001 C CNN
F 3 "~" H 8475 4475 50  0001 C CNN
	1    8475 4475
	0    -1   -1   0   
$EndComp
$Comp
L Device:R R14
U 1 1 5E55C896
P 8525 4825
F 0 "R14" V 8625 4825 50  0000 C CNN
F 1 "10M" V 8525 4850 50  0000 C CNN
F 2 "Resistor_SMD:R_0805_2012Metric" V 8455 4825 50  0001 C CNN
F 3 "~" H 8525 4825 50  0001 C CNN
	1    8525 4825
	0    1    1    0   
$EndComp
$Comp
L Connector:Conn_01x02_Female J10
U 1 1 5FADFD55
P 8475 5000
F 0 "J10" V 8413 4812 50  0000 R CNN
F 1 "Conn_01x02_Female" V 8325 4800 50  0000 R CNN
F 2 "Connector_PinSocket_2.54mm:PinSocket_1x02_P2.54mm_Vertical" H 8475 5000 50  0001 C CNN
F 3 "~" H 8475 5000 50  0001 C CNN
	1    8475 5000
	0    -1   -1   0   
$EndComp
Connection ~ 9175 1875
Wire Wire Line
	9175 1875 9375 1875
Connection ~ 9075 3925
Wire Wire Line
	9075 3925 8975 3925
Wire Wire Line
	8425 4325 8675 4325
Wire Wire Line
	8425 4275 8425 4325
Wire Wire Line
	8525 2325 8725 2325
Wire Wire Line
	8525 2225 8525 2325
Wire Wire Line
	8475 3175 8625 3175
Connection ~ 8475 3175
Wire Wire Line
	8475 3175 8475 3625
Wire Wire Line
	8475 3625 8525 3625
Wire Wire Line
	8325 3175 8475 3175
Wire Wire Line
	8575 1175 8725 1175
Connection ~ 8575 1175
Wire Wire Line
	8625 1375 8625 1575
Wire Wire Line
	8575 1375 8625 1375
Wire Wire Line
	8575 1175 8575 1375
Wire Wire Line
	8425 1175 8575 1175
Wire Wire Line
	9075 1875 9175 1875
$Comp
L ina2331:INA2331 U6
U 1 1 5E811ECB
P 8375 1875
F 0 "U6" H 8725 2125 50  0000 L CNN
F 1 "INA2331" H 8875 1625 50  0000 L CNN
F 2 "Package_SO:TSSOP-14_4.4x5mm_P0.65mm" H 8375 1875 50  0001 C CNN
F 3 "" H 8375 1875 50  0001 C CNN
	1    8375 1875
	1    0    0    -1  
$EndComp
Text Notes 10050 6000 2    118  ~ 0
Current\nSense
Wire Wire Line
	8100 6275 8175 6275
$Comp
L opa381:OPA381 U3
U 1 1 5E53CCEE
P 8475 6175
F 0 "U3" H 8675 5950 50  0000 L CNN
F 1 "OPA381" H 8575 6025 50  0000 L CNN
F 2 "Package_SO:MSOP-8_3x3mm_P0.65mm" H 8475 6175 50  0001 L CNN
F 3 "http://www.ti.com/product/OPA381" H 8475 6175 50  0001 C CNN
	1    8475 6175
	1    0    0    -1  
$EndComp
$Comp
L power:GND #PWR023
U 1 1 5E505A76
P 8375 6475
F 0 "#PWR023" H 8375 6225 50  0001 C CNN
F 1 "GND" H 8380 6302 50  0000 C CNN
F 2 "" H 8375 6475 50  0001 C CNN
F 3 "" H 8375 6475 50  0001 C CNN
	1    8375 6475
	1    0    0    -1  
$EndComp
$Comp
L power:GNDREF #PWR021
U 1 1 5E57EBC8
P 8100 6275
F 0 "#PWR021" H 8100 6025 50  0001 C CNN
F 1 "GNDREF" H 8105 6102 50  0000 C CNN
F 2 "" H 8100 6275 50  0001 C CNN
F 3 "" H 8100 6275 50  0001 C CNN
	1    8100 6275
	1    0    0    -1  
$EndComp
Wire Wire Line
	7925 1875 8075 1875
Wire Wire Line
	8125 1175 7925 1175
Wire Wire Line
	7925 1175 7925 1875
Wire Wire Line
	9025 1175 9175 1175
Wire Wire Line
	9175 1175 9175 1875
Wire Wire Line
	8125 1175 8125 925 
Wire Wire Line
	8125 925  8225 925 
Connection ~ 8125 1175
Wire Wire Line
	8325 925  8425 925 
Wire Wire Line
	8425 925  8425 1175
Connection ~ 8425 1175
Wire Wire Line
	8725 1175 8725 925 
Wire Wire Line
	8725 925  8825 925 
Connection ~ 8725 1175
Wire Wire Line
	8925 925  9025 925 
Wire Wire Line
	9025 925  9025 1175
Connection ~ 9025 1175
Wire Wire Line
	8025 3175 7825 3175
Wire Wire Line
	8925 3175 9075 3175
Wire Wire Line
	8025 3175 8025 2925
Wire Wire Line
	8025 2925 8125 2925
Connection ~ 8025 3175
Wire Wire Line
	8225 2925 8325 2925
Wire Wire Line
	8325 2925 8325 3175
Connection ~ 8325 3175
Wire Wire Line
	8625 3175 8625 2925
Wire Wire Line
	8625 2925 8725 2925
Connection ~ 8625 3175
Wire Wire Line
	8825 2925 8925 2925
Wire Wire Line
	8925 2925 8925 3175
Connection ~ 8925 3175
Wire Wire Line
	7825 3925 7975 3925
Wire Wire Line
	7825 3175 7825 3925
Wire Wire Line
	9075 3175 9075 3925
Wire Wire Line
	9075 3925 9225 3925
Wire Wire Line
	7825 3925 7675 3925
Connection ~ 7825 3925
Wire Wire Line
	7925 1875 7825 1875
Connection ~ 7925 1875
Text Notes 9450 3650 0    118  ~ 0
Voltage\nSense 2::3
$Comp
L power:GNDREF #PWR032
U 1 1 5EA34088
P 7825 1875
F 0 "#PWR032" H 7825 1625 50  0001 C CNN
F 1 "GNDREF" H 7600 1825 50  0000 C CNN
F 2 "" H 7825 1875 50  0001 C CNN
F 3 "" H 7825 1875 50  0001 C CNN
	1    7825 1875
	1    0    0    -1  
$EndComp
$Comp
L power:GNDREF #PWR031
U 1 1 5EA1FD37
P 7675 3925
F 0 "#PWR031" H 7675 3675 50  0001 C CNN
F 1 "GNDREF" H 7450 3875 50  0000 C CNN
F 2 "" H 7675 3925 50  0001 C CNN
F 3 "" H 7675 3925 50  0001 C CNN
	1    7675 3925
	1    0    0    -1  
$EndComp
$Comp
L power:VCC #PWR034
U 1 1 5E9D2661
P 8675 4325
F 0 "#PWR034" H 8675 4175 50  0001 C CNN
F 1 "VCC" H 8692 4498 50  0000 C CNN
F 2 "" H 8675 4325 50  0001 C CNN
F 3 "" H 8675 4325 50  0001 C CNN
	1    8675 4325
	1    0    0    -1  
$EndComp
$Comp
L power:VCC #PWR033
U 1 1 5E9D163F
P 8725 2325
F 0 "#PWR033" H 8725 2175 50  0001 C CNN
F 1 "VCC" H 8742 2498 50  0000 C CNN
F 2 "" H 8725 2325 50  0001 C CNN
F 3 "" H 8725 2325 50  0001 C CNN
	1    8725 2325
	1    0    0    -1  
$EndComp
$Comp
L Connector:Conn_01x02_Female J8
U 1 1 5E927034
P 8725 2725
F 0 "J8" V 8663 2537 50  0000 R CNN
F 1 "Conn_01x02_Female" V 8825 3025 50  0000 R CNN
F 2 "Connector_PinSocket_2.54mm:PinSocket_1x02_P2.54mm_Vertical" H 8725 2725 50  0001 C CNN
F 3 "~" H 8725 2725 50  0001 C CNN
	1    8725 2725
	0    -1   -1   0   
$EndComp
$Comp
L Device:R R18
U 1 1 5E927021
P 8175 3175
F 0 "R18" H 8225 3175 50  0000 L CNN
F 1 "RB1" V 8175 3125 50  0000 L CNN
F 2 "Resistor_SMD:R_0805_2012Metric" V 8105 3175 50  0001 C CNN
F 3 "~" H 8175 3175 50  0001 C CNN
	1    8175 3175
	0    1    1    0   
$EndComp
$Comp
L Connector:Conn_01x02_Female J6
U 1 1 5E92701B
P 8125 2725
F 0 "J6" V 8063 2537 50  0000 R CNN
F 1 "Conn_01x02_Female" V 8225 3025 50  0000 R CNN
F 2 "Connector_PinSocket_2.54mm:PinSocket_1x02_P2.54mm_Vertical" H 8125 2725 50  0001 C CNN
F 3 "~" H 8125 2725 50  0001 C CNN
	1    8125 2725
	0    -1   -1   0   
$EndComp
$Comp
L Device:R R20
U 1 1 5E927015
P 8775 3175
F 0 "R20" H 8825 3175 50  0000 L CNN
F 1 "RB2" V 8775 3125 50  0000 L CNN
F 2 "Resistor_SMD:R_0805_2012Metric" V 8705 3175 50  0001 C CNN
F 3 "~" H 8775 3175 50  0001 C CNN
	1    8775 3175
	0    1    1    0   
$EndComp
$Comp
L Connector:Conn_01x02_Female J7
U 1 1 5E8ED266
P 8825 725
F 0 "J7" V 8763 537 50  0000 R CNN
F 1 "Conn_01x02_Female" V 8925 1025 50  0000 R CNN
F 2 "Connector_PinSocket_2.54mm:PinSocket_1x02_P2.54mm_Vertical" H 8825 725 50  0001 C CNN
F 3 "~" H 8825 725 50  0001 C CNN
	1    8825 725 
	0    -1   -1   0   
$EndComp
$Comp
L Device:R R17
U 1 1 5E71E16A
P 8275 1175
F 0 "R17" H 8325 1175 50  0000 L CNN
F 1 "RA1" V 8275 1125 50  0000 L CNN
F 2 "Resistor_SMD:R_0805_2012Metric" V 8205 1175 50  0001 C CNN
F 3 "~" H 8275 1175 50  0001 C CNN
	1    8275 1175
	0    1    1    0   
$EndComp
$Comp
L Connector:Conn_01x02_Female J5
U 1 1 5E829EA1
P 8225 725
F 0 "J5" V 8163 537 50  0000 R CNN
F 1 "Conn_01x02_Female" V 8325 1025 50  0000 R CNN
F 2 "Connector_PinSocket_2.54mm:PinSocket_1x02_P2.54mm_Vertical" H 8225 725 50  0001 C CNN
F 3 "~" H 8225 725 50  0001 C CNN
	1    8225 725 
	0    -1   -1   0   
$EndComp
Text GLabel 9225 3925 2    118  Output ~ 0
V23
$Comp
L Device:R R19
U 1 1 5E701415
P 8875 1175
F 0 "R19" H 8925 1175 50  0000 L CNN
F 1 "RA2" V 8875 1125 50  0000 L CNN
F 2 "Resistor_SMD:R_0805_2012Metric" V 8805 1175 50  0001 C CNN
F 3 "~" H 8875 1175 50  0001 C CNN
	1    8875 1175
	0    1    1    0   
$EndComp
Text GLabel 7025 4125 0    118  Input ~ 0
P3
Text Notes 9375 1600 0    118  ~ 0
Voltage\nSense 1::2
Text GLabel 7000 6075 0    118  Input ~ 0
P4
Text GLabel 7000 2850 0    118  Input ~ 0
P2
Text GLabel 7000 1675 0    118  Input ~ 0
P1
$Comp
L Amplifier_Operational:LMC6484 U1
U 4 1 5E3E568A
P 1550 1175
F 0 "U1" H 1525 1175 50  0000 C CNN
F 1 "LMC6484" H 1700 1325 50  0000 C CNN
F 2 "Package_SO:SOIC-14_3.9x8.7mm_P1.27mm" H 1500 1275 50  0001 C CNN
F 3 "http://www.ti.com/lit/ds/symlink/lmc6484.pdf" H 1600 1375 50  0001 C CNN
	4    1550 1175
	1    0    0    -1  
$EndComp
$Comp
L power:VCC #PWR03
U 1 1 5E40A9ED
P 1000 775
F 0 "#PWR03" H 1000 625 50  0001 C CNN
F 1 "VCC" H 1017 948 50  0000 C CNN
F 2 "" H 1000 775 50  0001 C CNN
F 3 "" H 1000 775 50  0001 C CNN
	1    1000 775 
	1    0    0    -1  
$EndComp
$Comp
L power:GND #PWR04
U 1 1 5E410C21
P 1000 1375
F 0 "#PWR04" H 1000 1125 50  0001 C CNN
F 1 "GND" H 1005 1202 50  0000 C CNN
F 2 "" H 1000 1375 50  0001 C CNN
F 3 "" H 1000 1375 50  0001 C CNN
	1    1000 1375
	1    0    0    -1  
$EndComp
$Comp
L Device:R R1
U 1 1 5E41434E
P 1000 925
F 0 "R1" H 1070 971 50  0000 L CNN
F 1 "10k" H 1070 880 50  0000 L CNN
F 2 "Resistor_SMD:R_0603_1608Metric" V 930 925 50  0001 C CNN
F 3 "~" H 1000 925 50  0001 C CNN
	1    1000 925 
	1    0    0    -1  
$EndComp
$Comp
L Device:R R2
U 1 1 5E41486E
P 1000 1225
F 0 "R2" H 1070 1271 50  0000 L CNN
F 1 "10k" H 1070 1180 50  0000 L CNN
F 2 "Resistor_SMD:R_0603_1608Metric" V 930 1225 50  0001 C CNN
F 3 "~" H 1000 1225 50  0001 C CNN
	1    1000 1225
	1    0    0    -1  
$EndComp
$Comp
L power:GNDREF #PWR011
U 1 1 5E417AA6
P 3250 1175
F 0 "#PWR011" H 3250 925 50  0001 C CNN
F 1 "GNDREF" H 3450 1075 50  0000 C CNN
F 2 "" H 3250 1175 50  0001 C CNN
F 3 "" H 3250 1175 50  0001 C CNN
	1    3250 1175
	1    0    0    -1  
$EndComp
Text Notes 800  2325 0    118  ~ 0
Virtual Ground
$Comp
L Device:C C1
U 1 1 5E55D1B3
P 775 1225
F 0 "C1" H 550 1225 50  0000 L CNN
F 1 "0u1F" H 575 1325 50  0000 L CNN
F 2 "Capacitor_SMD:C_0805_2012Metric" H 813 1075 50  0001 C CNN
F 3 "~" H 775 1225 50  0001 C CNN
	1    775  1225
	1    0    0    -1  
$EndComp
$Comp
L power:GND #PWR01
U 1 1 5E571125
P 775 1375
F 0 "#PWR01" H 775 1125 50  0001 C CNN
F 1 "GND" H 780 1202 50  0000 C CNN
F 2 "" H 775 1375 50  0001 C CNN
F 3 "" H 775 1375 50  0001 C CNN
	1    775  1375
	1    0    0    -1  
$EndComp
Wire Wire Line
	775  1075 1000 1075
Wire Wire Line
	1250 1075 1000 1075
Connection ~ 1000 1075
$Comp
L Device:R R11
U 1 1 600A3194
P 2475 1600
F 0 "R11" H 2545 1646 50  0000 L CNN
F 1 "R" H 2545 1555 50  0000 L CNN
F 2 "Resistor_SMD:R_0805_2012Metric" V 2405 1600 50  0001 C CNN
F 3 "~" H 2475 1600 50  0001 C CNN
	1    2475 1600
	1    0    0    -1  
$EndComp
Wire Wire Line
	1850 1175 1850 1425
$Comp
L Device:C C7
U 1 1 600AE490
P 1850 1600
F 0 "C7" H 1965 1646 50  0000 L CNN
F 1 "C" H 1965 1555 50  0000 L CNN
F 2 "Capacitor_SMD:C_0805_2012Metric" H 1888 1450 50  0001 C CNN
F 3 "~" H 1850 1600 50  0001 C CNN
	1    1850 1600
	1    0    0    -1  
$EndComp
$Comp
L Device:R R8
U 1 1 600B0041
P 2150 1175
F 0 "R8" V 2250 1200 50  0000 C CNN
F 1 "R" V 2150 1175 50  0000 C CNN
F 2 "Resistor_SMD:R_0805_2012Metric" V 2080 1175 50  0001 C CNN
F 3 "~" H 2150 1175 50  0001 C CNN
	1    2150 1175
	0    1    1    0   
$EndComp
Connection ~ 1850 1175
$Comp
L Device:C C11
U 1 1 600C62EC
P 2900 1600
F 0 "C11" H 3015 1646 50  0000 L CNN
F 1 "C" H 3015 1555 50  0000 L CNN
F 2 "Capacitor_SMD:C_0805_2012Metric" H 2938 1450 50  0001 C CNN
F 3 "~" H 2900 1600 50  0001 C CNN
	1    2900 1600
	1    0    0    -1  
$EndComp
$Comp
L power:GND #PWR0102
U 1 1 600CDCA3
P 2400 2000
F 0 "#PWR0102" H 2400 1750 50  0001 C CNN
F 1 "GND" H 2405 1827 50  0000 C CNN
F 2 "" H 2400 2000 50  0001 C CNN
F 3 "" H 2400 2000 50  0001 C CNN
	1    2400 2000
	1    0    0    -1  
$EndComp
Wire Wire Line
	1250 1275 1250 2000
Wire Wire Line
	1850 1750 1850 1825
Wire Wire Line
	1250 2000 1850 2000
Connection ~ 1850 2000
Wire Wire Line
	2900 2000 2900 1800
Connection ~ 2400 2000
Wire Wire Line
	2900 1450 2900 1375
Connection ~ 2900 1175
Wire Wire Line
	2900 1175 3250 1175
Wire Wire Line
	2475 1450 2475 1375
Wire Wire Line
	2475 1175 2900 1175
Wire Wire Line
	2475 1750 2475 1825
Wire Wire Line
	2400 2000 2475 2000
Connection ~ 2475 2000
Wire Wire Line
	2475 2000 2900 2000
Wire Wire Line
	1850 2000 2400 2000
$Comp
L Connector:Conn_01x02_Female J11
U 1 1 5F8FB5BB
P 1450 1675
F 0 "J11" H 1550 1575 50  0000 C CNN
F 1 "Conn_01x02_Female" H 1925 1700 50  0001 C CNN
F 2 "Connector_PinSocket_2.54mm:PinSocket_1x02_P2.54mm_Vertical" H 1450 1675 50  0001 C CNN
F 3 "~" H 1450 1675 50  0001 C CNN
	1    1450 1675
	-1   0    0    1   
$EndComp
Wire Wire Line
	1850 1425 1650 1425
Wire Wire Line
	1650 1425 1650 1575
Connection ~ 1850 1425
Wire Wire Line
	1850 1425 1850 1450
Wire Wire Line
	1650 1825 1850 1825
Wire Wire Line
	1650 1675 1650 1825
Connection ~ 1850 1825
Wire Wire Line
	1850 1825 1850 2000
$Comp
L Connector:Conn_01x02_Female J13
U 1 1 5F90DE4E
P 2150 1675
F 0 "J13" H 2250 1575 50  0000 C CNN
F 1 "Conn_01x02_Female" H 2625 1700 50  0001 C CNN
F 2 "Connector_PinSocket_2.54mm:PinSocket_1x02_P2.54mm_Vertical" H 2150 1675 50  0001 C CNN
F 3 "~" H 2150 1675 50  0001 C CNN
	1    2150 1675
	-1   0    0    1   
$EndComp
Wire Wire Line
	2475 1375 2350 1375
Wire Wire Line
	2350 1375 2350 1575
Connection ~ 2475 1375
Wire Wire Line
	2475 1375 2475 1175
Wire Wire Line
	2350 1675 2350 1825
Wire Wire Line
	2350 1825 2475 1825
Connection ~ 2475 1825
Wire Wire Line
	2475 1825 2475 2000
$Comp
L Connector:Conn_01x02_Female J20
U 1 1 5F921980
P 3400 1550
F 0 "J20" H 3500 1450 50  0000 C CNN
F 1 "Conn_01x02_Female" H 3875 1575 50  0001 C CNN
F 2 "Connector_PinSocket_2.54mm:PinSocket_1x02_P2.54mm_Vertical" H 3400 1550 50  0001 C CNN
F 3 "~" H 3400 1550 50  0001 C CNN
	1    3400 1550
	1    0    0    -1  
$EndComp
Wire Wire Line
	2900 1375 3200 1375
Wire Wire Line
	3200 1375 3200 1550
Connection ~ 2900 1375
Wire Wire Line
	2900 1375 2900 1175
Wire Wire Line
	3200 1650 3200 1800
Wire Wire Line
	3200 1800 2900 1800
Connection ~ 2900 1800
Wire Wire Line
	2900 1800 2900 1750
Wire Wire Line
	2300 1175 2350 1175
Connection ~ 2475 1175
$Comp
L Connector:Conn_01x02_Female J12
U 1 1 5F94DEF9
P 2100 825
F 0 "J12" V 2175 750 50  0000 C CNN
F 1 "Conn_01x02_Female" H 2575 850 50  0001 C CNN
F 2 "Connector_PinSocket_2.54mm:PinSocket_1x02_P2.54mm_Vertical" H 2100 825 50  0001 C CNN
F 3 "~" H 2100 825 50  0001 C CNN
	1    2100 825 
	0    -1   -1   0   
$EndComp
Wire Wire Line
	1975 1175 1975 1025
Wire Wire Line
	1975 1025 2100 1025
Wire Wire Line
	1850 1175 1975 1175
Connection ~ 1975 1175
Wire Wire Line
	1975 1175 2000 1175
Wire Wire Line
	2200 1025 2350 1025
Wire Wire Line
	2350 1025 2350 1175
Connection ~ 2350 1175
Wire Wire Line
	2350 1175 2475 1175
$Comp
L Connector:Conn_01x02_Female J16
U 1 1 60036397
P 2650 3500
F 0 "J16" H 2678 3430 50  0000 L CNN
F 1 "Conn_01x02_Female" H 2542 3266 50  0001 C CNN
F 2 "Connector_PinSocket_2.54mm:PinSocket_1x02_P2.54mm_Vertical" H 2650 3500 50  0001 C CNN
F 3 "~" H 2650 3500 50  0001 C CNN
	1    2650 3500
	1    0    0    -1  
$EndComp
Wire Wire Line
	2125 4325 2125 4450
Wire Wire Line
	2125 4450 2325 4450
Wire Wire Line
	2325 4250 2325 4000
Wire Wire Line
	2325 4000 2275 4000
Connection ~ 2275 4000
Wire Wire Line
	2275 4000 2275 4075
Wire Wire Line
	2325 4350 2325 4450
Connection ~ 2325 4450
Wire Wire Line
	2325 4450 2850 4450
Wire Wire Line
	2125 3800 2850 3800
Connection ~ 2125 3800
$Comp
L Amplifier_Operational:LMC6484 U1
U 1 1 601BBEBF
P 1425 3800
F 0 "U1" H 1400 3800 50  0000 C CNN
F 1 "LMC6484" H 1550 3625 50  0000 C CNN
F 2 "Package_SO:SOIC-14_3.9x8.7mm_P1.27mm" H 1375 3900 50  0001 C CNN
F 3 "http://www.ti.com/lit/ds/symlink/lmc6484.pdf" H 1475 4000 50  0001 C CNN
	1    1425 3800
	1    0    0    -1  
$EndComp
Wire Wire Line
	2450 3500 2450 3250
Wire Wire Line
	2450 3250 2075 3250
Wire Wire Line
	2075 3250 2075 3450
Wire Wire Line
	2275 3650 2450 3650
Wire Wire Line
	2450 3650 2450 3600
Wire Wire Line
	2275 3650 2275 4000
Connection ~ 2275 3650
Wire Wire Line
	2075 3450 1125 3450
Wire Wire Line
	1125 3450 1125 3550
Connection ~ 2075 3450
Connection ~ 1125 3550
Wire Wire Line
	2850 5275 3300 5275
Wire Wire Line
	3300 5375 3300 5275
Connection ~ 3150 5575
Wire Wire Line
	3150 5475 3300 5475
Wire Wire Line
	3150 5575 3150 5475
Wire Wire Line
	3150 5675 3150 5575
Wire Wire Line
	3300 5675 3150 5675
Connection ~ 3150 5925
Wire Wire Line
	3150 5775 3300 5775
Wire Wire Line
	3150 5775 3150 5925
$Comp
L Connector:Conn_01x02_Female J25
U 1 1 605A022C
P 3500 5675
F 0 "J25" H 3528 5605 50  0000 L CNN
F 1 "Conn_01x02_Female" H 3528 5560 50  0001 L CNN
F 2 "Connector_PinSocket_2.54mm:PinSocket_1x02_P2.54mm_Vertical" H 3500 5675 50  0001 C CNN
F 3 "~" H 3500 5675 50  0001 C CNN
	1    3500 5675
	1    0    0    -1  
$EndComp
$Comp
L Connector:Conn_01x02_Female J22
U 1 1 605A0232
P 3500 5375
F 0 "J22" H 3600 5275 50  0000 C CNN
F 1 "Conn_01x02_Female" H 3975 5400 50  0001 C CNN
F 2 "Connector_PinSocket_2.54mm:PinSocket_1x02_P2.54mm_Vertical" H 3500 5375 50  0001 C CNN
F 3 "~" H 3500 5375 50  0001 C CNN
	1    3500 5375
	1    0    0    -1  
$EndComp
Connection ~ 2850 5575
Wire Wire Line
	2850 5575 3150 5575
$Comp
L power:GND #PWR0104
U 1 1 605A023A
P 3150 5925
F 0 "#PWR0104" H 3150 5675 50  0001 C CNN
F 1 "GND" H 3155 5752 50  0000 C CNN
F 2 "" H 3150 5925 50  0001 C CNN
F 3 "" H 3150 5925 50  0001 C CNN
	1    3150 5925
	1    0    0    -1  
$EndComp
Connection ~ 2850 5925
Wire Wire Line
	2850 5925 2850 5875
Wire Wire Line
	3150 5925 2850 5925
Connection ~ 2850 5275
$Comp
L Device:C C4
U 1 1 605A0244
P 2850 5725
F 0 "C4" H 2965 5771 50  0000 L CNN
F 1 "C" H 2965 5680 50  0000 L CNN
F 2 "Capacitor_SMD:C_0805_2012Metric" H 2888 5575 50  0001 C CNN
F 3 "~" H 2850 5725 50  0001 C CNN
	1    2850 5725
	1    0    0    -1  
$EndComp
$Comp
L Device:R R7
U 1 1 605A024A
P 2850 5425
F 0 "R7" H 2920 5471 50  0000 L CNN
F 1 "R" H 2920 5380 50  0000 L CNN
F 2 "Resistor_SMD:R_0805_2012Metric" V 2780 5425 50  0001 C CNN
F 3 "~" H 2850 5425 50  0001 C CNN
	1    2850 5425
	1    0    0    -1  
$EndComp
Wire Wire Line
	1750 5275 1725 5275
Connection ~ 1750 5275
Wire Wire Line
	1125 5525 1125 5375
Wire Wire Line
	1750 5525 1125 5525
Wire Wire Line
	1750 5275 1750 5525
Wire Wire Line
	1825 5275 1750 5275
Wire Wire Line
	1125 5025 1125 5175
Wire Wire Line
	2125 5300 2125 5275
Wire Wire Line
	1125 5025 1025 5025
Wire Wire Line
	1750 5275 1750 5100
Wire Wire Line
	1675 5100 1750 5100
Text GLabel 1675 5100 0    59   Output ~ 0
PT1
Text GLabel 1025 5025 0    118  Input ~ 0
P2
$Comp
L Device:R R5
U 1 1 605A025D
P 1975 5275
F 0 "R5" V 1875 5275 50  0000 C CNN
F 1 "50" V 1975 5275 50  0000 C CNN
F 2 "Resistor_SMD:R_0603_1608Metric" V 1905 5275 50  0001 C CNN
F 3 "~" H 1975 5275 50  0001 C CNN
	1    1975 5275
	0    -1   1    0   
$EndComp
$Comp
L Jumper:Jumper_3_Bridged12 JP3
U 1 1 605A0263
P 2125 5550
F 0 "JP3" V 2050 5625 50  0000 L CNN
F 1 "Jumper_3_Bridged12" V 2170 5617 50  0001 L CNN
F 2 "Jumper:SolderJumper-3_P1.3mm_Bridged2Bar12_Pad1.0x1.5mm" H 2125 5550 50  0001 C CNN
F 3 "~" H 2125 5550 50  0001 C CNN
	1    2125 5550
	0    -1   1    0   
$EndComp
$Comp
L dk_Coaxial-Connectors-RF:CONSMA001-SMD-G J2
U 1 1 605A0272
P 2275 4925
F 0 "J2" H 2275 5050 60  0000 C CNN
F 1 "CONSMA001-SMD-G" H 1725 4925 60  0001 C CNN
F 2 "digikey-footprints:RF_SMA_Receptical_Vertical_CONSMA001-SMD-G" H 2475 5125 60  0001 L CNN
F 3 "https://linxtechnologies.com/wp/wp-content/uploads/consma001-smd-g.pdf" H 2475 5225 60  0001 L CNN
F 4 "CONSMA001-SMD-G-ND" H 2475 5325 60  0001 L CNN "Digi-Key_PN"
F 5 "CONSMA001-SMD-G" H 2475 5425 60  0001 L CNN "MPN"
F 6 "Connectors, Interconnects" H 2475 5525 60  0001 L CNN "Category"
F 7 "Coaxial Connectors (RF)" H 2475 5625 60  0001 L CNN "Family"
F 8 "https://linxtechnologies.com/wp/wp-content/uploads/consma001-smd-g.pdf" H 2475 5725 60  0001 L CNN "DK_Datasheet_Link"
F 9 "/product-detail/en/linx-technologies-inc/CONSMA001-SMD-G/CONSMA001-SMD-G-ND/4496569" H 2475 5825 60  0001 L CNN "DK_Detail_Page"
F 10 "CONN SMA RCPT STR 50 OHM SMD" H 2475 5925 60  0001 L CNN "Description"
F 11 "Linx Technologies Inc." H 2475 6025 60  0001 L CNN "Manufacturer"
F 12 "Active" H 2475 6125 60  0001 L CNN "Status"
	1    2275 4925
	-1   0    0    -1  
$EndComp
$Comp
L Connector:Conn_01x02_Female J14
U 1 1 605A0278
P 2525 5725
F 0 "J14" H 2553 5655 50  0000 L CNN
F 1 "Conn_01x02_Female" H 2417 5491 50  0001 C CNN
F 2 "Connector_PinSocket_2.54mm:PinSocket_1x02_P2.54mm_Vertical" H 2525 5725 50  0001 C CNN
F 3 "~" H 2525 5725 50  0001 C CNN
	1    2525 5725
	1    0    0    -1  
$EndComp
$Comp
L Connector:Conn_01x02_Female J17
U 1 1 605A027E
P 2650 4975
F 0 "J17" H 2678 4905 50  0000 L CNN
F 1 "Conn_01x02_Female" H 2542 4741 50  0001 C CNN
F 2 "Connector_PinSocket_2.54mm:PinSocket_1x02_P2.54mm_Vertical" H 2650 4975 50  0001 C CNN
F 3 "~" H 2650 4975 50  0001 C CNN
	1    2650 4975
	1    0    0    -1  
$EndComp
Wire Wire Line
	2125 5800 2125 5925
Wire Wire Line
	2125 5925 2325 5925
Wire Wire Line
	2325 5725 2325 5475
Wire Wire Line
	2325 5475 2275 5475
Connection ~ 2275 5475
Wire Wire Line
	2275 5475 2275 5550
Wire Wire Line
	2325 5825 2325 5925
Connection ~ 2325 5925
Wire Wire Line
	2325 5925 2850 5925
Wire Wire Line
	2125 5275 2850 5275
Connection ~ 2125 5275
$Comp
L Amplifier_Operational:LMC6484 U1
U 2 1 605A028F
P 1425 5275
F 0 "U1" H 1400 5275 50  0000 C CNN
F 1 "LMC6484" H 1550 5100 50  0000 C CNN
F 2 "Package_SO:SOIC-14_3.9x8.7mm_P1.27mm" H 1375 5375 50  0001 C CNN
F 3 "http://www.ti.com/lit/ds/symlink/lmc6484.pdf" H 1475 5475 50  0001 C CNN
	2    1425 5275
	1    0    0    -1  
$EndComp
Wire Wire Line
	2450 4975 2450 4725
Wire Wire Line
	2450 4725 2075 4725
Wire Wire Line
	2075 4725 2075 4925
Wire Wire Line
	2275 5125 2450 5125
Wire Wire Line
	2450 5125 2450 5075
Wire Wire Line
	2275 5125 2275 5475
Connection ~ 2275 5125
Wire Wire Line
	2075 4925 1125 4925
Wire Wire Line
	1125 4925 1125 5025
Connection ~ 2075 4925
Connection ~ 1125 5025
Wire Wire Line
	2875 6850 3325 6850
Wire Wire Line
	3325 6950 3325 6850
Connection ~ 3175 7150
Wire Wire Line
	3175 7050 3325 7050
Wire Wire Line
	3175 7150 3175 7050
Wire Wire Line
	3175 7250 3175 7150
Wire Wire Line
	3325 7250 3175 7250
Connection ~ 3175 7500
Wire Wire Line
	3175 7350 3325 7350
Wire Wire Line
	3175 7350 3175 7500
$Comp
L Connector:Conn_01x02_Female J27
U 1 1 605B3611
P 3525 7250
F 0 "J27" H 3553 7180 50  0000 L CNN
F 1 "Conn_01x02_Female" H 3553 7135 50  0001 L CNN
F 2 "Connector_PinSocket_2.54mm:PinSocket_1x02_P2.54mm_Vertical" H 3525 7250 50  0001 C CNN
F 3 "~" H 3525 7250 50  0001 C CNN
	1    3525 7250
	1    0    0    -1  
$EndComp
$Comp
L Connector:Conn_01x02_Female J26
U 1 1 605B3617
P 3525 6950
F 0 "J26" H 3625 6850 50  0000 C CNN
F 1 "Conn_01x02_Female" H 4000 6975 50  0001 C CNN
F 2 "Connector_PinSocket_2.54mm:PinSocket_1x02_P2.54mm_Vertical" H 3525 6950 50  0001 C CNN
F 3 "~" H 3525 6950 50  0001 C CNN
	1    3525 6950
	1    0    0    -1  
$EndComp
Connection ~ 2875 7150
Wire Wire Line
	2875 7150 3175 7150
$Comp
L power:GND #PWR0106
U 1 1 605B361F
P 3175 7500
F 0 "#PWR0106" H 3175 7250 50  0001 C CNN
F 1 "GND" H 3180 7327 50  0000 C CNN
F 2 "" H 3175 7500 50  0001 C CNN
F 3 "" H 3175 7500 50  0001 C CNN
	1    3175 7500
	1    0    0    -1  
$EndComp
Connection ~ 2875 7500
Wire Wire Line
	2875 7500 2875 7450
Wire Wire Line
	3175 7500 2875 7500
Connection ~ 2875 6850
$Comp
L Device:C C5
U 1 1 605B3629
P 2875 7300
F 0 "C5" H 2990 7346 50  0000 L CNN
F 1 "C" H 2990 7255 50  0000 L CNN
F 2 "Capacitor_SMD:C_0805_2012Metric" H 2913 7150 50  0001 C CNN
F 3 "~" H 2875 7300 50  0001 C CNN
	1    2875 7300
	1    0    0    -1  
$EndComp
$Comp
L Device:R R10
U 1 1 605B362F
P 2875 7000
F 0 "R10" H 2945 7046 50  0000 L CNN
F 1 "R" H 2945 6955 50  0000 L CNN
F 2 "Resistor_SMD:R_0805_2012Metric" V 2805 7000 50  0001 C CNN
F 3 "~" H 2875 7000 50  0001 C CNN
	1    2875 7000
	1    0    0    -1  
$EndComp
Wire Wire Line
	1775 6850 1750 6850
Connection ~ 1775 6850
Wire Wire Line
	1150 7100 1150 6950
Wire Wire Line
	1775 7100 1150 7100
Wire Wire Line
	1775 6850 1775 7100
Wire Wire Line
	1850 6850 1775 6850
Wire Wire Line
	1150 6600 1150 6750
Wire Wire Line
	2150 6875 2150 6850
Wire Wire Line
	1150 6600 1050 6600
Wire Wire Line
	1775 6850 1775 6675
Wire Wire Line
	1700 6675 1775 6675
Text GLabel 1700 6675 0    59   Output ~ 0
PT1
Text GLabel 1050 6600 0    118  Input ~ 0
P3
$Comp
L Device:R R6
U 1 1 605B3642
P 2000 6850
F 0 "R6" V 1900 6850 50  0000 C CNN
F 1 "50" V 2000 6850 50  0000 C CNN
F 2 "Resistor_SMD:R_0603_1608Metric" V 1930 6850 50  0001 C CNN
F 3 "~" H 2000 6850 50  0001 C CNN
	1    2000 6850
	0    -1   1    0   
$EndComp
$Comp
L Jumper:Jumper_3_Bridged12 JP4
U 1 1 605B3648
P 2150 7125
F 0 "JP4" V 2075 7200 50  0000 L CNN
F 1 "Jumper_3_Bridged12" V 2195 7192 50  0001 L CNN
F 2 "Jumper:SolderJumper-3_P1.3mm_Bridged2Bar12_Pad1.0x1.5mm" H 2150 7125 50  0001 C CNN
F 3 "~" H 2150 7125 50  0001 C CNN
	1    2150 7125
	0    -1   1    0   
$EndComp
$Comp
L dk_Coaxial-Connectors-RF:CONSMA001-SMD-G J3
U 1 1 605B3657
P 2300 6500
F 0 "J3" H 2300 6625 60  0000 C CNN
F 1 "CONSMA001-SMD-G" H 1750 6500 60  0001 C CNN
F 2 "digikey-footprints:RF_SMA_Receptical_Vertical_CONSMA001-SMD-G" H 2500 6700 60  0001 L CNN
F 3 "https://linxtechnologies.com/wp/wp-content/uploads/consma001-smd-g.pdf" H 2500 6800 60  0001 L CNN
F 4 "CONSMA001-SMD-G-ND" H 2500 6900 60  0001 L CNN "Digi-Key_PN"
F 5 "CONSMA001-SMD-G" H 2500 7000 60  0001 L CNN "MPN"
F 6 "Connectors, Interconnects" H 2500 7100 60  0001 L CNN "Category"
F 7 "Coaxial Connectors (RF)" H 2500 7200 60  0001 L CNN "Family"
F 8 "https://linxtechnologies.com/wp/wp-content/uploads/consma001-smd-g.pdf" H 2500 7300 60  0001 L CNN "DK_Datasheet_Link"
F 9 "/product-detail/en/linx-technologies-inc/CONSMA001-SMD-G/CONSMA001-SMD-G-ND/4496569" H 2500 7400 60  0001 L CNN "DK_Detail_Page"
F 10 "CONN SMA RCPT STR 50 OHM SMD" H 2500 7500 60  0001 L CNN "Description"
F 11 "Linx Technologies Inc." H 2500 7600 60  0001 L CNN "Manufacturer"
F 12 "Active" H 2500 7700 60  0001 L CNN "Status"
	1    2300 6500
	-1   0    0    -1  
$EndComp
$Comp
L Connector:Conn_01x02_Female J15
U 1 1 605B365D
P 2550 7300
F 0 "J15" H 2578 7230 50  0000 L CNN
F 1 "Conn_01x02_Female" H 2442 7066 50  0001 C CNN
F 2 "Connector_PinSocket_2.54mm:PinSocket_1x02_P2.54mm_Vertical" H 2550 7300 50  0001 C CNN
F 3 "~" H 2550 7300 50  0001 C CNN
	1    2550 7300
	1    0    0    -1  
$EndComp
$Comp
L Connector:Conn_01x02_Female J21
U 1 1 605B3663
P 2675 6550
F 0 "J21" H 2703 6480 50  0000 L CNN
F 1 "Conn_01x02_Female" H 2567 6316 50  0001 C CNN
F 2 "Connector_PinSocket_2.54mm:PinSocket_1x02_P2.54mm_Vertical" H 2675 6550 50  0001 C CNN
F 3 "~" H 2675 6550 50  0001 C CNN
	1    2675 6550
	1    0    0    -1  
$EndComp
Wire Wire Line
	2150 7375 2150 7500
Wire Wire Line
	2150 7500 2350 7500
Wire Wire Line
	2350 7300 2350 7050
Wire Wire Line
	2350 7050 2300 7050
Connection ~ 2300 7050
Wire Wire Line
	2300 7050 2300 7125
Wire Wire Line
	2350 7400 2350 7500
Connection ~ 2350 7500
Wire Wire Line
	2350 7500 2875 7500
Wire Wire Line
	2150 6850 2875 6850
Connection ~ 2150 6850
$Comp
L Amplifier_Operational:LMC6484 U1
U 3 1 605B3674
P 1450 6850
F 0 "U1" H 1425 6850 50  0000 C CNN
F 1 "LMC6484" H 1575 6675 50  0000 C CNN
F 2 "Package_SO:SOIC-14_3.9x8.7mm_P1.27mm" H 1400 6950 50  0001 C CNN
F 3 "http://www.ti.com/lit/ds/symlink/lmc6484.pdf" H 1500 7050 50  0001 C CNN
	3    1450 6850
	1    0    0    -1  
$EndComp
Wire Wire Line
	2475 6550 2475 6300
Wire Wire Line
	2475 6300 2100 6300
Wire Wire Line
	2100 6300 2100 6500
Wire Wire Line
	2300 6700 2475 6700
Wire Wire Line
	2475 6700 2475 6650
Wire Wire Line
	2300 6700 2300 7050
Connection ~ 2300 6700
Wire Wire Line
	2100 6500 1150 6500
Wire Wire Line
	1150 6500 1150 6600
Connection ~ 2100 6500
Connection ~ 1150 6600
Text GLabel 9375 1875 2    118  Output ~ 0
V12
Text GLabel 9125 6175 2    118  Output ~ 0
TIA
Wire Wire Line
	7000 6075 8100 6075
Wire Wire Line
	8775 6175 8825 6175
Wire Wire Line
	8100 5200 8100 6075
Connection ~ 8100 6075
Wire Wire Line
	8100 6075 8175 6075
Wire Wire Line
	8825 5200 8825 6175
Connection ~ 8825 6175
Wire Wire Line
	8825 6175 9125 6175
$Comp
L power:VCC #PWR022
U 1 1 5E514EDB
P 8375 5650
F 0 "#PWR022" H 8375 5500 50  0001 C CNN
F 1 "VCC" H 8650 5700 50  0000 C CNN
F 2 "" H 8375 5650 50  0001 C CNN
F 3 "" H 8375 5650 50  0001 C CNN
	1    8375 5650
	1    0    0    -1  
$EndComp
Wire Wire Line
	8375 5875 8375 5650
Connection ~ 8375 5650
Wire Wire Line
	7500 5825 7725 5825
$Comp
L power:GND #PWR0110
U 1 1 5F8F31D6
P 7500 5825
F 0 "#PWR0110" H 7500 5575 50  0001 C CNN
F 1 "GND" H 7505 5652 50  0000 C CNN
F 2 "" H 7500 5825 50  0001 C CNN
F 3 "" H 7500 5825 50  0001 C CNN
	1    7500 5825
	1    0    0    -1  
$EndComp
Connection ~ 7725 5825
Wire Wire Line
	7725 5650 7725 5825
Connection ~ 7925 5650
Wire Wire Line
	7925 5825 7925 5650
$Comp
L Device:CP1_Small C10
U 1 1 5F8B9020
P 7825 5825
F 0 "C10" V 7975 5975 50  0000 C CNN
F 1 "10uF" V 7962 5825 50  0000 C CNN
F 2 "Capacitor_SMD:C_0805_2012Metric" H 7825 5825 50  0001 C CNN
F 3 "~" H 7825 5825 50  0001 C CNN
	1    7825 5825
	0    1    1    0   
$EndComp
$Comp
L Device:C_Small C6
U 1 1 5F8B1FB0
P 7825 5650
F 0 "C6" V 7700 5425 50  0000 C CNN
F 1 "0.1uF" V 7687 5650 50  0000 C CNN
F 2 "Capacitor_SMD:C_0805_2012Metric" H 7825 5650 50  0001 C CNN
F 3 "~" H 7825 5650 50  0001 C CNN
	1    7825 5650
	0    1    1    0   
$EndComp
Wire Wire Line
	8375 5650 7925 5650
$Comp
L Connector:Conn_01x02_Female J32
U 1 1 5FAFCC93
P 1925 7625
F 0 "J32" H 1953 7555 50  0000 L CNN
F 1 "Conn_01x02_Female" H 1817 7391 50  0001 C CNN
F 2 "Connector_PinSocket_2.54mm:PinSocket_1x02_P2.54mm_Vertical" H 1925 7625 50  0001 C CNN
F 3 "~" H 1925 7625 50  0001 C CNN
	1    1925 7625
	0    1    1    0   
$EndComp
Wire Wire Line
	2150 6875 2150 6950
Wire Wire Line
	2150 6950 1925 6950
Wire Wire Line
	1925 6950 1925 7425
Connection ~ 2150 6875
Wire Wire Line
	1775 7100 1775 7425
Wire Wire Line
	1775 7425 1825 7425
Connection ~ 1775 7100
$Comp
L Connector:Conn_01x02_Female J31
U 1 1 5FB2CC04
P 1925 5950
F 0 "J31" H 1953 5880 50  0000 L CNN
F 1 "Conn_01x02_Female" H 1817 5716 50  0001 C CNN
F 2 "Connector_PinSocket_2.54mm:PinSocket_1x02_P2.54mm_Vertical" H 1925 5950 50  0001 C CNN
F 3 "~" H 1925 5950 50  0001 C CNN
	1    1925 5950
	0    1    1    0   
$EndComp
Wire Wire Line
	2125 5400 1925 5400
Wire Wire Line
	1925 5400 1925 5750
Connection ~ 2125 5300
Wire Wire Line
	2125 5300 2125 5400
Wire Wire Line
	1825 5750 1825 5525
Wire Wire Line
	1825 5525 1750 5525
Connection ~ 1750 5525
$Comp
L Connector:Conn_01x02_Female J30
U 1 1 5FB643EF
P 1925 4450
F 0 "J30" H 1953 4380 50  0000 L CNN
F 1 "Conn_01x02_Female" H 1817 4216 50  0001 C CNN
F 2 "Connector_PinSocket_2.54mm:PinSocket_1x02_P2.54mm_Vertical" H 1925 4450 50  0001 C CNN
F 3 "~" H 1925 4450 50  0001 C CNN
	1    1925 4450
	0    1    1    0   
$EndComp
Wire Wire Line
	2125 3900 1925 3900
Wire Wire Line
	1925 3900 1925 4250
Connection ~ 2125 3825
Wire Wire Line
	2125 3825 2125 3900
$Comp
L power:GND #PWR037
U 1 1 5E6358E6
P 4275 4325
F 0 "#PWR037" H 4275 4075 50  0001 C CNN
F 1 "GND" H 4280 4152 50  0000 C CNN
F 2 "" H 4275 4325 50  0001 C CNN
F 3 "" H 4275 4325 50  0001 C CNN
	1    4275 4325
	1    0    0    -1  
$EndComp
$Comp
L power:VCC #PWR036
U 1 1 5E64607E
P 4275 3475
F 0 "#PWR036" H 4275 3325 50  0001 C CNN
F 1 "VCC" H 4292 3648 50  0000 C CNN
F 2 "" H 4275 3475 50  0001 C CNN
F 3 "" H 4275 3475 50  0001 C CNN
	1    4275 3475
	1    0    0    -1  
$EndComp
$Comp
L Device:C_Small C12
U 1 1 5E646084
P 4125 3575
F 0 "C12" V 3975 3575 50  0000 C CNN
F 1 "0u1F" V 4050 3450 50  0000 C CNN
F 2 "Capacitor_SMD:C_0805_2012Metric" H 4125 3575 50  0001 C CNN
F 3 "~" H 4125 3575 50  0001 C CNN
	1    4125 3575
	0    1    1    0   
$EndComp
$Comp
L power:GND #PWR035
U 1 1 5E64608A
P 4025 3575
F 0 "#PWR035" H 4025 3325 50  0001 C CNN
F 1 "GND" H 4030 3402 50  0001 C CNN
F 2 "" H 4025 3575 50  0001 C CNN
F 3 "" H 4025 3575 50  0001 C CNN
	1    4025 3575
	1    0    0    -1  
$EndComp
$Comp
L Device:CP1_Small C13
U 1 1 5E646090
P 4475 3575
F 0 "C13" V 4600 3575 50  0000 C CNN
F 1 "10uF" V 4525 3425 50  0000 C CNN
F 2 "Capacitor_SMD:C_0805_2012Metric" H 4475 3575 50  0001 C CNN
F 3 "~" H 4475 3575 50  0001 C CNN
	1    4475 3575
	0    -1   -1   0   
$EndComp
$Comp
L power:GND #PWR041
U 1 1 5E646096
P 4575 3575
F 0 "#PWR041" H 4575 3325 50  0001 C CNN
F 1 "GND" H 4580 3402 50  0001 C CNN
F 2 "" H 4575 3575 50  0001 C CNN
F 3 "" H 4575 3575 50  0001 C CNN
	1    4575 3575
	1    0    0    -1  
$EndComp
Wire Wire Line
	4375 3675 4375 3575
Wire Wire Line
	4275 3675 4375 3675
Connection ~ 4275 3675
Wire Wire Line
	4275 3675 4275 3475
Wire Wire Line
	4225 3675 4275 3675
Wire Wire Line
	4225 3575 4225 3675
$Comp
L ina2331:INA2331 U6
U 3 1 5E959E85
P 4275 3975
F 0 "U6" H 4525 3775 50  0000 L CNN
F 1 "INA2331" H 4175 3925 50  0000 L CNN
F 2 "Package_SO:TSSOP-14_4.4x5mm_P0.65mm" H 4275 3975 50  0001 C CNN
F 3 "" H 4275 3975 50  0001 C CNN
	3    4275 3975
	1    0    0    -1  
$EndComp
Text Notes 5475 4100 0    118  ~ 0
Main\nConnector\n(TODO)
$Comp
L Connector:Conn_01x09_Female J28
U 1 1 607888BB
P 6025 4825
F 0 "J28" H 6053 4805 50  0000 L CNN
F 1 "Conn_01x09_Female" H 6053 4760 50  0001 L CNN
F 2 "Connector_PinSocket_2.54mm:PinSocket_1x09_P2.54mm_Vertical" H 6025 4825 50  0001 C CNN
F 3 "~" H 6025 4825 50  0001 C CNN
	1    6025 4825
	1    0    0    -1  
$EndComp
Wire Wire Line
	5825 4925 5375 4925
Text GLabel 5825 4625 0    59   Output ~ 0
PT1
Text GLabel 5825 4725 0    59   Output ~ 0
PT2
Text GLabel 5825 4825 0    59   Output ~ 0
PT3
$Comp
L power:GNDREF #PWR0109
U 1 1 607317D2
P 5375 4925
F 0 "#PWR0109" H 5375 4675 50  0001 C CNN
F 1 "GNDREF" H 5375 4750 50  0000 C CNN
F 2 "" H 5375 4925 50  0001 C CNN
F 3 "" H 5375 4925 50  0001 C CNN
	1    5375 4925
	1    0    0    -1  
$EndComp
Text GLabel 5825 5225 0    59   Output ~ 0
TIA
Text GLabel 5825 5125 0    59   Output ~ 0
V23
Text GLabel 5825 5025 0    59   Output ~ 0
V12
Wire Wire Line
	5825 4525 5375 4525
$Comp
L power:GND #PWR0108
U 1 1 606D3937
P 5375 4525
F 0 "#PWR0108" H 5375 4275 50  0001 C CNN
F 1 "GND" H 5380 4352 50  0000 C CNN
F 2 "" H 5375 4525 50  0001 C CNN
F 3 "" H 5375 4525 50  0001 C CNN
	1    5375 4525
	1    0    0    -1  
$EndComp
$Comp
L power:VCC #PWR0107
U 1 1 606CCC38
P 5825 4425
F 0 "#PWR0107" H 5825 4275 50  0001 C CNN
F 1 "VCC" H 5842 4598 50  0000 C CNN
F 2 "" H 5825 4425 50  0001 C CNN
F 3 "" H 5825 4425 50  0001 C CNN
	1    5825 4425
	1    0    0    -1  
$EndComp
Wire Wire Line
	4250 5575 4325 5575
Connection ~ 4325 5575
Wire Wire Line
	4325 5575 4400 5575
Wire Wire Line
	4325 5575 4325 5500
$Comp
L power:GND #PWR06
U 1 1 5E73739E
P 4325 6175
F 0 "#PWR06" H 4325 5925 50  0001 C CNN
F 1 "GND" H 4330 6002 50  0000 C CNN
F 2 "" H 4325 6175 50  0001 C CNN
F 3 "" H 4325 6175 50  0001 C CNN
	1    4325 6175
	1    0    0    -1  
$EndComp
$Comp
L power:GND #PWR07
U 1 1 5E737398
P 4600 5575
F 0 "#PWR07" H 4600 5325 50  0001 C CNN
F 1 "GND" H 4605 5402 50  0001 C CNN
F 2 "" H 4600 5575 50  0001 C CNN
F 3 "" H 4600 5575 50  0001 C CNN
	1    4600 5575
	1    0    0    -1  
$EndComp
$Comp
L Device:CP1_Small C3
U 1 1 5E737392
P 4500 5575
F 0 "C3" V 4728 5575 50  0000 C CNN
F 1 "10uF" V 4637 5575 50  0000 C CNN
F 2 "Capacitor_SMD:C_0805_2012Metric" H 4500 5575 50  0001 C CNN
F 3 "~" H 4500 5575 50  0001 C CNN
	1    4500 5575
	0    -1   -1   0   
$EndComp
$Comp
L power:GND #PWR02
U 1 1 5E73738C
P 4050 5575
F 0 "#PWR02" H 4050 5325 50  0001 C CNN
F 1 "GND" H 4055 5402 50  0001 C CNN
F 2 "" H 4050 5575 50  0001 C CNN
F 3 "" H 4050 5575 50  0001 C CNN
	1    4050 5575
	1    0    0    -1  
$EndComp
$Comp
L Device:C_Small C2
U 1 1 5E737386
P 4150 5575
F 0 "C2" V 3921 5575 50  0000 C CNN
F 1 "0.1uF" V 4012 5575 50  0000 C CNN
F 2 "Capacitor_SMD:C_0805_2012Metric" H 4150 5575 50  0001 C CNN
F 3 "~" H 4150 5575 50  0001 C CNN
	1    4150 5575
	0    1    1    0   
$EndComp
$Comp
L Amplifier_Operational:LMC6484 U1
U 5 1 5E737380
P 4425 5875
F 0 "U1" H 4383 5921 50  0000 L CNN
F 1 "LMC6484" H 4383 5830 50  0000 L CNN
F 2 "Package_SO:SOIC-14_3.9x8.7mm_P1.27mm" H 4375 5975 50  0001 C CNN
F 3 "http://www.ti.com/lit/ds/symlink/lmc6484.pdf" H 4475 6075 50  0001 C CNN
	5    4425 5875
	1    0    0    -1  
$EndComp
$Comp
L power:VCC #PWR05
U 1 1 5E73737A
P 4325 5500
F 0 "#PWR05" H 4325 5350 50  0001 C CNN
F 1 "VCC" H 4342 5673 50  0000 C CNN
F 2 "" H 4325 5500 50  0001 C CNN
F 3 "" H 4325 5500 50  0001 C CNN
	1    4325 5500
	1    0    0    -1  
$EndComp
Text Notes 4000 5175 0    118  ~ 0
QuadAmp\nPower
Connection ~ 4950 6775
Wire Wire Line
	4950 6775 4575 6775
Wire Wire Line
	5200 7000 5200 6975
Connection ~ 5200 7000
Wire Wire Line
	5400 7000 5200 7000
Wire Wire Line
	5400 6800 5400 7000
Wire Wire Line
	4950 6775 5000 6775
Wire Wire Line
	5400 6550 5400 6700
Wire Wire Line
	4950 6550 5400 6550
Wire Wire Line
	4950 6775 4950 6550
$Comp
L Connector:Conn_01x02_Female J29
U 1 1 600B86A3
P 5600 6700
F 0 "J29" H 5628 6630 50  0000 L CNN
F 1 "Conn_01x02_Female" H 5492 6466 50  0001 C CNN
F 2 "Connector_PinSocket_2.54mm:PinSocket_1x02_P2.54mm_Vertical" H 5600 6700 50  0001 C CNN
F 3 "~" H 5600 6700 50  0001 C CNN
	1    5600 6700
	1    0    0    -1  
$EndComp
Connection ~ 5050 7550
$Comp
L power:GND #PWR0105
U 1 1 5F7F4760
P 5050 7550
F 0 "#PWR0105" H 5050 7300 50  0001 C CNN
F 1 "GND" H 5055 7377 50  0000 C CNN
F 2 "" H 5050 7550 50  0001 C CNN
F 3 "" H 5050 7550 50  0001 C CNN
	1    5050 7550
	1    0    0    -1  
$EndComp
Wire Wire Line
	5050 7550 4875 7550
Connection ~ 5200 7225
Wire Wire Line
	5200 7225 5200 7000
Wire Wire Line
	5200 7300 5200 7225
Wire Wire Line
	4875 7225 4875 7450
Wire Wire Line
	5200 7225 4875 7225
$Comp
L Connector:Conn_01x02_Female J23
U 1 1 5F9ADB6E
P 4675 7550
F 0 "J23" H 4567 7317 50  0000 C CNN
F 1 "Conn_01x02_Female" H 4703 7435 50  0001 L CNN
F 2 "Connector_PinSocket_2.54mm:PinSocket_1x02_P2.54mm_Vertical" H 4675 7550 50  0001 C CNN
F 3 "~" H 4675 7550 50  0001 C CNN
	1    4675 7550
	-1   0    0    1   
$EndComp
Wire Wire Line
	4375 7025 4750 7025
$Comp
L power:GNDREF #PWR0101
U 1 1 6000DB95
P 4375 7025
F 0 "#PWR0101" H 4375 6775 50  0001 C CNN
F 1 "GNDREF" H 4575 6925 50  0000 C CNN
F 2 "" H 4375 7025 50  0001 C CNN
F 3 "" H 4375 7025 50  0001 C CNN
	1    4375 7025
	1    0    0    -1  
$EndComp
Wire Wire Line
	5050 7050 5050 7025
Text GLabel 4575 6775 0    118  Input ~ 0
P4
$Comp
L Device:R R3
U 1 1 5E5BBC16
P 4900 7025
F 0 "R3" V 4800 7025 50  0000 C CNN
F 1 "50" V 4900 7025 50  0000 C CNN
F 2 "Resistor_SMD:R_0603_1608Metric" V 4830 7025 50  0001 C CNN
F 3 "~" H 4900 7025 50  0001 C CNN
	1    4900 7025
	0    -1   1    0   
$EndComp
$Comp
L Jumper:Jumper_3_Bridged12 JP1
U 1 1 5E5BBC10
P 5050 7300
F 0 "JP1" V 4975 7375 50  0000 L CNN
F 1 "Jumper_3_Bridged12" V 5095 7367 50  0001 L CNN
F 2 "Jumper:SolderJumper-3_P1.3mm_Bridged2Bar12_Pad1.0x1.5mm" H 5050 7300 50  0001 C CNN
F 3 "~" H 5050 7300 50  0001 C CNN
	1    5050 7300
	0    -1   1    0   
$EndComp
$Comp
L dk_Coaxial-Connectors-RF:CONSMA001-SMD-G J4
U 1 1 5E5BBC04
P 5200 6775
F 0 "J4" H 5200 6900 60  0000 C CNN
F 1 "CONSMA001-SMD-G" H 4650 6750 60  0001 C CNN
F 2 "digikey-footprints:RF_SMA_Receptical_Vertical_CONSMA001-SMD-G" H 5400 6975 60  0001 L CNN
F 3 "https://linxtechnologies.com/wp/wp-content/uploads/consma001-smd-g.pdf" H 5400 7075 60  0001 L CNN
F 4 "CONSMA001-SMD-G-ND" H 5400 7175 60  0001 L CNN "Digi-Key_PN"
F 5 "CONSMA001-SMD-G" H 5400 7275 60  0001 L CNN "MPN"
F 6 "Connectors, Interconnects" H 5400 7375 60  0001 L CNN "Category"
F 7 "Coaxial Connectors (RF)" H 5400 7475 60  0001 L CNN "Family"
F 8 "https://linxtechnologies.com/wp/wp-content/uploads/consma001-smd-g.pdf" H 5400 7575 60  0001 L CNN "DK_Datasheet_Link"
F 9 "/product-detail/en/linx-technologies-inc/CONSMA001-SMD-G/CONSMA001-SMD-G-ND/4496569" H 5400 7675 60  0001 L CNN "DK_Detail_Page"
F 10 "CONN SMA RCPT STR 50 OHM SMD" H 5400 7775 60  0001 L CNN "Description"
F 11 "Linx Technologies Inc." H 5400 7875 60  0001 L CNN "Manufacturer"
F 12 "Active" H 5400 7975 60  0001 L CNN "Status"
	1    5200 6775
	-1   0    0    -1  
$EndComp
$Comp
L power:GND #PWR0111
U 1 1 5F98D536
P 6275 900
F 0 "#PWR0111" H 6275 650 50  0001 C CNN
F 1 "GND" H 6280 727 50  0000 C CNN
F 2 "" H 6275 900 50  0001 C CNN
F 3 "" H 6275 900 50  0001 C CNN
	1    6275 900 
	1    0    0    -1  
$EndComp
Text Notes 5150 3100 2    118  ~ 0
Inamp Power
Wire Wire Line
	5900 1675 6050 1675
$Comp
L power:VCC #PWR0112
U 1 1 5FA66FC2
P 6050 1675
F 0 "#PWR0112" H 6050 1525 50  0001 C CNN
F 1 "VCC" H 6067 1848 50  0000 C CNN
F 2 "" H 6050 1675 50  0001 C CNN
F 3 "" H 6050 1675 50  0001 C CNN
	1    6050 1675
	1    0    0    -1  
$EndComp
Wire Wire Line
	4300 1775 4000 1775
Text GLabel 4000 1775 0    118  Input ~ 0
e3
Text GLabel 4000 1475 0    118  Input ~ 0
e2
Text GLabel 4000 1100 0    118  Input ~ 0
e1
Text GLabel 4000 800  0    118  Input ~ 0
e0
$Comp
L Device:Jumper_NC_Small JP8
U 1 1 5F9A0ADC
P 4200 2525
F 0 "JP8" H 4200 2737 50  0000 C CNN
F 1 "Jumper_NC_Small" H 4200 2646 50  0001 C CNN
F 2 "" H 4200 2525 50  0001 C CNN
F 3 "~" H 4200 2525 50  0001 C CNN
	1    4200 2525
	1    0    0    -1  
$EndComp
$Comp
L Device:Jumper_NC_Small JP7
U 1 1 5F9A03C5
P 4100 1475
F 0 "JP7" H 4100 1687 50  0000 C CNN
F 1 "Jumper_NC_Small" H 4100 1596 50  0001 C CNN
F 2 "" H 4100 1475 50  0001 C CNN
F 3 "~" H 4100 1475 50  0001 C CNN
	1    4100 1475
	1    0    0    -1  
$EndComp
$Comp
L Device:Jumper_NC_Small JP6
U 1 1 5F99FCA5
P 4100 1100
F 0 "JP6" H 4100 1312 50  0000 C CNN
F 1 "Jumper_NC_Small" H 4100 1221 50  0001 C CNN
F 2 "" H 4100 1100 50  0001 C CNN
F 3 "~" H 4100 1100 50  0001 C CNN
	1    4100 1100
	1    0    0    -1  
$EndComp
$Comp
L Device:Jumper_NC_Small JP5
U 1 1 5F99E76A
P 4100 800
F 0 "JP5" H 4100 1012 50  0000 C CNN
F 1 "Jumper_NC_Small" H 4100 921 50  0001 C CNN
F 2 "" H 4100 800 50  0001 C CNN
F 3 "~" H 4100 800 50  0001 C CNN
	1    4100 800 
	1    0    0    -1  
$EndComp
$Comp
L Device:R_POT_TRIM_US RV1
U 1 1 5F95E3F3
P 3850 2525
F 0 "RV1" H 3782 2571 50  0000 R CNN
F 1 "R_POT_TRIM_US" H 3782 2480 50  0000 R CNN
F 2 "" H 3850 2525 50  0001 C CNN
F 3 "~" H 3850 2525 50  0001 C CNN
	1    3850 2525
	1    0    0    -1  
$EndComp
Connection ~ 4700 1775
Wire Wire Line
	4700 1775 4400 1775
Wire Wire Line
	4700 1475 4700 1775
Connection ~ 4700 1475
Wire Wire Line
	4500 1475 4700 1475
Wire Wire Line
	4700 1100 4700 800 
Connection ~ 4700 1100
Wire Wire Line
	4500 1100 4700 1100
$Comp
L Connector:Conn_01x02_Female J33
U 1 1 5F83EBDA
P 4400 1975
F 0 "J33" H 4428 1905 50  0000 L CNN
F 1 "Conn_01x02_Female" H 4292 1741 50  0001 C CNN
F 2 "Connector_PinSocket_2.54mm:PinSocket_1x02_P2.54mm_Vertical" H 4400 1975 50  0001 C CNN
F 3 "~" H 4400 1975 50  0001 C CNN
	1    4400 1975
	0    1    1    0   
$EndComp
$Comp
L Device:R R16
U 1 1 5F838621
P 4450 2525
F 0 "R16" V 4243 2525 50  0000 C CNN
F 1 "R" V 4334 2525 50  0000 C CNN
F 2 "Resistor_SMD:R_0805_2012Metric" V 4380 2525 50  0001 C CNN
F 3 "~" H 4450 2525 50  0001 C CNN
	1    4450 2525
	0    1    1    0   
$EndComp
$Comp
L Device:R R15
U 1 1 5F8380BE
P 4350 1475
F 0 "R15" V 4143 1475 50  0000 C CNN
F 1 "R" V 4234 1475 50  0000 C CNN
F 2 "Resistor_SMD:R_0805_2012Metric" V 4280 1475 50  0001 C CNN
F 3 "~" H 4350 1475 50  0001 C CNN
	1    4350 1475
	0    1    1    0   
$EndComp
$Comp
L Device:R R13
U 1 1 5F837CD6
P 4350 1100
F 0 "R13" V 4143 1100 50  0000 C CNN
F 1 "R" V 4234 1100 50  0000 C CNN
F 2 "Resistor_SMD:R_0805_2012Metric" V 4280 1100 50  0001 C CNN
F 3 "~" H 4350 1100 50  0001 C CNN
	1    4350 1100
	0    1    1    0   
$EndComp
$Comp
L Device:R R12
U 1 1 5F8376E3
P 4350 800
F 0 "R12" V 4143 800 50  0000 C CNN
F 1 "R" V 4234 800 50  0000 C CNN
F 2 "Resistor_SMD:R_0805_2012Metric" V 4280 800 50  0001 C CNN
F 3 "~" H 4350 800 50  0001 C CNN
	1    4350 800 
	0    1    1    0   
$EndComp
Wire Wire Line
	4700 800  4500 800 
Wire Wire Line
	4700 1475 4700 1100
$Comp
L Device:R R21
U 1 1 5F80E3A9
P 5500 1775
F 0 "R21" H 5525 1625 50  0000 L CNN
F 1 "R" H 5475 1775 50  0000 L CNN
F 2 "Resistor_SMD:R_0805_2012Metric" V 5430 1775 50  0001 C CNN
F 3 "~" H 5500 1775 50  0001 C CNN
	1    5500 1775
	1    0    0    -1  
$EndComp
Connection ~ 5850 900 
$Comp
L Device:C_Small C15
U 1 1 5F98D546
P 5950 1075
F 0 "C15" V 5900 950 50  0000 C CNN
F 1 "0.1uF" V 5812 1075 50  0000 C CNN
F 2 "Capacitor_SMD:C_0805_2012Metric" H 5950 1075 50  0001 C CNN
F 3 "~" H 5950 1075 50  0001 C CNN
	1    5950 1075
	0    -1   -1   0   
$EndComp
$Comp
L Device:CP1_Small C14
U 1 1 5F98D540
P 5950 900
F 0 "C14" V 6025 775 50  0000 C CNN
F 1 "10uF" V 6050 950 50  0000 C CNN
F 2 "Capacitor_SMD:C_0805_2012Metric" H 5950 900 50  0001 C CNN
F 3 "~" H 5950 900 50  0001 C CNN
	1    5950 900 
	0    -1   -1   0   
$EndComp
Wire Wire Line
	5850 900  5850 1075
Wire Wire Line
	6050 1075 6050 900 
Connection ~ 6050 900 
Wire Wire Line
	6275 900  6050 900 
Wire Wire Line
	5700 900  5850 900 
Wire Wire Line
	5700 900  5700 800 
Connection ~ 5700 900 
Wire Wire Line
	5700 1075 5700 900 
Wire Wire Line
	5500 1275 5150 1275
$Comp
L power:GNDREF #PWR0113
U 1 1 5F914890
P 5150 1275
F 0 "#PWR0113" H 5150 1025 50  0001 C CNN
F 1 "GNDREF" H 5350 1175 50  0000 C CNN
F 2 "" H 5150 1275 50  0001 C CNN
F 3 "" H 5150 1275 50  0001 C CNN
	1    5150 1275
	1    0    0    -1  
$EndComp
$Comp
L power:VCC #PWR0114
U 1 1 5F8FB3D7
P 5700 800
F 0 "#PWR0114" H 5700 650 50  0001 C CNN
F 1 "VCC" H 5717 973 50  0000 C CNN
F 2 "" H 5700 800 50  0001 C CNN
F 3 "" H 5700 800 50  0001 C CNN
	1    5700 800 
	1    0    0    -1  
$EndComp
$Comp
L power:GND #PWR0115
U 1 1 5F8F9B21
P 5700 1675
F 0 "#PWR0115" H 5700 1425 50  0001 C CNN
F 1 "GND" H 5705 1502 50  0000 C CNN
F 2 "" H 5700 1675 50  0001 C CNN
F 3 "" H 5700 1675 50  0001 C CNN
	1    5700 1675
	1    0    0    -1  
$EndComp
$Comp
L ad859x:AD8591 U2
U 1 1 5F80BFBE
P 5800 1375
F 0 "U2" H 5400 1775 50  0000 L CNN
F 1 "AD8591" H 5375 1675 50  0000 L CNN
F 2 "" H 5800 1375 50  0001 C CNN
F 3 "" H 5800 1375 50  0001 C CNN
	1    5800 1375
	1    0    0    -1  
$EndComp
$Comp
L power:VCC #PWR0116
U 1 1 5F8A9068
P 3850 2375
F 0 "#PWR0116" H 3850 2225 50  0001 C CNN
F 1 "VCC" H 3867 2548 50  0000 C CNN
F 2 "" H 3850 2375 50  0001 C CNN
F 3 "" H 3850 2375 50  0001 C CNN
	1    3850 2375
	1    0    0    -1  
$EndComp
$Comp
L power:GND #PWR0117
U 1 1 5F8A8974
P 3850 2675
F 0 "#PWR0117" H 3850 2425 50  0001 C CNN
F 1 "GND" H 3855 2502 50  0000 C CNN
F 2 "" H 3850 2675 50  0001 C CNN
F 3 "" H 3850 2675 50  0001 C CNN
	1    3850 2675
	1    0    0    -1  
$EndComp
Wire Wire Line
	1750 4050 1750 4250
Wire Wire Line
	1750 4250 1825 4250
Connection ~ 1750 4050
Wire Wire Line
	6100 1375 6175 1375
$Comp
L Connector:Conn_01x02_Female J34
U 1 1 5F8CE039
P 4775 1800
F 0 "J34" H 4625 1850 50  0000 L CNN
F 1 "Conn_01x02_Female" H 4667 1566 50  0001 C CNN
F 2 "Connector_PinSocket_2.54mm:PinSocket_1x02_P2.54mm_Vertical" H 4775 1800 50  0001 C CNN
F 3 "~" H 4775 1800 50  0001 C CNN
	1    4775 1800
	-1   0    0    1   
$EndComp
Wire Wire Line
	6175 1375 6175 2100
Wire Wire Line
	4100 2525 4000 2525
Wire Wire Line
	4600 2525 4700 2525
Wire Wire Line
	4700 1775 4700 2525
$Comp
L Connector:Conn_01x02_Female J36
U 1 1 5FB4DFAF
P 5200 1800
F 0 "J36" H 5025 1850 50  0000 L CNN
F 1 "Conn_01x02_Female" H 5092 1566 50  0001 C CNN
F 2 "Connector_PinSocket_2.54mm:PinSocket_1x02_P2.54mm_Vertical" H 5200 1800 50  0001 C CNN
F 3 "~" H 5200 1800 50  0001 C CNN
	1    5200 1800
	-1   0    0    1   
$EndComp
$Comp
L Device:C_Small C17
U 1 1 5FBDACC3
P 5075 1750
F 0 "C17" H 5150 1600 50  0000 C CNN
F 1 "0.1uF" V 4937 1750 50  0001 C CNN
F 2 "Capacitor_SMD:C_0805_2012Metric" H 5075 1750 50  0001 C CNN
F 3 "~" H 5075 1750 50  0001 C CNN
	1    5075 1750
	1    0    0    -1  
$EndComp
Wire Wire Line
	5500 1475 5500 1625
Connection ~ 5500 1475
Wire Wire Line
	5500 1925 5500 2100
Connection ~ 5500 2100
Wire Wire Line
	5500 2100 6175 2100
Wire Wire Line
	5400 1700 5400 1475
Connection ~ 5400 1475
Wire Wire Line
	5400 1475 5500 1475
Wire Wire Line
	5400 1800 5400 2100
Connection ~ 5400 2100
Wire Wire Line
	5400 2100 5500 2100
Wire Wire Line
	4700 1475 4975 1475
Wire Wire Line
	5075 1650 5075 1475
Connection ~ 5075 1475
Wire Wire Line
	5075 1475 5400 1475
Wire Wire Line
	5075 1850 5075 2100
Connection ~ 5075 2100
Wire Wire Line
	5075 2100 5400 2100
Wire Wire Line
	4975 1700 4975 1475
Connection ~ 4975 1475
Wire Wire Line
	4975 1475 5075 1475
Wire Wire Line
	4975 1800 4975 2100
Wire Wire Line
	4975 2100 5075 2100
Wire Wire Line
	7000 1675 7375 1675
Wire Wire Line
	6175 1375 7375 1375
Wire Wire Line
	7375 1375 7375 1675
Connection ~ 6175 1375
Connection ~ 7375 1675
Wire Wire Line
	7375 1675 8075 1675
$EndSCHEMATC
