EESchema Schematic File Version 4
EELAYER 30 0
EELAYER END
$Descr USLetter 11000 8500
encoding utf-8
Sheet 1 1
Title "4pstat"
Date ""
Rev "v0.1"
Comp "PVOS"
Comment1 ""
Comment2 ""
Comment3 ""
Comment4 ""
$EndDescr
$Comp
L Amplifier_Operational:LMC6484 U1
U 1 1 5E3E568A
P 1750 1350
F 0 "U1" H 1725 1350 50  0000 C CNN
F 1 "LMC6484" H 1900 1500 50  0000 C CNN
F 2 "" H 1700 1450 50  0001 C CNN
F 3 "http://www.ti.com/lit/ds/symlink/lmc6484.pdf" H 1800 1550 50  0001 C CNN
	1    1750 1350
	1    0    0    -1  
$EndComp
$Comp
L dk_Coaxial-Connectors-RF:CONSMA001-SMD-G J2
U 1 1 5E3F6391
P 2425 3175
F 0 "J2" H 2425 3300 60  0000 C CNN
F 1 "CONSMA001-SMD-G" H 1875 3175 60  0000 C CNN
F 2 "digikey-footprints:RF_SMA_Receptical_Vertical_CONSMA001-SMD-G" H 2625 3375 60  0001 L CNN
F 3 "https://linxtechnologies.com/wp/wp-content/uploads/consma001-smd-g.pdf" H 2625 3475 60  0001 L CNN
F 4 "CONSMA001-SMD-G-ND" H 2625 3575 60  0001 L CNN "Digi-Key_PN"
F 5 "CONSMA001-SMD-G" H 2625 3675 60  0001 L CNN "MPN"
F 6 "Connectors, Interconnects" H 2625 3775 60  0001 L CNN "Category"
F 7 "Coaxial Connectors (RF)" H 2625 3875 60  0001 L CNN "Family"
F 8 "https://linxtechnologies.com/wp/wp-content/uploads/consma001-smd-g.pdf" H 2625 3975 60  0001 L CNN "DK_Datasheet_Link"
F 9 "/product-detail/en/linx-technologies-inc/CONSMA001-SMD-G/CONSMA001-SMD-G-ND/4496569" H 2625 4075 60  0001 L CNN "DK_Detail_Page"
F 10 "CONN SMA RCPT STR 50 OHM SMD" H 2625 4175 60  0001 L CNN "Description"
F 11 "Linx Technologies Inc." H 2625 4275 60  0001 L CNN "Manufacturer"
F 12 "Active" H 2625 4375 60  0001 L CNN "Status"
	1    2425 3175
	-1   0    0    -1  
$EndComp
$Comp
L power:VCC #PWR03
U 1 1 5E40A9ED
P 1200 950
F 0 "#PWR03" H 1200 800 50  0001 C CNN
F 1 "VCC" H 1217 1123 50  0000 C CNN
F 2 "" H 1200 950 50  0001 C CNN
F 3 "" H 1200 950 50  0001 C CNN
	1    1200 950 
	1    0    0    -1  
$EndComp
$Comp
L power:GND #PWR04
U 1 1 5E410C21
P 1200 1550
F 0 "#PWR04" H 1200 1300 50  0001 C CNN
F 1 "GND" H 1205 1377 50  0000 C CNN
F 2 "" H 1200 1550 50  0001 C CNN
F 3 "" H 1200 1550 50  0001 C CNN
	1    1200 1550
	1    0    0    -1  
$EndComp
$Comp
L Device:R R1
U 1 1 5E41434E
P 1200 1100
F 0 "R1" H 1270 1146 50  0000 L CNN
F 1 "10k" H 1270 1055 50  0000 L CNN
F 2 "Resistor_SMD:R_0603_1608Metric" V 1130 1100 50  0001 C CNN
F 3 "~" H 1200 1100 50  0001 C CNN
	1    1200 1100
	1    0    0    -1  
$EndComp
$Comp
L Device:R R2
U 1 1 5E41486E
P 1200 1400
F 0 "R2" H 1270 1446 50  0000 L CNN
F 1 "10k" H 1270 1355 50  0000 L CNN
F 2 "Resistor_SMD:R_0603_1608Metric" V 1130 1400 50  0001 C CNN
F 3 "~" H 1200 1400 50  0001 C CNN
	1    1200 1400
	1    0    0    -1  
$EndComp
$Comp
L power:GNDREF #PWR011
U 1 1 5E417AA6
P 2900 1350
F 0 "#PWR011" H 2900 1100 50  0001 C CNN
F 1 "GNDREF" H 3100 1250 50  0000 C CNN
F 2 "" H 2900 1350 50  0001 C CNN
F 3 "" H 2900 1350 50  0001 C CNN
	1    2900 1350
	1    0    0    -1  
$EndComp
Text Notes 1475 900  0    118  ~ 0
Virtual Ground
Text GLabel 4300 1825 0    118  Input ~ 0
P1
Text GLabel 4300 3000 0    118  Input ~ 0
P2
Text GLabel 4300 6225 0    118  Input ~ 0
P4
Text GLabel 6425 6325 2    118  Output ~ 0
TI
Text Notes 1125 2775 0    118  ~ 0
Probe Connectors\n(Driven Shields)
Text Notes 7800 7150 0    197  ~ 0
EC-4P v_0.3
$Comp
L Jumper:Jumper_3_Bridged12 JP2
U 1 1 5E52675A
P 2275 3700
F 0 "JP2" V 2200 3775 50  0000 L CNN
F 1 "Jumper_3_Bridged12" V 2320 3767 50  0001 L CNN
F 2 "" H 2275 3700 50  0001 C CNN
F 3 "~" H 2275 3700 50  0001 C CNN
	1    2275 3700
	0    -1   1    0   
$EndComp
$Comp
L Device:R R4
U 1 1 5E526760
P 2125 3425
F 0 "R4" V 2025 3425 50  0000 C CNN
F 1 "50" V 2125 3425 50  0000 C CNN
F 2 "Resistor_SMD:R_0603_1608Metric" V 2055 3425 50  0001 C CNN
F 3 "~" H 2125 3425 50  0001 C CNN
	1    2125 3425
	0    -1   1    0   
$EndComp
$Comp
L Amplifier_Operational:LMC6484 U2
U 1 1 5E526766
P 1575 3425
F 0 "U2" H 1575 3425 50  0000 C CNN
F 1 "LMC6484" H 1675 3250 50  0000 C CNN
F 2 "" H 1525 3525 50  0001 C CNN
F 3 "http://www.ti.com/lit/ds/symlink/lmc6484.pdf" H 1625 3625 50  0001 C CNN
	1    1575 3425
	1    0    0    -1  
$EndComp
Text GLabel 1175 3175 0    118  Input ~ 0
P1
$Comp
L dk_Coaxial-Connectors-RF:CONSMA001-SMD-G J3
U 1 1 5E577B8A
P 2425 4400
F 0 "J3" H 2425 4525 60  0000 C CNN
F 1 "CONSMA001-SMD-G" H 1875 4400 60  0000 C CNN
F 2 "digikey-footprints:RF_SMA_Receptical_Vertical_CONSMA001-SMD-G" H 2625 4600 60  0001 L CNN
F 3 "https://linxtechnologies.com/wp/wp-content/uploads/consma001-smd-g.pdf" H 2625 4700 60  0001 L CNN
F 4 "CONSMA001-SMD-G-ND" H 2625 4800 60  0001 L CNN "Digi-Key_PN"
F 5 "CONSMA001-SMD-G" H 2625 4900 60  0001 L CNN "MPN"
F 6 "Connectors, Interconnects" H 2625 5000 60  0001 L CNN "Category"
F 7 "Coaxial Connectors (RF)" H 2625 5100 60  0001 L CNN "Family"
F 8 "https://linxtechnologies.com/wp/wp-content/uploads/consma001-smd-g.pdf" H 2625 5200 60  0001 L CNN "DK_Datasheet_Link"
F 9 "/product-detail/en/linx-technologies-inc/CONSMA001-SMD-G/CONSMA001-SMD-G-ND/4496569" H 2625 5300 60  0001 L CNN "DK_Detail_Page"
F 10 "CONN SMA RCPT STR 50 OHM SMD" H 2625 5400 60  0001 L CNN "Description"
F 11 "Linx Technologies Inc." H 2625 5500 60  0001 L CNN "Manufacturer"
F 12 "Active" H 2625 5600 60  0001 L CNN "Status"
	1    2425 4400
	-1   0    0    -1  
$EndComp
$Comp
L Jumper:Jumper_3_Bridged12 JP3
U 1 1 5E577B96
P 2275 4925
F 0 "JP3" V 2200 5000 50  0000 L CNN
F 1 "Jumper_3_Bridged12" V 2320 4992 50  0001 L CNN
F 2 "" H 2275 4925 50  0001 C CNN
F 3 "~" H 2275 4925 50  0001 C CNN
	1    2275 4925
	0    -1   1    0   
$EndComp
$Comp
L Device:R R5
U 1 1 5E577B9C
P 2125 4650
F 0 "R5" V 2025 4650 50  0000 C CNN
F 1 "50" V 2125 4650 50  0000 C CNN
F 2 "Resistor_SMD:R_0603_1608Metric" V 2055 4650 50  0001 C CNN
F 3 "~" H 2125 4650 50  0001 C CNN
	1    2125 4650
	0    -1   1    0   
$EndComp
$Comp
L Amplifier_Operational:LMC6484 U1
U 2 1 5E577BA2
P 1575 4650
F 0 "U1" H 1575 4650 50  0000 C CNN
F 1 "LMC6484" H 1675 4475 50  0000 C CNN
F 2 "" H 1525 4750 50  0001 C CNN
F 3 "http://www.ti.com/lit/ds/symlink/lmc6484.pdf" H 1625 4850 50  0001 C CNN
	2    1575 4650
	1    0    0    -1  
$EndComp
Text GLabel 1175 4400 0    118  Input ~ 0
P2
$Comp
L dk_Coaxial-Connectors-RF:CONSMA001-SMD-G J4
U 1 1 5E5A0E05
P 2425 5600
F 0 "J4" H 2425 5725 60  0000 C CNN
F 1 "CONSMA001-SMD-G" H 1875 5600 60  0000 C CNN
F 2 "digikey-footprints:RF_SMA_Receptical_Vertical_CONSMA001-SMD-G" H 2625 5800 60  0001 L CNN
F 3 "https://linxtechnologies.com/wp/wp-content/uploads/consma001-smd-g.pdf" H 2625 5900 60  0001 L CNN
F 4 "CONSMA001-SMD-G-ND" H 2625 6000 60  0001 L CNN "Digi-Key_PN"
F 5 "CONSMA001-SMD-G" H 2625 6100 60  0001 L CNN "MPN"
F 6 "Connectors, Interconnects" H 2625 6200 60  0001 L CNN "Category"
F 7 "Coaxial Connectors (RF)" H 2625 6300 60  0001 L CNN "Family"
F 8 "https://linxtechnologies.com/wp/wp-content/uploads/consma001-smd-g.pdf" H 2625 6400 60  0001 L CNN "DK_Datasheet_Link"
F 9 "/product-detail/en/linx-technologies-inc/CONSMA001-SMD-G/CONSMA001-SMD-G-ND/4496569" H 2625 6500 60  0001 L CNN "DK_Detail_Page"
F 10 "CONN SMA RCPT STR 50 OHM SMD" H 2625 6600 60  0001 L CNN "Description"
F 11 "Linx Technologies Inc." H 2625 6700 60  0001 L CNN "Manufacturer"
F 12 "Active" H 2625 6800 60  0001 L CNN "Status"
	1    2425 5600
	-1   0    0    -1  
$EndComp
$Comp
L Jumper:Jumper_3_Bridged12 JP4
U 1 1 5E5A0E11
P 2275 6125
F 0 "JP4" V 2200 6200 50  0000 L CNN
F 1 "Jumper_3_Bridged12" V 2320 6192 50  0001 L CNN
F 2 "" H 2275 6125 50  0001 C CNN
F 3 "~" H 2275 6125 50  0001 C CNN
	1    2275 6125
	0    -1   1    0   
$EndComp
$Comp
L Device:R R6
U 1 1 5E5A0E17
P 2125 5850
F 0 "R6" V 2025 5850 50  0000 C CNN
F 1 "50" V 2125 5850 50  0000 C CNN
F 2 "Resistor_SMD:R_0603_1608Metric" V 2055 5850 50  0001 C CNN
F 3 "~" H 2125 5850 50  0001 C CNN
	1    2125 5850
	0    -1   1    0   
$EndComp
$Comp
L Amplifier_Operational:LMC6484 U1
U 3 1 5E5A0E1D
P 1575 5850
F 0 "U1" H 1575 5850 50  0000 C CNN
F 1 "LMC6484" H 1675 5675 50  0000 C CNN
F 2 "" H 1525 5950 50  0001 C CNN
F 3 "http://www.ti.com/lit/ds/symlink/lmc6484.pdf" H 1625 6050 50  0001 C CNN
	3    1575 5850
	1    0    0    -1  
$EndComp
Text GLabel 1175 5600 0    118  Input ~ 0
P3
$Comp
L dk_Coaxial-Connectors-RF:CONSMA001-SMD-G J1
U 1 1 5E5BBC04
P 2400 6775
F 0 "J1" H 2400 6900 60  0000 C CNN
F 1 "CONSMA001-SMD-G" H 1850 6750 60  0000 C CNN
F 2 "digikey-footprints:RF_SMA_Receptical_Vertical_CONSMA001-SMD-G" H 2600 6975 60  0001 L CNN
F 3 "https://linxtechnologies.com/wp/wp-content/uploads/consma001-smd-g.pdf" H 2600 7075 60  0001 L CNN
F 4 "CONSMA001-SMD-G-ND" H 2600 7175 60  0001 L CNN "Digi-Key_PN"
F 5 "CONSMA001-SMD-G" H 2600 7275 60  0001 L CNN "MPN"
F 6 "Connectors, Interconnects" H 2600 7375 60  0001 L CNN "Category"
F 7 "Coaxial Connectors (RF)" H 2600 7475 60  0001 L CNN "Family"
F 8 "https://linxtechnologies.com/wp/wp-content/uploads/consma001-smd-g.pdf" H 2600 7575 60  0001 L CNN "DK_Datasheet_Link"
F 9 "/product-detail/en/linx-technologies-inc/CONSMA001-SMD-G/CONSMA001-SMD-G-ND/4496569" H 2600 7675 60  0001 L CNN "DK_Detail_Page"
F 10 "CONN SMA RCPT STR 50 OHM SMD" H 2600 7775 60  0001 L CNN "Description"
F 11 "Linx Technologies Inc." H 2600 7875 60  0001 L CNN "Manufacturer"
F 12 "Active" H 2600 7975 60  0001 L CNN "Status"
	1    2400 6775
	-1   0    0    -1  
$EndComp
$Comp
L Jumper:Jumper_3_Bridged12 JP1
U 1 1 5E5BBC10
P 2250 7300
F 0 "JP1" V 2175 7375 50  0000 L CNN
F 1 "Jumper_3_Bridged12" V 2295 7367 50  0001 L CNN
F 2 "" H 2250 7300 50  0001 C CNN
F 3 "~" H 2250 7300 50  0001 C CNN
	1    2250 7300
	0    -1   1    0   
$EndComp
$Comp
L Device:R R3
U 1 1 5E5BBC16
P 2100 7025
F 0 "R3" V 2000 7025 50  0000 C CNN
F 1 "50" V 2100 7025 50  0000 C CNN
F 2 "Resistor_SMD:R_0603_1608Metric" V 2030 7025 50  0001 C CNN
F 3 "~" H 2100 7025 50  0001 C CNN
	1    2100 7025
	0    -1   1    0   
$EndComp
Text GLabel 1150 6775 0    118  Input ~ 0
P4
Text Notes 8300 1750 2    118  ~ 0
Voltage Sense 1::2
Text GLabel 4325 4275 0    118  Input ~ 0
P3
Text GLabel 1825 3250 0    59   Output ~ 0
PT1
Text GLabel 1825 4475 0    59   Output ~ 0
PT2
Text GLabel 1800 5675 0    59   Output ~ 0
PT3
$Comp
L Device:C C1
U 1 1 5E55D1B3
P 975 1400
F 0 "C1" H 750 1400 50  0000 L CNN
F 1 "0u1F" H 775 1500 50  0000 L CNN
F 2 "Capacitor_SMD:C_0603_1608Metric" H 1013 1250 50  0001 C CNN
F 3 "~" H 975 1400 50  0001 C CNN
	1    975  1400
	1    0    0    -1  
$EndComp
$Comp
L power:GND #PWR01
U 1 1 5E571125
P 975 1550
F 0 "#PWR01" H 975 1300 50  0001 C CNN
F 1 "GND" H 980 1377 50  0000 C CNN
F 2 "" H 975 1550 50  0001 C CNN
F 3 "" H 975 1550 50  0001 C CNN
	1    975  1550
	1    0    0    -1  
$EndComp
$Comp
L power:GND #PWR037
U 1 1 5E6358E6
P 9175 3725
F 0 "#PWR037" H 9175 3475 50  0001 C CNN
F 1 "GND" H 9180 3552 50  0000 C CNN
F 2 "" H 9175 3725 50  0001 C CNN
F 3 "" H 9175 3725 50  0001 C CNN
	1    9175 3725
	1    0    0    -1  
$EndComp
$Comp
L power:VCC #PWR036
U 1 1 5E64607E
P 9175 2875
F 0 "#PWR036" H 9175 2725 50  0001 C CNN
F 1 "VCC" H 9192 3048 50  0000 C CNN
F 2 "" H 9175 2875 50  0001 C CNN
F 3 "" H 9175 2875 50  0001 C CNN
	1    9175 2875
	1    0    0    -1  
$EndComp
$Comp
L Device:C_Small C12
U 1 1 5E646084
P 9025 2975
F 0 "C12" V 8875 2975 50  0000 C CNN
F 1 "0u1F" V 8950 2850 50  0000 C CNN
F 2 "Capacitor_SMD:C_0603_1608Metric" H 9025 2975 50  0001 C CNN
F 3 "~" H 9025 2975 50  0001 C CNN
	1    9025 2975
	0    1    1    0   
$EndComp
$Comp
L power:GND #PWR035
U 1 1 5E64608A
P 8925 2975
F 0 "#PWR035" H 8925 2725 50  0001 C CNN
F 1 "GND" H 8930 2802 50  0001 C CNN
F 2 "" H 8925 2975 50  0001 C CNN
F 3 "" H 8925 2975 50  0001 C CNN
	1    8925 2975
	1    0    0    -1  
$EndComp
$Comp
L Device:CP1_Small C13
U 1 1 5E646090
P 9375 2975
F 0 "C13" V 9500 2975 50  0000 C CNN
F 1 "10uF" V 9425 2825 50  0000 C CNN
F 2 "Capacitor_SMD:C_0603_1608Metric" H 9375 2975 50  0001 C CNN
F 3 "~" H 9375 2975 50  0001 C CNN
	1    9375 2975
	0    -1   -1   0   
$EndComp
$Comp
L power:GND #PWR041
U 1 1 5E646096
P 9475 2975
F 0 "#PWR041" H 9475 2725 50  0001 C CNN
F 1 "GND" H 9480 2802 50  0001 C CNN
F 2 "" H 9475 2975 50  0001 C CNN
F 3 "" H 9475 2975 50  0001 C CNN
	1    9475 2975
	1    0    0    -1  
$EndComp
$Comp
L Device:R R19
U 1 1 5E701415
P 6175 1325
F 0 "R19" H 6225 1325 50  0000 L CNN
F 1 "RA2" V 6175 1275 50  0000 L CNN
F 2 "Resistor_SMD:R_0603_1608Metric" V 6105 1325 50  0001 C CNN
F 3 "~" H 6175 1325 50  0001 C CNN
	1    6175 1325
	0    1    1    0   
$EndComp
Text GLabel 6525 4075 2    118  Output ~ 0
V23
Text GLabel 6675 2025 2    118  Output ~ 0
V12
$Comp
L Connector:Conn_01x02_Female J5
U 1 1 5E829EA1
P 5525 875
F 0 "J5" V 5463 687 50  0000 R CNN
F 1 "Conn_01x02_Female" V 5625 1175 50  0000 R CNN
F 2 "" H 5525 875 50  0001 C CNN
F 3 "~" H 5525 875 50  0001 C CNN
	1    5525 875 
	0    -1   -1   0   
$EndComp
$Comp
L Device:R R17
U 1 1 5E71E16A
P 5575 1325
F 0 "R17" H 5625 1325 50  0000 L CNN
F 1 "RA1" V 5575 1275 50  0000 L CNN
F 2 "Resistor_SMD:R_0603_1608Metric" V 5505 1325 50  0001 C CNN
F 3 "~" H 5575 1325 50  0001 C CNN
	1    5575 1325
	0    1    1    0   
$EndComp
$Comp
L Connector:Conn_01x02_Female J7
U 1 1 5E8ED266
P 6125 875
F 0 "J7" V 6063 687 50  0000 R CNN
F 1 "Conn_01x02_Female" V 6225 1175 50  0000 R CNN
F 2 "" H 6125 875 50  0001 C CNN
F 3 "~" H 6125 875 50  0001 C CNN
	1    6125 875 
	0    -1   -1   0   
$EndComp
$Comp
L Device:R R20
U 1 1 5E927015
P 6075 3325
F 0 "R20" H 6125 3325 50  0000 L CNN
F 1 "RB2" V 6075 3275 50  0000 L CNN
F 2 "Resistor_SMD:R_0603_1608Metric" V 6005 3325 50  0001 C CNN
F 3 "~" H 6075 3325 50  0001 C CNN
	1    6075 3325
	0    1    1    0   
$EndComp
$Comp
L Connector:Conn_01x02_Female J6
U 1 1 5E92701B
P 5425 2875
F 0 "J6" V 5363 2687 50  0000 R CNN
F 1 "Conn_01x02_Female" V 5525 3175 50  0000 R CNN
F 2 "" H 5425 2875 50  0001 C CNN
F 3 "~" H 5425 2875 50  0001 C CNN
	1    5425 2875
	0    -1   -1   0   
$EndComp
$Comp
L Device:R R18
U 1 1 5E927021
P 5475 3325
F 0 "R18" H 5525 3325 50  0000 L CNN
F 1 "RB1" V 5475 3275 50  0000 L CNN
F 2 "Resistor_SMD:R_0603_1608Metric" V 5405 3325 50  0001 C CNN
F 3 "~" H 5475 3325 50  0001 C CNN
	1    5475 3325
	0    1    1    0   
$EndComp
$Comp
L Connector:Conn_01x02_Female J8
U 1 1 5E927034
P 6025 2875
F 0 "J8" V 5963 2687 50  0000 R CNN
F 1 "Conn_01x02_Female" V 6125 3175 50  0000 R CNN
F 2 "" H 6025 2875 50  0001 C CNN
F 3 "~" H 6025 2875 50  0001 C CNN
	1    6025 2875
	0    -1   -1   0   
$EndComp
$Comp
L power:VCC #PWR033
U 1 1 5E9D163F
P 6025 2475
F 0 "#PWR033" H 6025 2325 50  0001 C CNN
F 1 "VCC" H 6042 2648 50  0000 C CNN
F 2 "" H 6025 2475 50  0001 C CNN
F 3 "" H 6025 2475 50  0001 C CNN
	1    6025 2475
	1    0    0    -1  
$EndComp
$Comp
L power:VCC #PWR034
U 1 1 5E9D2661
P 5975 4475
F 0 "#PWR034" H 5975 4325 50  0001 C CNN
F 1 "VCC" H 5992 4648 50  0000 C CNN
F 2 "" H 5975 4475 50  0001 C CNN
F 3 "" H 5975 4475 50  0001 C CNN
	1    5975 4475
	1    0    0    -1  
$EndComp
$Comp
L power:GNDREF #PWR031
U 1 1 5EA1FD37
P 4975 4075
F 0 "#PWR031" H 4975 3825 50  0001 C CNN
F 1 "GNDREF" H 4750 4025 50  0000 C CNN
F 2 "" H 4975 4075 50  0001 C CNN
F 3 "" H 4975 4075 50  0001 C CNN
	1    4975 4075
	1    0    0    -1  
$EndComp
$Comp
L power:GNDREF #PWR032
U 1 1 5EA34088
P 5125 2025
F 0 "#PWR032" H 5125 1775 50  0001 C CNN
F 1 "GNDREF" H 4900 1975 50  0000 C CNN
F 2 "" H 5125 2025 50  0001 C CNN
F 3 "" H 5125 2025 50  0001 C CNN
	1    5125 2025
	1    0    0    -1  
$EndComp
Text Notes 8200 3800 2    118  ~ 0
Voltage Sense 2::3
Connection ~ 5225 2025
Wire Wire Line
	5225 2025 5125 2025
Connection ~ 5125 4075
Wire Wire Line
	5125 4075 4975 4075
Wire Wire Line
	6375 4075 6525 4075
Wire Wire Line
	6375 3325 6375 4075
Wire Wire Line
	5125 3325 5125 4075
Wire Wire Line
	5125 4075 5275 4075
Connection ~ 6225 3325
Wire Wire Line
	6225 3075 6225 3325
Wire Wire Line
	6125 3075 6225 3075
Connection ~ 5925 3325
Wire Wire Line
	5925 3075 6025 3075
Wire Wire Line
	5925 3325 5925 3075
Connection ~ 5625 3325
Wire Wire Line
	5625 3075 5625 3325
Wire Wire Line
	5525 3075 5625 3075
Connection ~ 5325 3325
Wire Wire Line
	5325 3075 5425 3075
Wire Wire Line
	5325 3325 5325 3075
Wire Wire Line
	6225 3325 6375 3325
Wire Wire Line
	5325 3325 5125 3325
Connection ~ 6325 1325
Wire Wire Line
	6325 1075 6325 1325
Wire Wire Line
	6225 1075 6325 1075
Connection ~ 6025 1325
Wire Wire Line
	6025 1075 6125 1075
Wire Wire Line
	6025 1325 6025 1075
Connection ~ 5725 1325
Wire Wire Line
	5725 1075 5725 1325
Wire Wire Line
	5625 1075 5725 1075
Connection ~ 5425 1325
Wire Wire Line
	5425 1075 5525 1075
Wire Wire Line
	5425 1325 5425 1075
Wire Wire Line
	6475 1325 6475 2025
Wire Wire Line
	6325 1325 6475 1325
Wire Wire Line
	5225 1325 5225 2025
Wire Wire Line
	5425 1325 5225 1325
Wire Wire Line
	5225 2025 5375 2025
Wire Wire Line
	9275 3075 9275 2975
Wire Wire Line
	9175 3075 9275 3075
Connection ~ 9175 3075
Wire Wire Line
	9175 3075 9175 2875
Wire Wire Line
	9125 3075 9175 3075
Wire Wire Line
	9125 2975 9125 3075
Wire Wire Line
	975  1250 1200 1250
Wire Wire Line
	1900 4475 1900 4650
Wire Wire Line
	1825 4475 1900 4475
Wire Wire Line
	1900 5675 1900 5850
Wire Wire Line
	1800 5675 1900 5675
Wire Wire Line
	1825 3250 1900 3250
Wire Wire Line
	1900 3425 1900 3250
Wire Wire Line
	2400 7300 2400 6975
Wire Wire Line
	2250 7050 2250 7025
Connection ~ 1275 5600
Wire Wire Line
	1275 5600 1175 5600
Wire Wire Line
	2225 5600 1275 5600
Wire Wire Line
	2425 6125 2425 5800
Wire Wire Line
	2275 5875 2275 5850
Wire Wire Line
	1275 5600 1275 5750
Wire Wire Line
	1975 5850 1900 5850
Wire Wire Line
	1900 5850 1900 6100
Wire Wire Line
	1900 6100 1275 6100
Wire Wire Line
	1275 6100 1275 5950
Connection ~ 1900 5850
Wire Wire Line
	1900 5850 1875 5850
Connection ~ 1275 4400
Wire Wire Line
	1275 4400 1175 4400
Wire Wire Line
	2225 4400 1275 4400
Wire Wire Line
	2425 4925 2425 4600
Wire Wire Line
	2275 4675 2275 4650
Wire Wire Line
	1275 4400 1275 4550
Wire Wire Line
	1975 4650 1900 4650
Wire Wire Line
	1900 4650 1900 4900
Wire Wire Line
	1900 4900 1275 4900
Wire Wire Line
	1275 4900 1275 4750
Connection ~ 1900 4650
Wire Wire Line
	1900 4650 1875 4650
Connection ~ 1275 3175
Wire Wire Line
	1275 3175 1175 3175
Wire Wire Line
	2225 3175 1275 3175
Wire Wire Line
	2425 3700 2425 3375
Wire Wire Line
	2275 3450 2275 3425
Wire Wire Line
	1275 3175 1275 3325
Wire Wire Line
	1975 3425 1900 3425
Wire Wire Line
	1900 3425 1900 3675
Wire Wire Line
	1900 3675 1275 3675
Wire Wire Line
	1275 3675 1275 3525
Connection ~ 1900 3425
Wire Wire Line
	1900 3425 1875 3425
Wire Wire Line
	1450 1250 1200 1250
Connection ~ 1200 1250
Text Notes 9875 2575 2    118  ~ 0
Inamp Power
$Comp
L power:GNDREF #PWR021
U 1 1 5E57EBC8
P 5400 6425
F 0 "#PWR021" H 5400 6175 50  0001 C CNN
F 1 "GNDREF" H 5405 6252 50  0000 C CNN
F 2 "" H 5400 6425 50  0001 C CNN
F 3 "" H 5400 6425 50  0001 C CNN
	1    5400 6425
	1    0    0    -1  
$EndComp
$Comp
L power:GND #PWR023
U 1 1 5E505A76
P 5675 6625
F 0 "#PWR023" H 5675 6375 50  0001 C CNN
F 1 "GND" H 5680 6452 50  0000 C CNN
F 2 "" H 5675 6625 50  0001 C CNN
F 3 "" H 5675 6625 50  0001 C CNN
	1    5675 6625
	1    0    0    -1  
$EndComp
$Comp
L power:VCC #PWR022
U 1 1 5E514EDB
P 5675 6025
F 0 "#PWR022" H 5675 5875 50  0001 C CNN
F 1 "VCC" H 5800 6075 50  0000 C CNN
F 2 "" H 5675 6025 50  0001 C CNN
F 3 "" H 5675 6025 50  0001 C CNN
	1    5675 6025
	1    0    0    -1  
$EndComp
$Comp
L opa381:OPA381 U3
U 1 1 5E53CCEE
P 5775 6325
F 0 "U3" H 5975 6100 50  0000 L CNN
F 1 "OPA381" H 5875 6175 50  0000 L CNN
F 2 "" H 5775 6325 50  0001 L CNN
F 3 "http://www.ti.com/product/OPA381" H 5775 6325 50  0001 C CNN
	1    5775 6325
	1    0    0    -1  
$EndComp
Wire Wire Line
	5475 6225 5400 6225
Wire Wire Line
	5400 6425 5475 6425
Text Notes 7600 6075 2    118  ~ 0
Current Sense
$Comp
L ina2331:INA2331 U6
U 1 1 5E811ECB
P 5675 2025
F 0 "U6" H 6025 2275 50  0000 L CNN
F 1 "INA2331" H 6175 1775 50  0000 L CNN
F 2 "" H 5675 2025 50  0001 C CNN
F 3 "" H 5675 2025 50  0001 C CNN
	1    5675 2025
	1    0    0    -1  
$EndComp
Wire Wire Line
	6375 2025 6475 2025
Wire Wire Line
	5725 1325 5875 1325
Wire Wire Line
	5875 1325 5875 1525
Wire Wire Line
	5875 1525 5925 1525
Wire Wire Line
	5925 1525 5925 1725
Connection ~ 5875 1325
Wire Wire Line
	5875 1325 6025 1325
Wire Wire Line
	5625 3325 5775 3325
Wire Wire Line
	5775 3775 5825 3775
Wire Wire Line
	5775 3325 5775 3775
Connection ~ 5775 3325
Wire Wire Line
	5775 3325 5925 3325
Wire Wire Line
	5825 2375 5825 2475
Wire Wire Line
	5825 2475 6025 2475
Wire Wire Line
	5725 4425 5725 4475
Wire Wire Line
	5725 4475 5975 4475
Wire Wire Line
	6375 4075 6275 4075
Connection ~ 6375 4075
Wire Wire Line
	6475 2025 6675 2025
Connection ~ 6475 2025
$Comp
L ina2331:INA2331 U6
U 3 1 5E959E85
P 9175 3375
F 0 "U6" H 9425 3175 50  0000 L CNN
F 1 "INA2331" H 9075 3325 50  0000 L CNN
F 2 "" H 9175 3375 50  0001 C CNN
F 3 "" H 9175 3375 50  0001 C CNN
	3    9175 3375
	1    0    0    -1  
$EndComp
Wire Wire Line
	6425 6325 6125 6325
$Comp
L Connector:Conn_01x02_Female J10
U 1 1 5FADFD55
P 5775 5350
F 0 "J10" V 5713 5162 50  0000 R CNN
F 1 "Conn_01x02_Female" V 5625 5150 50  0000 R CNN
F 2 "" H 5775 5350 50  0001 C CNN
F 3 "~" H 5775 5350 50  0001 C CNN
	1    5775 5350
	0    -1   -1   0   
$EndComp
$Comp
L Device:R R14
U 1 1 5E55C896
P 5825 5175
F 0 "R14" V 5925 5175 50  0000 C CNN
F 1 "10M" V 5825 5200 50  0000 C CNN
F 2 "Resistor_SMD:R_0603_1608Metric" V 5755 5175 50  0001 C CNN
F 3 "~" H 5825 5175 50  0001 C CNN
	1    5825 5175
	0    1    1    0   
$EndComp
$Comp
L Connector:Conn_01x02_Female J9
U 1 1 5FAB2964
P 5775 4825
F 0 "J9" V 5713 4637 50  0000 R CNN
F 1 "Conn_01x02_Female" V 5625 4625 50  0000 R CNN
F 2 "" H 5775 4825 50  0001 C CNN
F 3 "~" H 5775 4825 50  0001 C CNN
	1    5775 4825
	0    -1   -1   0   
$EndComp
$Comp
L Device:C C9
U 1 1 5E561971
P 5825 5725
F 0 "C9" V 5875 5600 50  0000 C CNN
F 1 "0p4" V 5875 5850 50  0000 C CNN
F 2 "Capacitor_SMD:C_0603_1608Metric" H 5863 5575 50  0001 C CNN
F 3 "~" H 5825 5725 50  0001 C CNN
	1    5825 5725
	0    1    1    0   
$EndComp
Wire Wire Line
	5675 5725 5675 5550
Wire Wire Line
	5675 5550 5775 5550
Wire Wire Line
	5875 5550 5975 5550
Connection ~ 5975 5550
Wire Wire Line
	5975 5550 5975 5725
Wire Wire Line
	5675 5550 5675 5175
Connection ~ 5675 5550
Wire Wire Line
	5675 5550 5400 5550
Wire Wire Line
	5400 5550 5400 6225
Wire Wire Line
	5975 5550 6125 5550
Wire Wire Line
	6125 5550 6125 6325
Connection ~ 6125 6325
Wire Wire Line
	6125 6325 6075 6325
Wire Wire Line
	5975 5175 5975 5550
Wire Wire Line
	5775 5025 5675 5025
Wire Wire Line
	5675 5025 5675 5175
Connection ~ 5675 5175
Wire Wire Line
	5875 5025 5975 5025
Wire Wire Line
	5975 5025 5975 5175
Connection ~ 5975 5175
Text Notes 3850 1525 0    118  ~ 0
Probes
Wire Wire Line
	5275 3875 4950 3875
$Comp
L ina2331:INA2331 U6
U 2 1 5E8B36AD
P 5525 4075
F 0 "U6" H 6025 4325 50  0000 L CNN
F 1 "INA2331" H 6175 3875 50  0000 L CNN
F 2 "" H 5525 4075 50  0001 C CNN
F 3 "" H 5525 4075 50  0001 C CNN
	2    5525 4075
	1    0    0    -1  
$EndComp
Wire Wire Line
	8575 5400 8650 5400
Connection ~ 8650 5400
Wire Wire Line
	8650 5400 8725 5400
Wire Wire Line
	8650 5400 8650 5325
Wire Wire Line
	9375 5425 9450 5425
Connection ~ 9450 5425
Wire Wire Line
	9450 5425 9525 5425
Wire Wire Line
	9450 5425 9450 5350
$Comp
L power:GND #PWR06
U 1 1 5E73739E
P 9450 6025
F 0 "#PWR06" H 9450 5775 50  0001 C CNN
F 1 "GND" H 9455 5852 50  0000 C CNN
F 2 "" H 9450 6025 50  0001 C CNN
F 3 "" H 9450 6025 50  0001 C CNN
	1    9450 6025
	1    0    0    -1  
$EndComp
$Comp
L power:GND #PWR07
U 1 1 5E737398
P 9725 5425
F 0 "#PWR07" H 9725 5175 50  0001 C CNN
F 1 "GND" H 9730 5252 50  0001 C CNN
F 2 "" H 9725 5425 50  0001 C CNN
F 3 "" H 9725 5425 50  0001 C CNN
	1    9725 5425
	1    0    0    -1  
$EndComp
$Comp
L Device:CP1_Small C3
U 1 1 5E737392
P 9625 5425
F 0 "C3" V 9853 5425 50  0000 C CNN
F 1 "10uF" V 9762 5425 50  0000 C CNN
F 2 "Capacitor_SMD:C_0603_1608Metric" H 9625 5425 50  0001 C CNN
F 3 "~" H 9625 5425 50  0001 C CNN
	1    9625 5425
	0    -1   -1   0   
$EndComp
$Comp
L power:GND #PWR02
U 1 1 5E73738C
P 9175 5425
F 0 "#PWR02" H 9175 5175 50  0001 C CNN
F 1 "GND" H 9180 5252 50  0001 C CNN
F 2 "" H 9175 5425 50  0001 C CNN
F 3 "" H 9175 5425 50  0001 C CNN
	1    9175 5425
	1    0    0    -1  
$EndComp
$Comp
L Device:C_Small C2
U 1 1 5E737386
P 9275 5425
F 0 "C2" V 9046 5425 50  0000 C CNN
F 1 "0u1F" V 9137 5425 50  0000 C CNN
F 2 "Capacitor_SMD:C_0603_1608Metric" H 9275 5425 50  0001 C CNN
F 3 "~" H 9275 5425 50  0001 C CNN
	1    9275 5425
	0    1    1    0   
$EndComp
$Comp
L Amplifier_Operational:LMC6484 U1
U 5 1 5E737380
P 9550 5725
F 0 "U1" H 9508 5771 50  0000 L CNN
F 1 "LMC6484" H 9508 5680 50  0000 L CNN
F 2 "" H 9500 5825 50  0001 C CNN
F 3 "http://www.ti.com/lit/ds/symlink/lmc6484.pdf" H 9600 5925 50  0001 C CNN
	5    9550 5725
	1    0    0    -1  
$EndComp
$Comp
L power:VCC #PWR05
U 1 1 5E73737A
P 9450 5350
F 0 "#PWR05" H 9450 5200 50  0001 C CNN
F 1 "VCC" H 9467 5523 50  0000 C CNN
F 2 "" H 9450 5350 50  0001 C CNN
F 3 "" H 9450 5350 50  0001 C CNN
	1    9450 5350
	1    0    0    -1  
$EndComp
Text Notes 8375 5000 0    118  ~ 0
QuadAmp Power
$Comp
L power:GND #PWR010
U 1 1 5E6CC116
P 8650 6000
F 0 "#PWR010" H 8650 5750 50  0001 C CNN
F 1 "GND" H 8655 5827 50  0000 C CNN
F 2 "" H 8650 6000 50  0001 C CNN
F 3 "" H 8650 6000 50  0001 C CNN
	1    8650 6000
	1    0    0    -1  
$EndComp
$Comp
L power:GND #PWR012
U 1 1 5E6C4C83
P 8925 5400
F 0 "#PWR012" H 8925 5150 50  0001 C CNN
F 1 "GND" H 8930 5227 50  0001 C CNN
F 2 "" H 8925 5400 50  0001 C CNN
F 3 "" H 8925 5400 50  0001 C CNN
	1    8925 5400
	1    0    0    -1  
$EndComp
$Comp
L Device:CP1_Small C5
U 1 1 5E6C4039
P 8825 5400
F 0 "C5" V 9053 5400 50  0000 C CNN
F 1 "10uF" V 8962 5400 50  0000 C CNN
F 2 "Capacitor_SMD:C_0603_1608Metric" H 8825 5400 50  0001 C CNN
F 3 "~" H 8825 5400 50  0001 C CNN
	1    8825 5400
	0    -1   -1   0   
$EndComp
$Comp
L power:GND #PWR08
U 1 1 5E6BDAA7
P 8375 5400
F 0 "#PWR08" H 8375 5150 50  0001 C CNN
F 1 "GND" H 8380 5227 50  0001 C CNN
F 2 "" H 8375 5400 50  0001 C CNN
F 3 "" H 8375 5400 50  0001 C CNN
	1    8375 5400
	1    0    0    -1  
$EndComp
$Comp
L Device:C_Small C4
U 1 1 5E6AD327
P 8475 5400
F 0 "C4" V 8246 5400 50  0000 C CNN
F 1 "0u1F" V 8337 5400 50  0000 C CNN
F 2 "Capacitor_SMD:C_0603_1608Metric" H 8475 5400 50  0001 C CNN
F 3 "~" H 8475 5400 50  0001 C CNN
	1    8475 5400
	0    1    1    0   
$EndComp
$Comp
L Amplifier_Operational:LMC6484 U2
U 5 1 5E5DC11E
P 8750 5700
F 0 "U2" H 8708 5746 50  0000 L CNN
F 1 "LMC6484" H 8708 5655 50  0000 L CNN
F 2 "" H 8700 5800 50  0001 C CNN
F 3 "http://www.ti.com/lit/ds/symlink/lmc6484.pdf" H 8800 5900 50  0001 C CNN
	5    8750 5700
	1    0    0    -1  
$EndComp
$Comp
L power:VCC #PWR09
U 1 1 5E40AE02
P 8650 5325
F 0 "#PWR09" H 8650 5175 50  0001 C CNN
F 1 "VCC" H 8667 5498 50  0000 C CNN
F 2 "" H 8650 5325 50  0001 C CNN
F 3 "" H 8650 5325 50  0001 C CNN
	1    8650 5325
	1    0    0    -1  
$EndComp
Wire Wire Line
	4950 3875 4950 3000
Wire Wire Line
	4950 2225 5375 2225
Wire Wire Line
	5375 1825 4300 1825
Wire Wire Line
	4300 3000 4950 3000
Connection ~ 4950 3000
Wire Wire Line
	4950 3000 4950 2225
Wire Wire Line
	5275 4275 4325 4275
Wire Wire Line
	5400 6225 4300 6225
Connection ~ 5400 6225
Wire Notes Line
	4450 1600 4450 6575
Wire Notes Line
	4450 6575 3800 6575
Wire Notes Line
	3800 6575 3800 1600
Wire Notes Line
	3800 1600 4450 1600
$Comp
L Device:R R7
U 1 1 5FD497C2
P 2625 6000
F 0 "R7" H 2695 6046 50  0000 L CNN
F 1 "R" H 2695 5955 50  0000 L CNN
F 2 "" V 2555 6000 50  0001 C CNN
F 3 "~" H 2625 6000 50  0001 C CNN
	1    2625 6000
	1    0    0    -1  
$EndComp
$Comp
L Device:C C6
U 1 1 5FD49FB5
P 2625 6300
F 0 "C6" H 2740 6346 50  0000 L CNN
F 1 "C" H 2740 6255 50  0000 L CNN
F 2 "" H 2663 6150 50  0001 C CNN
F 3 "~" H 2625 6300 50  0001 C CNN
	1    2625 6300
	1    0    0    -1  
$EndComp
$Comp
L Connector:Conn_01x02_Female J?
U 1 1 5FD72299
P 3100 5850
F 0 "J?" H 3200 5750 50  0000 C CNN
F 1 "Conn_01x02_Female" H 3575 5875 50  0001 C CNN
F 2 "" H 3100 5850 50  0001 C CNN
F 3 "~" H 3100 5850 50  0001 C CNN
	1    3100 5850
	1    0    0    -1  
$EndComp
Connection ~ 2275 5850
$Comp
L Device:R R?
U 1 1 5FE1F9EA
P 2625 4800
F 0 "R?" H 2695 4846 50  0000 L CNN
F 1 "R" H 2695 4755 50  0000 L CNN
F 2 "" V 2555 4800 50  0001 C CNN
F 3 "~" H 2625 4800 50  0001 C CNN
	1    2625 4800
	1    0    0    -1  
$EndComp
$Comp
L Device:C C?
U 1 1 5FE1F9F0
P 2625 5100
F 0 "C?" H 2740 5146 50  0000 L CNN
F 1 "C" H 2740 5055 50  0000 L CNN
F 2 "" H 2663 4950 50  0001 C CNN
F 3 "~" H 2625 5100 50  0001 C CNN
	1    2625 5100
	1    0    0    -1  
$EndComp
Connection ~ 2275 4650
Connection ~ 2275 3425
$Comp
L Device:R R?
U 1 1 5FE62554
P 2625 3575
F 0 "R?" H 2695 3621 50  0000 L CNN
F 1 "R" H 2695 3530 50  0000 L CNN
F 2 "" V 2555 3575 50  0001 C CNN
F 3 "~" H 2625 3575 50  0001 C CNN
	1    2625 3575
	1    0    0    -1  
$EndComp
$Comp
L Device:C C?
U 1 1 5FE6255A
P 2625 3875
F 0 "C?" H 2740 3921 50  0000 L CNN
F 1 "C" H 2740 3830 50  0000 L CNN
F 2 "" H 2663 3725 50  0001 C CNN
F 3 "~" H 2625 3875 50  0001 C CNN
	1    2625 3875
	1    0    0    -1  
$EndComp
$Comp
L Connector:Conn_01x02_Female J?
U 1 1 5FEA0B4B
P 3125 4650
F 0 "J?" H 3225 4550 50  0000 C CNN
F 1 "Conn_01x02_Female" H 3600 4675 50  0001 C CNN
F 2 "" H 3125 4650 50  0001 C CNN
F 3 "~" H 3125 4650 50  0001 C CNN
	1    3125 4650
	1    0    0    -1  
$EndComp
$Comp
L Connector:Conn_01x02_Female J?
U 1 1 5FEB9F86
P 3125 3425
F 0 "J?" H 3225 3325 50  0000 C CNN
F 1 "Conn_01x02_Female" H 3600 3450 50  0001 C CNN
F 2 "" H 3125 3425 50  0001 C CNN
F 3 "~" H 3125 3425 50  0001 C CNN
	1    3125 3425
	1    0    0    -1  
$EndComp
Wire Wire Line
	2275 5850 2625 5850
Wire Wire Line
	2625 5850 2900 5850
Connection ~ 2625 5850
Wire Wire Line
	2275 4650 2625 4650
Connection ~ 2625 4650
Wire Wire Line
	2625 4650 2925 4650
Wire Wire Line
	2275 3425 2625 3425
Connection ~ 2625 3425
Wire Wire Line
	2625 3425 2925 3425
$Comp
L power:GNDREF #PWR?
U 1 1 6000DB95
P 1575 7025
F 0 "#PWR?" H 1575 6775 50  0001 C CNN
F 1 "GNDREF" H 1775 6925 50  0000 C CNN
F 2 "" H 1575 7025 50  0001 C CNN
F 3 "" H 1575 7025 50  0001 C CNN
	1    1575 7025
	1    0    0    -1  
$EndComp
Wire Wire Line
	1150 6775 2200 6775
Wire Wire Line
	1575 7025 1950 7025
$Comp
L power:GNDREF #PWR?
U 1 1 6002147C
P 2900 6500
F 0 "#PWR?" H 2900 6250 50  0001 C CNN
F 1 "GNDREF" H 3100 6400 50  0000 C CNN
F 2 "" H 2900 6500 50  0001 C CNN
F 3 "" H 2900 6500 50  0001 C CNN
	1    2900 6500
	1    0    0    -1  
$EndComp
Wire Wire Line
	2900 5950 2900 6475
Wire Wire Line
	2900 6475 2625 6475
Wire Wire Line
	2275 6475 2275 6375
Connection ~ 2900 6475
Wire Wire Line
	2900 6475 2900 6500
Wire Wire Line
	2625 6450 2625 6475
Connection ~ 2625 6475
Wire Wire Line
	2625 6475 2275 6475
$Comp
L power:GNDREF #PWR?
U 1 1 60043F94
P 2925 5325
F 0 "#PWR?" H 2925 5075 50  0001 C CNN
F 1 "GNDREF" H 3125 5225 50  0000 C CNN
F 2 "" H 2925 5325 50  0001 C CNN
F 3 "" H 2925 5325 50  0001 C CNN
	1    2925 5325
	1    0    0    -1  
$EndComp
Wire Wire Line
	2275 5175 2275 5325
Wire Wire Line
	2925 4750 2925 5325
Connection ~ 2925 5325
Wire Wire Line
	2625 5250 2625 5325
Wire Wire Line
	2275 5325 2625 5325
Connection ~ 2625 5325
Wire Wire Line
	2625 5325 2925 5325
Wire Wire Line
	2925 3525 2925 4075
Wire Wire Line
	2925 4075 2625 4075
Wire Wire Line
	2625 4075 2625 4025
Wire Wire Line
	2625 4075 2275 4075
Wire Wire Line
	2275 4075 2275 3950
Connection ~ 2625 4075
$Comp
L power:GNDREF #PWR?
U 1 1 600739FA
P 2925 4075
F 0 "#PWR?" H 2925 3825 50  0001 C CNN
F 1 "GNDREF" H 3125 3975 50  0000 C CNN
F 2 "" H 2925 4075 50  0001 C CNN
F 3 "" H 2925 4075 50  0001 C CNN
	1    2925 4075
	1    0    0    -1  
$EndComp
Connection ~ 2925 4075
$Comp
L power:GNDREF #PWR?
U 1 1 6007A146
P 2250 7550
F 0 "#PWR?" H 2250 7300 50  0001 C CNN
F 1 "GNDREF" H 2450 7450 50  0000 C CNN
F 2 "" H 2250 7550 50  0001 C CNN
F 3 "" H 2250 7550 50  0001 C CNN
	1    2250 7550
	1    0    0    -1  
$EndComp
Wire Wire Line
	1450 1925 2050 1925
Wire Wire Line
	1450 1450 1450 1925
$Comp
L Device:R R?
U 1 1 600A3194
P 2350 1775
F 0 "R?" H 2420 1821 50  0000 L CNN
F 1 "R" H 2420 1730 50  0000 L CNN
F 2 "" V 2280 1775 50  0001 C CNN
F 3 "~" H 2350 1775 50  0001 C CNN
	1    2350 1775
	1    0    0    -1  
$EndComp
Wire Wire Line
	2050 1350 2050 1625
$Comp
L Device:C C?
U 1 1 600AE490
P 2050 1775
F 0 "C?" H 2165 1821 50  0000 L CNN
F 1 "C" H 2165 1730 50  0000 L CNN
F 2 "" H 2088 1625 50  0001 C CNN
F 3 "~" H 2050 1775 50  0001 C CNN
	1    2050 1775
	1    0    0    -1  
$EndComp
$Comp
L Device:R R?
U 1 1 600B0041
P 2200 1350
F 0 "R?" V 1993 1350 50  0000 C CNN
F 1 "R" V 2084 1350 50  0000 C CNN
F 2 "" V 2130 1350 50  0001 C CNN
F 3 "~" H 2200 1350 50  0001 C CNN
	1    2200 1350
	0    1    1    0   
$EndComp
Connection ~ 2050 1350
Wire Wire Line
	2050 1925 2350 1925
Connection ~ 2050 1925
Wire Wire Line
	2350 1625 2350 1350
Connection ~ 2350 1350
$Comp
L Device:C C?
U 1 1 600C62EC
P 2600 1775
F 0 "C?" H 2715 1821 50  0000 L CNN
F 1 "C" H 2715 1730 50  0000 L CNN
F 2 "" H 2638 1625 50  0001 C CNN
F 3 "~" H 2600 1775 50  0001 C CNN
	1    2600 1775
	1    0    0    -1  
$EndComp
$Comp
L power:GND #PWR?
U 1 1 600CDCA3
P 2600 1925
F 0 "#PWR?" H 2600 1675 50  0001 C CNN
F 1 "GND" H 2605 1752 50  0000 C CNN
F 2 "" H 2600 1925 50  0001 C CNN
F 3 "" H 2600 1925 50  0001 C CNN
	1    2600 1925
	1    0    0    -1  
$EndComp
Wire Wire Line
	2600 1625 2600 1350
Wire Wire Line
	2350 1350 2600 1350
Wire Wire Line
	2600 1350 2900 1350
Connection ~ 2600 1350
$EndSCHEMATC
