EESchema Schematic File Version 4
EELAYER 30 0
EELAYER END
$Descr B 17000 11000
encoding utf-8
Sheet 1 1
Title "Four Probe Test Circuit"
Date ""
Rev ""
Comp "Edge Collective"
Comment1 ""
Comment2 ""
Comment3 ""
Comment4 ""
$EndDescr
$Comp
L four_probe-rescue:VCC-power #PWR045
U 1 1 5AC561A1
P 8900 9300
F 0 "#PWR045" H 8900 9150 50  0001 C CNN
F 1 "VCC" H 8900 9450 50  0000 C CNN
F 2 "" H 8900 9300 50  0001 C CNN
F 3 "" H 8900 9300 50  0001 C CNN
	1    8900 9300
	1    0    0    -1  
$EndComp
$Comp
L four_probe-rescue:GND-power #PWR046
U 1 1 5AC561C1
P 8950 8600
F 0 "#PWR046" H 8950 8350 50  0001 C CNN
F 1 "GND" H 8950 8450 50  0000 C CNN
F 2 "" H 8950 8600 50  0001 C CNN
F 3 "" H 8950 8600 50  0001 C CNN
	1    8950 8600
	1    0    0    -1  
$EndComp
$Comp
L four_probe-rescue:GNDREF-power #PWR042
U 1 1 5AC56327
P 8450 9150
F 0 "#PWR042" H 8450 8900 50  0001 C CNN
F 1 "GNDREF" H 8450 9000 50  0000 C CNN
F 2 "" H 8450 9150 50  0001 C CNN
F 3 "" H 8450 9150 50  0001 C CNN
	1    8450 9150
	1    0    0    -1  
$EndComp
$Comp
L four_probe-rescue:R R1
U 1 1 5AC576D1
P 1150 1500
F 0 "R1" V 1230 1500 50  0000 C CNN
F 1 "R" V 1150 1500 50  0000 C CNN
F 2 "Resistor_SMD:R_0603_1608Metric" V 1080 1500 50  0001 C CNN
F 3 "" H 1150 1500 50  0001 C CNN
	1    1150 1500
	-1   0    0    1   
$EndComp
$Comp
L four_probe-rescue:R R2
U 1 1 5AC57730
P 1150 1800
F 0 "R2" V 1230 1800 50  0000 C CNN
F 1 "R" V 1150 1800 50  0000 C CNN
F 2 "Resistor_SMD:R_0603_1608Metric" V 1080 1800 50  0001 C CNN
F 3 "" H 1150 1800 50  0001 C CNN
	1    1150 1800
	-1   0    0    1   
$EndComp
$Comp
L four_probe-rescue:GND-power #PWR07
U 1 1 5AC577D8
P 1150 1950
F 0 "#PWR07" H 1150 1700 50  0001 C CNN
F 1 "GND" H 1150 1800 50  0000 C CNN
F 2 "" H 1150 1950 50  0001 C CNN
F 3 "" H 1150 1950 50  0001 C CNN
	1    1150 1950
	1    0    0    -1  
$EndComp
$Comp
L four_probe-rescue:VCC-power #PWR017
U 1 1 5ACBF7E2
P 8450 4300
F 0 "#PWR017" H 8450 4150 50  0001 C CNN
F 1 "VCC" H 8450 4450 50  0000 C CNN
F 2 "" H 8450 4300 50  0001 C CNN
F 3 "" H 8450 4300 50  0001 C CNN
	1    8450 4300
	1    0    0    -1  
$EndComp
$Comp
L four_probe-rescue:R RS1
U 1 1 5ACC0CB0
P 10050 4600
F 0 "RS1" V 10130 4600 50  0000 C CNN
F 1 "430" V 10050 4600 50  0000 C CNN
F 2 "Resistor_SMD:R_0603_1608Metric" V 9980 4600 50  0001 C CNN
F 3 "" H 10050 4600 50  0001 C CNN
	1    10050 4600
	0    1    1    0   
$EndComp
$Comp
L four_probe-rescue:GNDREF-power #PWR019
U 1 1 5ACC1687
P 8450 5450
F 0 "#PWR019" H 8450 5200 50  0001 C CNN
F 1 "GNDREF" H 8450 5300 50  0000 C CNN
F 2 "" H 8450 5450 50  0001 C CNN
F 3 "" H 8450 5450 50  0001 C CNN
	1    8450 5450
	1    0    0    -1  
$EndComp
$Comp
L four_probe-rescue:GND-power #PWR023
U 1 1 5ACC17A7
P 8850 5800
F 0 "#PWR023" H 8850 5550 50  0001 C CNN
F 1 "GND" H 8850 5650 50  0000 C CNN
F 2 "" H 8850 5800 50  0001 C CNN
F 3 "" H 8850 5800 50  0001 C CNN
	1    8850 5800
	1    0    0    -1  
$EndComp
$Comp
L four_probe-rescue:VCC-power #PWR022
U 1 1 5ACC1C32
P 8850 5200
F 0 "#PWR022" H 8850 5050 50  0001 C CNN
F 1 "VCC" H 8850 5350 50  0000 C CNN
F 2 "" H 8850 5200 50  0001 C CNN
F 3 "" H 8850 5200 50  0001 C CNN
	1    8850 5200
	1    0    0    -1  
$EndComp
$Comp
L four_probe-rescue:GND-power #PWR018
U 1 1 5ACC2EEB
P 8450 4900
F 0 "#PWR018" H 8450 4650 50  0001 C CNN
F 1 "GND" H 8450 4750 50  0000 C CNN
F 2 "" H 8450 4900 50  0001 C CNN
F 3 "" H 8450 4900 50  0001 C CNN
	1    8450 4900
	1    0    0    -1  
$EndComp
Text Notes 7750 4350 0    60   ~ 0
Gain
$Comp
L four_probe-rescue:R R41
U 1 1 5ACC8F76
P 9800 8900
F 0 "R41" V 9700 8900 50  0000 C CNN
F 1 "430" V 9800 8900 50  0000 C CNN
F 2 "Resistor_SMD:R_0603_1608Metric" V 9730 8900 50  0001 C CNN
F 3 "" H 9800 8900 50  0001 C CNN
	1    9800 8900
	0    1    1    0   
$EndComp
$Comp
L four_probe-rescue:GND-power #PWR064
U 1 1 5ACD153C
P 10700 9300
F 0 "#PWR064" H 10700 9050 50  0001 C CNN
F 1 "GND" H 10700 9150 50  0000 C CNN
F 2 "" H 10700 9300 50  0001 C CNN
F 3 "" H 10700 9300 50  0001 C CNN
	1    10700 9300
	1    0    0    -1  
$EndComp
$Comp
L four_probe-rescue:VCC-power #PWR063
U 1 1 5ACD1542
P 10700 8700
F 0 "#PWR063" H 10700 8550 50  0001 C CNN
F 1 "VCC" H 10700 8850 50  0000 C CNN
F 2 "" H 10700 8700 50  0001 C CNN
F 3 "" H 10700 8700 50  0001 C CNN
	1    10700 8700
	1    0    0    -1  
$EndComp
$Comp
L four_probe-rescue:R RF2
U 1 1 5ACD1549
P 10800 9650
F 0 "RF2" V 10880 9650 50  0000 C CNN
F 1 "1K" V 10800 9650 50  0000 C CNN
F 2 "Resistor_SMD:R_0603_1608Metric" V 10730 9650 50  0001 C CNN
F 3 "" H 10800 9650 50  0001 C CNN
	1    10800 9650
	0    -1   -1   0   
$EndComp
$Comp
L four_probe-rescue:C C84
U 1 1 5ACDB237
P 10100 9050
F 0 "C84" H 10125 9150 50  0000 L CNN
F 1 "1nF" H 9900 9150 50  0000 L CNN
F 2 "Capacitor_SMD:C_0603_1608Metric" H 10138 8900 50  0001 C CNN
F 3 "" H 10100 9050 50  0001 C CNN
	1    10100 9050
	-1   0    0    1   
$EndComp
$Comp
L four_probe-rescue:GNDREF-power #PWR059
U 1 1 5ACDB23E
P 10100 9200
F 0 "#PWR059" H 10100 8950 50  0001 C CNN
F 1 "GNDREF" H 10100 9050 50  0000 C CNN
F 2 "" H 10100 9200 50  0001 C CNN
F 3 "" H 10100 9200 50  0001 C CNN
	1    10100 9200
	1    0    0    -1  
$EndComp
$Comp
L four_probe-rescue:C CF2
U 1 1 5ACE0809
P 10800 9850
F 0 "CF2" V 10850 9650 50  0000 L CNN
F 1 "1nF" V 10850 9950 50  0000 L CNN
F 2 "Capacitor_SMD:C_0603_1608Metric" H 10838 9700 50  0001 C CNN
F 3 "" H 10800 9850 50  0001 C CNN
	1    10800 9850
	0    1    1    0   
$EndComp
$Comp
L four_probe-rescue:GND-power #PWR09
U 1 1 5ACF0950
P 1650 2050
F 0 "#PWR09" H 1650 1800 50  0001 C CNN
F 1 "GND" H 1650 1900 50  0000 C CNN
F 2 "" H 1650 2050 50  0001 C CNN
F 3 "" H 1650 2050 50  0001 C CNN
	1    1650 2050
	1    0    0    -1  
$EndComp
$Comp
L four_probe-rescue:VCC-power #PWR08
U 1 1 5ACF09BE
P 1650 1450
F 0 "#PWR08" H 1650 1300 50  0001 C CNN
F 1 "VCC" H 1650 1600 50  0000 C CNN
F 2 "" H 1650 1450 50  0001 C CNN
F 3 "" H 1650 1450 50  0001 C CNN
	1    1650 1450
	1    0    0    -1  
$EndComp
$Comp
L four_probe-rescue:GNDREF-power #PWR011
U 1 1 5ACF137B
P 2400 1750
F 0 "#PWR011" H 2400 1500 50  0001 C CNN
F 1 "GNDREF" H 2400 1600 50  0000 C CNN
F 2 "" H 2400 1750 50  0001 C CNN
F 3 "" H 2400 1750 50  0001 C CNN
	1    2400 1750
	1    0    0    -1  
$EndComp
Text GLabel 9200 8500 0    60   Input ~ 0
TIA
$Comp
L four_probe-rescue:C CT4
U 1 1 5AE83B4F
P 8900 8200
F 0 "CT4" V 8850 8000 50  0000 L CNN
F 1 "1nF" V 8850 8250 50  0000 L CNN
F 2 "Capacitor_SMD:C_0603_1608Metric" H 8938 8050 50  0001 C CNN
F 3 "" H 8900 8200 50  0001 C CNN
	1    8900 8200
	0    1    1    0   
$EndComp
Text Notes 10400 7900 0    100  ~ 0
CURRENT SENSE
Text Notes 12650 4700 0    100  ~ 0
VOLTAGE SENSE, 2::3
Text Notes 14150 9700 0    200  ~ 0
EC-4P v_0.1
$Comp
L four_probe-rescue:AD623 U4
U 1 1 5AE759DA
P 8550 4600
F 0 "U4" H 8700 4900 50  0000 C CNN
F 1 "AD623" H 8700 4800 50  0000 C CNN
F 2 "Package_SO:SOIC-8_3.9x4.9mm_P1.27mm" H 8550 4600 50  0001 C CNN
F 3 "" H 8550 4600 50  0001 C CNN
	1    8550 4600
	1    0    0    -1  
$EndComp
$Comp
L four_probe-rescue:LMC6482 U1
U 1 1 5AE77B72
P 1750 1750
F 0 "U1" H 1750 1950 50  0000 L CNN
F 1 "LMC6482" H 1750 1550 50  0000 L CNN
F 2 "Package_SO:SOIC-8_3.9x4.9mm_P1.27mm" H 1750 1750 50  0001 C CNN
F 3 "" H 1750 1750 50  0001 C CNN
	1    1750 1750
	1    0    0    -1  
$EndComp
Text Notes 1100 1050 0    98   ~ 0
Virtual Ground
$Comp
L four_probe-rescue:VCC-power #PWR06
U 1 1 5AE9A1A3
P 1150 1350
F 0 "#PWR06" H 1150 1200 50  0001 C CNN
F 1 "VCC" H 1150 1500 50  0000 C CNN
F 2 "" H 1150 1350 50  0001 C CNN
F 3 "" H 1150 1350 50  0001 C CNN
	1    1150 1350
	1    0    0    -1  
$EndComp
$Comp
L four_probe-rescue:LMC6482 U3
U 2 1 5AEE063A
P 8950 5500
F 0 "U3" H 8950 5700 50  0000 L CNN
F 1 "LMC6482" H 8950 5300 50  0000 L CNN
F 2 "Package_SO:SOIC-8_3.9x4.9mm_P1.27mm" H 8950 5500 50  0001 C CNN
F 3 "" H 8950 5500 50  0001 C CNN
	2    8950 5500
	1    0    0    -1  
$EndComp
$Comp
L four_probe-rescue:LMC6484 U6
U 1 1 5AEF3A68
P 8900 8900
F 0 "U6" H 8750 8550 50  0000 L CNN
F 1 "LMC6484" H 8950 9050 50  0000 L CNN
F 2 "Package_SO:SOIC-14_3.9x8.7mm_P1.27mm" H 8850 9000 50  0001 C CNN
F 3 "" H 8950 9100 50  0001 C CNN
	1    8900 8900
	1    0    0    1   
$EndComp
$Comp
L four_probe-rescue:LMC6484 U6
U 2 1 5AEF8CC7
P 10800 9000
F 0 "U6" H 10800 9200 50  0000 L CNN
F 1 "LMC6484" H 10800 8800 50  0000 L CNN
F 2 "Package_SO:SOIC-14_3.9x8.7mm_P1.27mm" H 10750 9100 50  0001 C CNN
F 3 "" H 10850 9200 50  0001 C CNN
	2    10800 9000
	1    0    0    -1  
$EndComp
Text GLabel 9150 4150 2    60   Input ~ 0
V23A
Text GLabel 11450 9000 2    60   Input ~ 0
TIB
Wire Wire Line
	8150 4750 8150 4700
Wire Wire Line
	8150 4450 8150 4500
Wire Wire Line
	9200 8500 9200 8900
Wire Wire Line
	2050 1750 2400 1750
Wire Wire Line
	2050 2250 2050 1750
Wire Wire Line
	1450 2250 2050 2250
Wire Wire Line
	1450 1850 1450 2250
Wire Wire Line
	1150 1650 1450 1650
Connection ~ 10100 8900
Wire Wire Line
	9950 8900 10100 8900
Wire Wire Line
	8950 4600 9900 4600
Wire Wire Line
	8150 4800 8150 5350
Wire Wire Line
	9250 4900 8650 4900
Wire Wire Line
	9250 4900 9250 5500
Wire Wire Line
	8450 5400 8450 5450
Wire Wire Line
	8650 5400 8450 5400
Connection ~ 9250 5500
Wire Wire Line
	9250 6100 8650 6100
Wire Wire Line
	8650 6100 8650 5600
Wire Wire Line
	8450 9000 8450 9150
Wire Wire Line
	8600 9000 8450 9000
Wire Wire Line
	8800 8600 8950 8600
Wire Wire Line
	8800 9300 8900 9300
Wire Wire Line
	8800 9200 8800 9300
Wire Wire Line
	9150 4150 8950 4150
Wire Wire Line
	8950 4150 8950 4600
Wire Wire Line
	10500 9100 10500 9650
Wire Wire Line
	11100 9000 11100 9650
Wire Wire Line
	11100 9850 10950 9850
Wire Wire Line
	10500 9850 10650 9850
Wire Wire Line
	10650 9650 10500 9650
Connection ~ 10500 9650
Wire Wire Line
	10950 9650 11100 9650
Connection ~ 11100 9650
Connection ~ 8950 4600
Wire Wire Line
	11100 9000 11450 9000
Connection ~ 11100 9000
Connection ~ 2050 1750
Connection ~ 1150 1650
Connection ~ 8050 4450
Wire Wire Line
	8150 4750 8050 4750
Text Notes 1250 5800 0    98   ~ 0
Probe Connectors
Wire Wire Line
	10100 8900 10500 8900
Wire Wire Line
	9250 5500 9250 6100
Wire Wire Line
	10500 9650 10500 9850
Wire Wire Line
	11100 9650 11100 9850
Wire Wire Line
	8050 4450 8150 4450
Connection ~ 8050 4750
Wire Wire Line
	9650 8900 9350 8900
Connection ~ 9200 8900
$Comp
L four_probe-rescue:CONSMA001-SMD-G-dk_Coaxial-Connectors-RF J4
U 1 1 5D0DB04E
P 1700 6450
F 0 "J4" H 1778 6697 60  0000 C CNN
F 1 "CONSMA001-SMD-G" H 1778 6591 60  0000 C CNN
F 2 "digikey-footprints:RF_SMA_Receptical_Vertical_CONSMA001-SMD-G" H 1900 6650 60  0001 L CNN
F 3 "https://linxtechnologies.com/wp/wp-content/uploads/consma001-smd-g.pdf" H 1900 6750 60  0001 L CNN
F 4 "CONSMA001-SMD-G-ND" H 1900 6850 60  0001 L CNN "Digi-Key_PN"
F 5 "CONSMA001-SMD-G" H 1900 6950 60  0001 L CNN "MPN"
F 6 "Connectors, Interconnects" H 1900 7050 60  0001 L CNN "Category"
F 7 "Coaxial Connectors (RF)" H 1900 7150 60  0001 L CNN "Family"
F 8 "https://linxtechnologies.com/wp/wp-content/uploads/consma001-smd-g.pdf" H 1900 7250 60  0001 L CNN "DK_Datasheet_Link"
F 9 "/product-detail/en/linx-technologies-inc/CONSMA001-SMD-G/CONSMA001-SMD-G-ND/4496569" H 1900 7350 60  0001 L CNN "DK_Detail_Page"
F 10 "CONN SMA RCPT STR 50 OHM SMD" H 1900 7450 60  0001 L CNN "Description"
F 11 "Linx Technologies Inc." H 1900 7550 60  0001 L CNN "Manufacturer"
F 12 "Active" H 1900 7650 60  0001 L CNN "Status"
	1    1700 6450
	1    0    0    -1  
$EndComp
$Comp
L four_probe-rescue:CONSMA001-SMD-G-dk_Coaxial-Connectors-RF J3
U 1 1 5D1B6FF7
P 1700 7100
F 0 "J3" H 1778 7347 60  0000 C CNN
F 1 "CONSMA001-SMD-G" H 1778 7241 60  0000 C CNN
F 2 "digikey-footprints:RF_SMA_Receptical_Vertical_CONSMA001-SMD-G" H 1900 7300 60  0001 L CNN
F 3 "https://linxtechnologies.com/wp/wp-content/uploads/consma001-smd-g.pdf" H 1900 7400 60  0001 L CNN
F 4 "CONSMA001-SMD-G-ND" H 1900 7500 60  0001 L CNN "Digi-Key_PN"
F 5 "CONSMA001-SMD-G" H 1900 7600 60  0001 L CNN "MPN"
F 6 "Connectors, Interconnects" H 1900 7700 60  0001 L CNN "Category"
F 7 "Coaxial Connectors (RF)" H 1900 7800 60  0001 L CNN "Family"
F 8 "https://linxtechnologies.com/wp/wp-content/uploads/consma001-smd-g.pdf" H 1900 7900 60  0001 L CNN "DK_Datasheet_Link"
F 9 "/product-detail/en/linx-technologies-inc/CONSMA001-SMD-G/CONSMA001-SMD-G-ND/4496569" H 1900 8000 60  0001 L CNN "DK_Detail_Page"
F 10 "CONN SMA RCPT STR 50 OHM SMD" H 1900 8100 60  0001 L CNN "Description"
F 11 "Linx Technologies Inc." H 1900 8200 60  0001 L CNN "Manufacturer"
F 12 "Active" H 1900 8300 60  0001 L CNN "Status"
	1    1700 7100
	1    0    0    -1  
$EndComp
$Comp
L four_probe-rescue:CONSMA001-SMD-G-dk_Coaxial-Connectors-RF J5
U 1 1 5D1B741A
P 1700 7700
F 0 "J5" H 1778 7947 60  0000 C CNN
F 1 "CONSMA001-SMD-G" H 1778 7841 60  0000 C CNN
F 2 "digikey-footprints:RF_SMA_Receptical_Vertical_CONSMA001-SMD-G" H 1900 7900 60  0001 L CNN
F 3 "https://linxtechnologies.com/wp/wp-content/uploads/consma001-smd-g.pdf" H 1900 8000 60  0001 L CNN
F 4 "CONSMA001-SMD-G-ND" H 1900 8100 60  0001 L CNN "Digi-Key_PN"
F 5 "CONSMA001-SMD-G" H 1900 8200 60  0001 L CNN "MPN"
F 6 "Connectors, Interconnects" H 1900 8300 60  0001 L CNN "Category"
F 7 "Coaxial Connectors (RF)" H 1900 8400 60  0001 L CNN "Family"
F 8 "https://linxtechnologies.com/wp/wp-content/uploads/consma001-smd-g.pdf" H 1900 8500 60  0001 L CNN "DK_Datasheet_Link"
F 9 "/product-detail/en/linx-technologies-inc/CONSMA001-SMD-G/CONSMA001-SMD-G-ND/4496569" H 1900 8600 60  0001 L CNN "DK_Detail_Page"
F 10 "CONN SMA RCPT STR 50 OHM SMD" H 1900 8700 60  0001 L CNN "Description"
F 11 "Linx Technologies Inc." H 1900 8800 60  0001 L CNN "Manufacturer"
F 12 "Active" H 1900 8900 60  0001 L CNN "Status"
	1    1700 7700
	1    0    0    -1  
$EndComp
$Comp
L four_probe-rescue:CONSMA001-SMD-G-dk_Coaxial-Connectors-RF J6
U 1 1 5D1B7803
P 1700 8300
F 0 "J6" H 1778 8547 60  0000 C CNN
F 1 "CONSMA001-SMD-G" H 1778 8441 60  0000 C CNN
F 2 "digikey-footprints:RF_SMA_Receptical_Vertical_CONSMA001-SMD-G" H 1900 8500 60  0001 L CNN
F 3 "https://linxtechnologies.com/wp/wp-content/uploads/consma001-smd-g.pdf" H 1900 8600 60  0001 L CNN
F 4 "CONSMA001-SMD-G-ND" H 1900 8700 60  0001 L CNN "Digi-Key_PN"
F 5 "CONSMA001-SMD-G" H 1900 8800 60  0001 L CNN "MPN"
F 6 "Connectors, Interconnects" H 1900 8900 60  0001 L CNN "Category"
F 7 "Coaxial Connectors (RF)" H 1900 9000 60  0001 L CNN "Family"
F 8 "https://linxtechnologies.com/wp/wp-content/uploads/consma001-smd-g.pdf" H 1900 9100 60  0001 L CNN "DK_Datasheet_Link"
F 9 "/product-detail/en/linx-technologies-inc/CONSMA001-SMD-G/CONSMA001-SMD-G-ND/4496569" H 1900 9200 60  0001 L CNN "DK_Detail_Page"
F 10 "CONN SMA RCPT STR 50 OHM SMD" H 1900 9300 60  0001 L CNN "Description"
F 11 "Linx Technologies Inc." H 1900 9400 60  0001 L CNN "Manufacturer"
F 12 "Active" H 1900 9500 60  0001 L CNN "Status"
	1    1700 8300
	1    0    0    -1  
$EndComp
$Comp
L four_probe-rescue:GND-power #PWR0106
U 1 1 5D1B93BB
P 1700 8500
F 0 "#PWR0106" H 1700 8250 50  0001 C CNN
F 1 "GND" H 1700 8350 50  0000 C CNN
F 2 "" H 1700 8500 50  0001 C CNN
F 3 "" H 1700 8500 50  0001 C CNN
	1    1700 8500
	1    0    0    -1  
$EndComp
$Comp
L four_probe-rescue:GND-power #PWR0107
U 1 1 5D1B9C78
P 1700 7900
F 0 "#PWR0107" H 1700 7650 50  0001 C CNN
F 1 "GND" H 1700 7750 50  0000 C CNN
F 2 "" H 1700 7900 50  0001 C CNN
F 3 "" H 1700 7900 50  0001 C CNN
	1    1700 7900
	1    0    0    -1  
$EndComp
$Comp
L four_probe-rescue:GND-power #PWR0108
U 1 1 5D1BA208
P 1700 7300
F 0 "#PWR0108" H 1700 7050 50  0001 C CNN
F 1 "GND" H 1700 7150 50  0000 C CNN
F 2 "" H 1700 7300 50  0001 C CNN
F 3 "" H 1700 7300 50  0001 C CNN
	1    1700 7300
	1    0    0    -1  
$EndComp
$Comp
L four_probe-rescue:GND-power #PWR0109
U 1 1 5D1BA37A
P 1700 6650
F 0 "#PWR0109" H 1700 6400 50  0001 C CNN
F 1 "GND" H 1700 6500 50  0000 C CNN
F 2 "" H 1700 6650 50  0001 C CNN
F 3 "" H 1700 6650 50  0001 C CNN
	1    1700 6650
	1    0    0    -1  
$EndComp
Text GLabel 1900 6450 2    60   Input ~ 0
P1
Text GLabel 1900 7100 2    60   Input ~ 0
P2
Text GLabel 1900 7700 2    60   Input ~ 0
P3
Text GLabel 1900 8300 2    60   Input ~ 0
P4
$Comp
L four_probe-rescue:R RG23
U 1 1 5ACBDA2E
P 8050 4600
F 0 "RG23" V 8150 4600 50  0000 C CNN
F 1 "R" V 8050 4600 50  0000 C CNN
F 2 "Resistor_SMD:R_0603_1608Metric" V 7980 4600 50  0001 C CNN
F 3 "" H 8050 4600 50  0001 C CNN
	1    8050 4600
	-1   0    0    1   
$EndComp
Wire Wire Line
	8600 7250 8850 7250
Wire Wire Line
	8600 7250 8600 7450
Wire Wire Line
	8750 7450 8600 7450
Connection ~ 8600 7450
Wire Wire Line
	8600 7450 8600 8000
Wire Wire Line
	9050 7450 9350 7450
$Comp
L four_probe-rescue:Conn_01x02 JR?
U 1 1 5FA4AFE9
P 8850 7800
F 0 "JR?" H 8850 7900 50  0000 C CNN
F 1 "Conn_01x02" H 8850 7600 50  0000 C CNN
F 2 "Connector_PinSocket_2.54mm:PinSocket_1x02_P2.54mm_Vertical" H 8850 7800 50  0001 C CNN
F 3 "" H 8850 7800 50  0001 C CNN
	1    8850 7800
	0    -1   -1   0   
$EndComp
Wire Wire Line
	8750 8200 8600 8200
Connection ~ 8600 8200
Wire Wire Line
	8600 8200 8600 8800
Wire Wire Line
	8850 8000 8600 8000
Connection ~ 8600 8000
Wire Wire Line
	8600 8000 8600 8200
Wire Wire Line
	9350 7450 9350 8000
Connection ~ 9350 8900
Wire Wire Line
	9350 8900 9200 8900
Wire Wire Line
	9050 8200 9350 8200
Connection ~ 9350 8200
Wire Wire Line
	9350 8200 9350 8900
Wire Wire Line
	8950 8000 9350 8000
Connection ~ 9350 8000
Wire Wire Line
	9350 8000 9350 8200
Wire Wire Line
	8950 7250 9350 7250
Wire Wire Line
	9350 7250 9350 7450
Connection ~ 9350 7450
$Comp
L Device:R R?
U 1 1 5FA38F32
P 8900 7450
F 0 "R?" V 8693 7450 50  0000 C CNN
F 1 "R" V 8784 7450 50  0000 C CNN
F 2 "" V 8830 7450 50  0001 C CNN
F 3 "~" H 8900 7450 50  0001 C CNN
	1    8900 7450
	0    1    1    0   
$EndComp
$Comp
L four_probe-rescue:Conn_01x02 JR4
U 1 1 5AFF8263
P 8850 7050
F 0 "JR4" H 8850 7150 50  0000 C CNN
F 1 "Conn_01x02" H 8850 6850 50  0000 C CNN
F 2 "Connector_PinSocket_2.54mm:PinSocket_1x02_P2.54mm_Vertical" H 8850 7050 50  0001 C CNN
F 3 "" H 8850 7050 50  0001 C CNN
	1    8850 7050
	0    -1   -1   0   
$EndComp
$Comp
L four_probe-rescue:R RF5
U 1 1 5AE38EFA
P 11100 5400
F 0 "RF5" V 11180 5400 50  0000 C CNN
F 1 "1K" V 11100 5400 50  0000 C CNN
F 2 "Resistor_SMD:R_0603_1608Metric" V 11030 5400 50  0001 C CNN
F 3 "" H 11100 5400 50  0001 C CNN
	1    11100 5400
	0    -1   -1   0   
$EndComp
$Comp
L four_probe-rescue:C CF4
U 1 1 5AE38F00
P 11100 5700
F 0 "CF4" V 11150 5500 50  0000 L CNN
F 1 "1nF" V 11150 5750 50  0000 L CNN
F 2 "Capacitor_SMD:C_0603_1608Metric" H 11138 5550 50  0001 C CNN
F 3 "" H 11100 5700 50  0001 C CNN
	1    11100 5700
	0    1    1    0   
$EndComp
Connection ~ 11400 5400
Wire Wire Line
	11400 4700 11400 5400
Wire Wire Line
	11400 5400 11400 5700
Wire Wire Line
	11400 5700 11250 5700
Wire Wire Line
	11400 5400 11250 5400
Connection ~ 10800 5400
Wire Wire Line
	10800 4800 10800 5400
Wire Wire Line
	10800 5400 10800 5700
Wire Wire Line
	10800 5400 10950 5400
Wire Wire Line
	10800 5700 10950 5700
Connection ~ 11400 4700
Wire Wire Line
	10350 4600 10800 4600
Wire Wire Line
	11400 4700 11750 4700
Wire Wire Line
	10200 4600 10350 4600
Connection ~ 10350 4600
Text GLabel 11750 4700 2    60   Input ~ 0
V23
$Comp
L four_probe-rescue:LMC6484 U5
U 3 1 5AEEB02F
P 11100 4700
F 0 "U5" H 11100 4900 50  0000 L CNN
F 1 "LMC6484" H 11100 4500 50  0000 L CNN
F 2 "Package_SO:SOIC-14_3.9x8.7mm_P1.27mm" H 11050 4800 50  0001 C CNN
F 3 "" H 11150 4900 50  0001 C CNN
	3    11100 4700
	1    0    0    -1  
$EndComp
$Comp
L four_probe-rescue:GNDREF-power #PWR029
U 1 1 5AE38F0E
P 10350 4900
F 0 "#PWR029" H 10350 4650 50  0001 C CNN
F 1 "GNDREF" H 10350 4750 50  0000 C CNN
F 2 "" H 10350 4900 50  0001 C CNN
F 3 "" H 10350 4900 50  0001 C CNN
	1    10350 4900
	1    0    0    -1  
$EndComp
$Comp
L four_probe-rescue:C C3
U 1 1 5AE38F08
P 10350 4750
F 0 "C3" H 10400 4850 50  0000 L CNN
F 1 "1 nF" H 10150 4850 50  0000 L CNN
F 2 "Capacitor_SMD:C_0603_1608Metric" H 10388 4600 50  0001 C CNN
F 3 "" H 10350 4750 50  0001 C CNN
	1    10350 4750
	-1   0    0    1   
$EndComp
$Comp
L four_probe-rescue:VCC-power #PWR035
U 1 1 5AE38EF4
P 11000 4400
F 0 "#PWR035" H 11000 4250 50  0001 C CNN
F 1 "VCC" H 11000 4550 50  0000 C CNN
F 2 "" H 11000 4400 50  0001 C CNN
F 3 "" H 11000 4400 50  0001 C CNN
	1    11000 4400
	1    0    0    -1  
$EndComp
$Comp
L four_probe-rescue:GND-power #PWR036
U 1 1 5AE38EEE
P 11000 5000
F 0 "#PWR036" H 11000 4750 50  0001 C CNN
F 1 "GND" H 11000 4850 50  0000 C CNN
F 2 "" H 11000 5000 50  0001 C CNN
F 3 "" H 11000 5000 50  0001 C CNN
	1    11000 5000
	1    0    0    -1  
$EndComp
$Comp
L four_probe-rescue:R RG12
U 1 1 5AE5B09A
P 7950 1750
F 0 "RG12" V 8050 1750 50  0000 C CNN
F 1 "R" V 7950 1750 50  0000 C CNN
F 2 "Resistor_SMD:R_0603_1608Metric" V 7880 1750 50  0001 C CNN
F 3 "" H 7950 1750 50  0001 C CNN
	1    7950 1750
	-1   0    0    1   
$EndComp
$Comp
L four_probe-rescue:GNDREF-power #PWR016
U 1 1 5AE605AD
P 8450 2600
F 0 "#PWR016" H 8450 2350 50  0001 C CNN
F 1 "GNDREF" H 8450 2450 50  0000 C CNN
F 2 "" H 8450 2600 50  0001 C CNN
F 3 "" H 8450 2600 50  0001 C CNN
	1    8450 2600
	1    0    0    -1  
$EndComp
$Comp
L four_probe-rescue:GND-power #PWR021
U 1 1 5AE605B3
P 8850 2950
F 0 "#PWR021" H 8850 2700 50  0001 C CNN
F 1 "GND" H 8850 2800 50  0000 C CNN
F 2 "" H 8850 2950 50  0001 C CNN
F 3 "" H 8850 2950 50  0001 C CNN
	1    8850 2950
	1    0    0    -1  
$EndComp
$Comp
L four_probe-rescue:VCC-power #PWR020
U 1 1 5AE605B9
P 8850 2350
F 0 "#PWR020" H 8850 2200 50  0001 C CNN
F 1 "VCC" H 8850 2500 50  0000 C CNN
F 2 "" H 8850 2350 50  0001 C CNN
F 3 "" H 8850 2350 50  0001 C CNN
	1    8850 2350
	1    0    0    -1  
$EndComp
$Comp
L four_probe-rescue:GND-power #PWR015
U 1 1 5AE605BF
P 8450 2050
F 0 "#PWR015" H 8450 1800 50  0001 C CNN
F 1 "GND" H 8450 1900 50  0000 C CNN
F 2 "" H 8450 2050 50  0001 C CNN
F 3 "" H 8450 2050 50  0001 C CNN
	1    8450 2050
	1    0    0    -1  
$EndComp
$Comp
L four_probe-rescue:R RS3
U 1 1 5AE62674
P 10050 1750
F 0 "RS3" V 10130 1750 50  0000 C CNN
F 1 "430" V 10050 1750 50  0000 C CNN
F 2 "Resistor_SMD:R_0603_1608Metric" V 9980 1750 50  0001 C CNN
F 3 "" H 10050 1750 50  0001 C CNN
	1    10050 1750
	0    1    1    0   
$EndComp
Text Notes 12500 1900 0    100  ~ 0
VOLTAGE SENSE, 1::2
$Comp
L four_probe-rescue:AD623 U2
U 1 1 5AE73F5C
P 8550 1750
F 0 "U2" H 8700 2050 50  0000 C CNN
F 1 "AD623" H 8700 1950 50  0000 C CNN
F 2 "Package_SO:SOIC-8_3.9x4.9mm_P1.27mm" H 8550 1750 50  0001 C CNN
F 3 "" H 8550 1750 50  0001 C CNN
	1    8550 1750
	1    0    0    -1  
$EndComp
$Comp
L four_probe-rescue:LMC6482 U3
U 1 1 5AEDECF4
P 8950 2650
F 0 "U3" H 8950 2850 50  0000 L CNN
F 1 "LMC6482" H 8950 2450 50  0000 L CNN
F 2 "Package_SO:SOIC-8_3.9x4.9mm_P1.27mm" H 8950 2650 50  0001 C CNN
F 3 "" H 8950 2650 50  0001 C CNN
	1    8950 2650
	1    0    0    -1  
$EndComp
Text GLabel 9050 1250 2    60   Input ~ 0
V12A
$Comp
L four_probe-rescue:VCC-power #PWR014
U 1 1 5B00928F
P 8450 1450
F 0 "#PWR014" H 8450 1300 50  0001 C CNN
F 1 "VCC" H 8450 1600 50  0000 C CNN
F 2 "" H 8450 1450 50  0001 C CNN
F 3 "" H 8450 1450 50  0001 C CNN
	1    8450 1450
	1    0    0    -1  
$EndComp
Wire Wire Line
	9250 2050 8650 2050
Wire Wire Line
	9250 2050 9250 2650
Wire Wire Line
	8450 2550 8450 2600
Wire Wire Line
	8650 2550 8450 2550
Connection ~ 9250 2650
Wire Wire Line
	9250 3250 8650 3250
Wire Wire Line
	8650 3250 8650 2750
Wire Wire Line
	8150 1900 8150 1850
Wire Wire Line
	8150 1600 8150 1650
Wire Wire Line
	8950 1750 8950 1250
Wire Wire Line
	8950 1250 9050 1250
Wire Wire Line
	9250 2650 9250 3250
Wire Wire Line
	7950 1600 8150 1600
Wire Wire Line
	7950 1900 8150 1900
Connection ~ 8950 1750
Wire Wire Line
	8950 1750 9900 1750
$Comp
L four_probe-rescue:LMC6484 U5
U 1 1 5AEEA79C
P 11100 1850
F 0 "U5" H 11100 2050 50  0000 L CNN
F 1 "LMC6484" H 11100 1650 50  0000 L CNN
F 2 "Package_SO:SOIC-14_3.9x8.7mm_P1.27mm" H 11050 1950 50  0001 C CNN
F 3 "" H 11150 2050 50  0001 C CNN
	1    11100 1850
	1    0    0    -1  
$EndComp
Connection ~ 11400 1850
Wire Wire Line
	11400 1850 11700 1850
Wire Wire Line
	10800 2850 10950 2850
Wire Wire Line
	10800 2550 10950 2550
Wire Wire Line
	10800 2550 10800 2850
Wire Wire Line
	10800 1950 10800 2550
Connection ~ 10800 2550
Wire Wire Line
	11400 2550 11250 2550
Wire Wire Line
	11400 2850 11250 2850
Wire Wire Line
	11400 2550 11400 2850
Wire Wire Line
	11400 1850 11400 2550
Connection ~ 11400 2550
Text GLabel 11700 1850 2    60   Input ~ 0
V12
$Comp
L four_probe-rescue:GNDREF-power #PWR027
U 1 1 5AE626D8
P 10350 2050
F 0 "#PWR027" H 10350 1800 50  0001 C CNN
F 1 "GNDREF" H 10350 1900 50  0000 C CNN
F 2 "" H 10350 2050 50  0001 C CNN
F 3 "" H 10350 2050 50  0001 C CNN
	1    10350 2050
	1    0    0    -1  
$EndComp
Wire Wire Line
	10350 1750 10800 1750
Wire Wire Line
	10200 1750 10350 1750
Connection ~ 10350 1750
$Comp
L four_probe-rescue:C C1
U 1 1 5AE626D2
P 10350 1900
F 0 "C1" H 10400 2000 50  0000 L CNN
F 1 "1 nF" H 10150 2000 50  0000 L CNN
F 2 "Capacitor_SMD:C_0603_1608Metric" H 10388 1750 50  0001 C CNN
F 3 "" H 10350 1900 50  0001 C CNN
	1    10350 1900
	-1   0    0    1   
$EndComp
$Comp
L four_probe-rescue:C CF1
U 1 1 5AE626CB
P 11100 2850
F 0 "CF1" V 11150 2650 50  0000 L CNN
F 1 "1nF" V 11150 2900 50  0000 L CNN
F 2 "Capacitor_SMD:C_0603_1608Metric" H 11138 2700 50  0001 C CNN
F 3 "" H 11100 2850 50  0001 C CNN
	1    11100 2850
	0    1    1    0   
$EndComp
$Comp
L four_probe-rescue:R RF3
U 1 1 5AE626C5
P 11100 2550
F 0 "RF3" V 11180 2550 50  0000 C CNN
F 1 "1K" V 11100 2550 50  0000 C CNN
F 2 "Resistor_SMD:R_0603_1608Metric" V 11030 2550 50  0001 C CNN
F 3 "" H 11100 2550 50  0001 C CNN
	1    11100 2550
	0    -1   -1   0   
$EndComp
$Comp
L four_probe-rescue:VCC-power #PWR031
U 1 1 5AE626BF
P 11000 1550
F 0 "#PWR031" H 11000 1400 50  0001 C CNN
F 1 "VCC" H 11000 1700 50  0000 C CNN
F 2 "" H 11000 1550 50  0001 C CNN
F 3 "" H 11000 1550 50  0001 C CNN
	1    11000 1550
	1    0    0    -1  
$EndComp
$Comp
L four_probe-rescue:GND-power #PWR032
U 1 1 5AE626B9
P 11000 2150
F 0 "#PWR032" H 11000 1900 50  0001 C CNN
F 1 "GND" H 11000 2000 50  0000 C CNN
F 2 "" H 11000 2150 50  0001 C CNN
F 3 "" H 11000 2150 50  0001 C CNN
	1    11000 2150
	1    0    0    -1  
$EndComp
Connection ~ 8600 8800
Wire Wire Line
	8150 1550 8150 850 
Text Notes 5450 4750 0    59   ~ 0
R_test
Text Notes 5300 3300 0    100  ~ 0
PROBES
Text GLabel 5500 3700 3    60   Input ~ 0
P1
Text GLabel 5650 5850 0    60   Input ~ 0
P4
Text GLabel 5650 4100 0    60   Input ~ 0
P2
Wire Notes Line
	5800 4800 5650 4800
Wire Notes Line
	5800 4650 5800 4800
Wire Notes Line
	5650 4650 5800 4650
Wire Notes Line
	5400 4650 5550 4650
Wire Notes Line
	5400 4800 5400 4650
Wire Notes Line
	5550 4800 5400 4800
Wire Notes Line
	5650 4800 5650 4950
Wire Notes Line
	5600 4800 5600 4950
Wire Notes Line
	5550 4800 5550 4950
Wire Notes Line
	5650 4650 5650 4550
Wire Notes Line
	5600 4650 5600 4550
Wire Notes Line
	5550 4650 5550 4550
Wire Notes Line
	5300 6100 5300 3450
Wire Notes Line
	5900 6100 5900 3450
Wire Notes Line
	5300 6100 5900 6100
Wire Notes Line
	5900 3450 5300 3450
Wire Notes Line
	5950 6150 5250 6150
Wire Notes Line
	5250 6150 5250 3400
Wire Notes Line
	5250 3400 5950 3400
Wire Notes Line
	5950 3400 5950 6150
Connection ~ 4100 3700
Wire Wire Line
	4100 4150 4000 4150
Wire Wire Line
	4100 3700 4100 4150
Wire Wire Line
	3600 3700 3800 3700
Connection ~ 3600 3700
Wire Wire Line
	3600 4150 3600 3700
Wire Wire Line
	3700 4150 3600 4150
$Comp
L Device:R R?
U 1 1 5FBC64E6
P 3850 4150
F 0 "R?" V 3643 4150 50  0000 C CNN
F 1 "R" V 3734 4150 50  0000 C CNN
F 2 "" V 3780 4150 50  0001 C CNN
F 3 "~" H 3850 4150 50  0001 C CNN
	1    3850 4150
	0    1    1    0   
$EndComp
Wire Wire Line
	3900 3700 4100 3700
Wire Wire Line
	3400 3700 3600 3700
$Comp
L four_probe-rescue:Conn_01x02 JR?
U 1 1 5FBB9636
P 3800 3500
F 0 "JR?" H 3750 3300 50  0000 C CNN
F 1 "Conn_01x02" H 3650 3600 50  0000 C CNN
F 2 "Connector_PinSocket_2.54mm:PinSocket_1x02_P2.54mm_Vertical" H 3800 3500 50  0001 C CNN
F 3 "" H 3800 3500 50  0001 C CNN
	1    3800 3500
	0    -1   -1   0   
$EndComp
Text GLabel 2700 3600 0    60   Input ~ 0
VSIG
Connection ~ 3400 3700
Wire Wire Line
	2800 3600 2700 3600
Wire Wire Line
	2800 4200 2800 3800
Wire Wire Line
	2800 4200 3400 4200
Wire Wire Line
	3400 4200 3400 3700
Text Notes 3850 3850 0    98   ~ 0
R_Limit
$Comp
L four_probe-rescue:LMC6482 U1
U 2 1 5AE73467
P 3100 3700
F 0 "U1" H 3100 3900 50  0000 L CNN
F 1 "LMC6482" H 3100 3500 50  0000 L CNN
F 2 "Package_SO:SOIC-8_3.9x4.9mm_P1.27mm" H 3100 3700 50  0001 C CNN
F 3 "" H 3100 3700 50  0001 C CNN
	2    3100 3700
	1    0    0    -1  
$EndComp
$Comp
L four_probe-rescue:VCC-power #PWR04
U 1 1 5AE561F7
P 3000 3400
F 0 "#PWR04" H 3000 3250 50  0001 C CNN
F 1 "VCC" H 3000 3550 50  0000 C CNN
F 2 "" H 3000 3400 50  0001 C CNN
F 3 "" H 3000 3400 50  0001 C CNN
	1    3000 3400
	1    0    0    -1  
$EndComp
$Comp
L four_probe-rescue:GND-power #PWR05
U 1 1 5AE561F1
P 3000 4000
F 0 "#PWR05" H 3000 3750 50  0001 C CNN
F 1 "GND" H 3000 3850 50  0000 C CNN
F 2 "" H 3000 4000 50  0001 C CNN
F 3 "" H 3000 4000 50  0001 C CNN
	1    3000 4000
	1    0    0    -1  
$EndComp
Text Notes 1950 3050 0    98   ~ 0
Input Signal (DAC or GPIO)
$Comp
L four_probe-rescue:Conn_01x02 JR1
U 1 1 5B0046BD
P 7500 1800
F 0 "JR1" H 7450 1600 50  0000 C CNN
F 1 "Conn_01x02" H 7350 1900 50  0000 C CNN
F 2 "Connector_PinSocket_2.54mm:PinSocket_1x02_P2.54mm_Vertical" H 7500 1800 50  0001 C CNN
F 3 "" H 7500 1800 50  0001 C CNN
	1    7500 1800
	-1   0    0    1   
$EndComp
$Comp
L four_probe-rescue:Conn_01x02 JR?
U 1 1 5FEBCF6D
P 7550 4650
F 0 "JR?" H 7500 4450 50  0000 C CNN
F 1 "Conn_01x02" H 7400 4750 50  0000 C CNN
F 2 "Connector_PinSocket_2.54mm:PinSocket_1x02_P2.54mm_Vertical" H 7550 4650 50  0001 C CNN
F 3 "" H 7550 4650 50  0001 C CNN
	1    7550 4650
	-1   0    0    1   
$EndComp
Wire Wire Line
	7750 4450 7750 4550
Wire Wire Line
	7750 4450 8050 4450
Wire Wire Line
	7750 4750 7750 4650
Wire Wire Line
	7750 4750 8050 4750
Text Notes 7650 1450 0    60   ~ 0
Gain
Wire Wire Line
	7950 1600 7700 1600
Wire Wire Line
	7700 1600 7700 1700
Connection ~ 7950 1600
Wire Wire Line
	7700 1800 7700 1900
Wire Wire Line
	7700 1900 7950 1900
Connection ~ 7950 1900
Wire Wire Line
	8150 5350 5650 5350
Wire Wire Line
	8150 4100 5650 4100
Connection ~ 8150 4100
Wire Wire Line
	8150 4100 8150 4400
Text GLabel 5650 5350 0    60   Input ~ 0
P3
Wire Wire Line
	5650 5850 5650 8800
Wire Wire Line
	5650 8800 8600 8800
Wire Wire Line
	4100 3700 4900 3700
Wire Wire Line
	8150 1950 8150 4100
Wire Wire Line
	4900 850  4900 3700
Wire Wire Line
	4900 850  8150 850 
Connection ~ 4900 3700
Wire Wire Line
	4900 3700 5500 3700
$Comp
L Connector:Conn_01x04_Female J?
U 1 1 5FFC1A17
P 3550 7400
F 0 "J?" H 3578 7376 50  0000 L CNN
F 1 "Conn_01x04_Female" H 3578 7285 50  0000 L CNN
F 2 "" H 3550 7400 50  0001 C CNN
F 3 "~" H 3550 7400 50  0001 C CNN
	1    3550 7400
	1    0    0    -1  
$EndComp
Text GLabel 3350 7300 0    60   Input ~ 0
P1
Text GLabel 3350 7400 0    60   Input ~ 0
P2
Text GLabel 3350 7500 0    60   Input ~ 0
P3
Text GLabel 3350 7600 0    60   Input ~ 0
P4
$EndSCHEMATC
