EESchema Schematic File Version 4
EELAYER 30 0
EELAYER END
$Descr A4 11693 8268
encoding utf-8
Sheet 1 1
Title ""
Date ""
Rev ""
Comp ""
Comment1 ""
Comment2 ""
Comment3 ""
Comment4 ""
$EndDescr
Wire Wire Line
	3075 4025 3075 4075
Wire Wire Line
	3150 4025 3075 4025
Wire Wire Line
	3350 3450 3350 3625
$Comp
L pspice:VSOURCE V3
U 1 1 5E577384
P 1875 4125
F 0 "V3" H 1925 4350 50  0000 L CNN
F 1 "PULSE(0 0.1 0 5u 10u 100u)" H 1475 3600 50  0000 L CNN
F 2 "" H 1875 4125 50  0001 C CNN
F 3 "~" H 1875 4125 50  0001 C CNN
F 4 "V" H 1875 4125 50  0001 C CNN "Spice_Primitive"
F 5 "PULSE (0 0.1 0 5u 10u 100u)" H 1875 4125 50  0001 C CNN "Spice_Model"
F 6 "Y" H 1875 4125 50  0001 C CNN "Spice_Netlist_Enabled"
	1    1875 4125
	1    0    0    -1  
$EndComp
$Comp
L pspice:R R1
U 1 1 5E57738A
P 2550 3825
F 0 "R1" V 2450 3775 50  0000 L CNN
F 1 "10K" V 2650 3775 50  0000 L CNN
F 2 "" H 2550 3825 50  0001 C CNN
F 3 "~" H 2550 3825 50  0001 C CNN
	1    2550 3825
	0    1    1    0   
$EndComp
$Comp
L pspice:0 #GND03
U 1 1 5E57739E
P 3075 4075
F 0 "#GND03" H 3075 3975 50  0001 C CNN
F 1 "0" H 3075 3975 50  0000 C CNN
F 2 "" H 3075 4075 50  0001 C CNN
F 3 "~" H 3075 4075 50  0001 C CNN
	1    3075 4075
	1    0    0    -1  
$EndComp
$Comp
L pspice:0 #GND01
U 1 1 5E5773A4
P 5950 3775
F 0 "#GND01" H 5950 3675 50  0001 C CNN
F 1 "0" H 6050 3650 50  0000 C CNN
F 2 "" H 5950 3775 50  0001 C CNN
F 3 "~" H 5950 3775 50  0001 C CNN
	1    5950 3775
	1    0    0    -1  
$EndComp
$Comp
L pspice:VSOURCE V1
U 1 1 5E5773B9
P 5325 3325
F 0 "V1" H 5553 3371 50  0000 L CNN
F 1 "5.00" H 5575 3275 50  0000 L CNN
F 2 "" H 5325 3325 50  0001 C CNN
F 3 "~" H 5325 3325 50  0001 C CNN
F 4 "V" H 5325 3325 50  0001 C CNN "Spice_Primitive"
F 5 "dc 5.00 ac 0" H 5325 3325 50  0001 C CNN "Spice_Model"
F 6 "Y" H 5325 3325 50  0001 C CNN "Spice_Netlist_Enabled"
	1    5325 3325
	1    0    0    -1  
$EndComp
Wire Wire Line
	3525 3175 4175 3175
Wire Wire Line
	3075 3825 3150 3825
Wire Wire Line
	3075 3175 3075 3825
$Comp
L Device:R Rf
U 1 1 5E5773C5
P 3375 3175
F 0 "Rf" V 3275 3175 50  0000 C CNN
F 1 "10K" V 3475 3175 50  0000 C CNN
F 2 "" V 3305 3175 50  0001 C CNN
F 3 "~" H 3375 3175 50  0001 C CNN
	1    3375 3175
	0    1    1    0   
$EndComp
Wire Wire Line
	3750 3925 4175 3925
Wire Wire Line
	3350 3625 3450 3625
Wire Wire Line
	3450 3625 3450 3675
Wire Wire Line
	4175 3175 4175 3725
Wire Wire Line
	4175 3725 3550 3725
Wire Wire Line
	4175 3725 4175 3925
Connection ~ 4175 3725
Wire Wire Line
	3075 3175 3225 3175
Text Notes 3550 4475 0    50   ~ 0
.tran 0.5m
Connection ~ 3350 3625
$Comp
L opa818:OPA818 U1
U 1 1 5E5609C0
P 3450 3925
F 0 "U1" H 3794 3971 50  0000 L CNN
F 1 "OPA818" H 3794 3880 50  0000 L CNN
F 2 "" H 3450 3925 50  0001 L CNN
F 3 "http://www.ti.com/product/OPA818" H 3450 3925 50  0001 C CNN
F 4 "X" H 3450 3925 50  0001 C CNN "Spice_Primitive"
F 5 "OPA818" H 3450 3925 50  0001 C CNN "Spice_Model"
F 6 "Y" H 3450 3925 50  0001 C CNN "Spice_Netlist_Enabled"
F 7 "4 3 8 5 7" H 3450 3925 50  0001 C CNN "Spice_Node_Sequence"
F 8 "lib/OPA818_PSPICE/OPA818.lib" H 3450 3925 50  0001 C CNN "Spice_Lib_File"
	1    3450 3925
	1    0    0    -1  
$EndComp
Wire Wire Line
	1875 3825 2300 3825
Wire Wire Line
	2800 3825 3075 3825
Connection ~ 3075 3825
$Comp
L pspice:0 #GND?
U 1 1 5E6359B7
P 1875 4425
F 0 "#GND?" H 1875 4325 50  0001 C CNN
F 1 "0" H 1875 4325 50  0000 C CNN
F 2 "" H 1875 4425 50  0001 C CNN
F 3 "~" H 1875 4425 50  0001 C CNN
	1    1875 4425
	1    0    0    -1  
$EndComp
Text Label 1925 3825 0    50   ~ 0
VIN
Text Label 3350 4225 3    50   ~ 0
-VS
Text Label 3350 3450 0    50   ~ 0
+VS
Text Label 4125 3175 0    50   ~ 0
Vout
Wire Wire Line
	5325 3875 5325 3700
Wire Wire Line
	5325 3700 5950 3700
Wire Wire Line
	5950 3700 5950 3775
Wire Wire Line
	5325 3625 5325 3700
Connection ~ 5325 3700
Text Label 5325 3025 1    50   ~ 0
+VS
Text Label 5325 4475 3    50   ~ 0
-VS
$Comp
L pspice:VSOURCE V2
U 1 1 5E6454A0
P 5325 4175
F 0 "V2" H 5553 4221 50  0000 L CNN
F 1 "5.005" H 5575 4100 50  0000 L CNN
F 2 "" H 5325 4175 50  0001 C CNN
F 3 "~" H 5325 4175 50  0001 C CNN
F 4 "V" H 5325 4175 50  0001 C CNN "Spice_Primitive"
F 5 "dc 5.005 ac 0" H 5325 4175 50  0001 C CNN "Spice_Model"
F 6 "Y" H 5325 4175 50  0001 C CNN "Spice_Netlist_Enabled"
	1    5325 4175
	1    0    0    -1  
$EndComp
Text Label 3075 3175 0    50   ~ 0
Vn
$EndSCHEMATC
