EESchema Schematic File Version 4
EELAYER 30 0
EELAYER END
$Descr A4 11693 8268
encoding utf-8
Sheet 1 1
Title ""
Date ""
Rev ""
Comp ""
Comment1 ""
Comment2 ""
Comment3 ""
Comment4 ""
$EndDescr
Wire Wire Line
	2575 2650 2575 2700
Wire Wire Line
	2650 2650 2575 2650
Wire Wire Line
	1775 2450 2575 2450
$Comp
L pspice:VSOURCE V2
U 1 1 5E57737B
P 8875 1800
F 0 "V2" H 9103 1846 50  0000 L CNN
F 1 "5V" H 9100 1775 50  0000 L CNN
F 2 "" H 8875 1800 50  0001 C CNN
F 3 "~" H 8875 1800 50  0001 C CNN
F 4 "V" H 8875 1800 50  0001 C CNN "Spice_Primitive"
F 5 "dc 5 ac 0" H 8875 1800 50  0001 C CNN "Spice_Model"
F 6 "Y" H 8875 1800 50  0001 C CNN "Spice_Netlist_Enabled"
	1    8875 1800
	1    0    0    -1  
$EndComp
$Comp
L pspice:VSOURCE V3
U 1 1 5E577384
P 1100 1350
F 0 "V3" H 1328 1396 50  0000 L CNN
F 1 "Vtest_10mV_AC" H 925 1725 50  0000 L CNN
F 2 "" H 1100 1350 50  0001 C CNN
F 3 "~" H 1100 1350 50  0001 C CNN
F 4 "V" H 1100 1350 50  0001 C CNN "Spice_Primitive"
F 5 "dc 0 ac 10m" H 1100 1350 50  0001 C CNN "Spice_Model"
F 6 "Y" H 1100 1350 50  0001 C CNN "Spice_Netlist_Enabled"
	1    1100 1350
	1    0    0    -1  
$EndComp
$Comp
L pspice:R R1
U 1 1 5E57738A
P 1775 1300
F 0 "R1" H 1843 1346 50  0000 L CNN
F 1 "100k" H 1843 1255 50  0000 L CNN
F 2 "" H 1775 1300 50  0001 C CNN
F 3 "~" H 1775 1300 50  0001 C CNN
	1    1775 1300
	1    0    0    -1  
$EndComp
Wire Wire Line
	1100 1050 1775 1050
$Comp
L pspice:0 #GND03
U 1 1 5E57739E
P 2575 2700
F 0 "#GND03" H 2575 2600 50  0001 C CNN
F 1 "0" H 2575 2600 50  0000 C CNN
F 2 "" H 2575 2700 50  0001 C CNN
F 3 "~" H 2575 2700 50  0001 C CNN
	1    2575 2700
	1    0    0    -1  
$EndComp
$Comp
L pspice:VSOURCE V1
U 1 1 5E5773B9
P 8875 1050
F 0 "V1" H 9103 1096 50  0000 L CNN
F 1 "5V" H 9100 1000 50  0000 L CNN
F 2 "" H 8875 1050 50  0001 C CNN
F 3 "~" H 8875 1050 50  0001 C CNN
F 4 "V" H 8875 1050 50  0001 C CNN "Spice_Primitive"
F 5 "dc 5 ac 0" H 8875 1050 50  0001 C CNN "Spice_Model"
F 6 "Y" H 8875 1050 50  0001 C CNN "Spice_Netlist_Enabled"
	1    8875 1050
	1    0    0    -1  
$EndComp
Wire Wire Line
	3025 1800 3375 1800
Wire Wire Line
	2575 2450 2650 2450
Connection ~ 2575 2450
Wire Wire Line
	2575 1800 2575 2450
$Comp
L Device:R R3
U 1 1 5E5773C5
P 2875 1800
F 0 "R3" V 2775 1800 50  0000 C CNN
F 1 "100k" V 2975 1800 50  0000 C CNN
F 2 "" V 2805 1800 50  0001 C CNN
F 3 "~" H 2875 1800 50  0001 C CNN
	1    2875 1800
	0    1    1    0   
$EndComp
Wire Wire Line
	3250 2550 3675 2550
Text GLabel 4275 2550 1    118  Input ~ 0
TI_stageA1
Wire Wire Line
	2850 2250 2950 2250
Wire Wire Line
	2950 2250 2950 2300
Wire Wire Line
	3675 1800 3675 2350
Wire Wire Line
	3675 2350 3050 2350
Wire Wire Line
	3675 2350 3675 2550
Connection ~ 3675 2350
$Comp
L Device:R R4
U 1 1 5E5B6CCA
P 3525 1800
F 0 "R4" V 3425 1800 50  0000 C CNN
F 1 "110" V 3600 1800 50  0000 C CNN
F 2 "" V 3455 1800 50  0001 C CNN
F 3 "~" H 3525 1800 50  0001 C CNN
	1    3525 1800
	0    1    1    0   
$EndComp
Text Notes 3450 1825 0    39   ~ 0
R_ON
$Comp
L Device:C C4
U 1 1 5E5B9766
P 3850 1950
F 0 "C4" H 3965 1996 50  0000 L CNN
F 1 "18p" H 3965 1905 50  0000 L CNN
F 2 "" H 3888 1800 50  0001 C CNN
F 3 "~" H 3850 1950 50  0001 C CNN
	1    3850 1950
	1    0    0    -1  
$EndComp
Wire Wire Line
	3850 1800 3675 1800
Connection ~ 3675 1800
$Comp
L pspice:0 #GND05
U 1 1 5E5BBA64
P 3850 2100
F 0 "#GND05" H 3850 2000 50  0001 C CNN
F 1 "0" H 3950 1975 50  0000 C CNN
F 2 "" H 3850 2100 50  0001 C CNN
F 3 "~" H 3850 2100 50  0001 C CNN
	1    3850 2100
	1    0    0    -1  
$EndComp
$Comp
L Device:C C2
U 1 1 5E5BC91C
P 2875 1550
F 0 "C2" V 2925 1450 50  0000 C CNN
F 1 "0.2p" V 2925 1675 50  0000 C CNN
F 2 "" H 2913 1400 50  0001 C CNN
F 3 "~" H 2875 1550 50  0001 C CNN
	1    2875 1550
	0    1    1    0   
$EndComp
Wire Wire Line
	2575 1800 2725 1800
Wire Wire Line
	2725 1550 2725 1800
Connection ~ 2725 1800
Wire Wire Line
	3025 1550 3025 1800
Connection ~ 3025 1800
Wire Wire Line
	3025 1225 3375 1225
$Comp
L Device:R R2
U 1 1 5E5C3EA6
P 2875 1225
F 0 "R2" V 2775 1225 50  0000 C CNN
F 1 "1k" V 2875 1225 50  0000 C CNN
F 2 "" V 2805 1225 50  0001 C CNN
F 3 "~" H 2875 1225 50  0001 C CNN
	1    2875 1225
	0    1    1    0   
$EndComp
$Comp
L Device:C C1
U 1 1 5E5C3EAC
P 2875 975
F 0 "C1" V 2925 875 50  0000 C CNN
F 1 "0.2p" V 2925 1100 50  0000 C CNN
F 2 "" H 2913 825 50  0001 C CNN
F 3 "~" H 2875 975 50  0001 C CNN
	1    2875 975 
	0    1    1    0   
$EndComp
Wire Wire Line
	2575 1225 2725 1225
Wire Wire Line
	2725 975  2725 1225
Connection ~ 2725 1225
Wire Wire Line
	3025 975  3025 1225
Connection ~ 3025 1225
Wire Wire Line
	2575 1225 2575 1800
Connection ~ 2575 1800
Text Notes 3400 1050 0    50   ~ 0
OFF - LOW GAIN
Text Notes 3375 1625 0    50   ~ 0
ON - HIGH GAIN
$Comp
L Device:C C3
U 1 1 5E5C8F3A
P 3525 1225
F 0 "C3" V 3575 1125 50  0000 C CNN
F 1 "5p" V 3450 1125 50  0000 C CNN
F 2 "" H 3563 1075 50  0001 C CNN
F 3 "~" H 3525 1225 50  0001 C CNN
	1    3525 1225
	0    1    1    0   
$EndComp
$Comp
L pspice:0 #GND04
U 1 1 5E5C950B
P 3675 1275
F 0 "#GND04" H 3675 1175 50  0001 C CNN
F 1 "0" H 3725 1200 50  0000 C CNN
F 2 "" H 3675 1275 50  0001 C CNN
F 3 "~" H 3675 1275 50  0001 C CNN
	1    3675 1275
	1    0    0    -1  
$EndComp
Wire Wire Line
	3675 1225 3675 1275
Wire Notes Line
	3300 975  4125 975 
Wire Notes Line
	4125 975  4125 2275
Wire Notes Line
	4125 2275 3300 2275
Wire Notes Line
	3300 2275 3300 975 
Text Notes 3275 925  0    118  ~ 0
ADG604 MUX\nParasitics
Text Notes 3425 3150 0    50   ~ 0
.ac dec 10 1 10MEG
$Comp
L opa818:OPA818 U1
U 1 1 5E5609C0
P 2950 2550
F 0 "U1" H 3294 2596 50  0000 L CNN
F 1 "OPA818" H 3294 2505 50  0000 L CNN
F 2 "" H 2950 2550 50  0001 L CNN
F 3 "http://www.ti.com/product/OPA818" H 2950 2550 50  0001 C CNN
F 4 "X" H 2950 2550 50  0001 C CNN "Spice_Primitive"
F 5 "OPA818" H 2950 2550 50  0001 C CNN "Spice_Model"
F 6 "Y" H 2950 2550 50  0001 C CNN "Spice_Netlist_Enabled"
F 7 "4 3 8 5 7" H 2950 2550 50  0001 C CNN "Spice_Node_Sequence"
F 8 "lib/OPA818_PSPICE/OPA818.lib" H 2950 2550 50  0001 C CNN "Spice_Lib_File"
	1    2950 2550
	1    0    0    -1  
$EndComp
Connection ~ 3675 2550
Wire Wire Line
	8875 1350 8875 1425
Wire Wire Line
	8875 1425 9250 1425
Connection ~ 8875 1425
Wire Wire Line
	8875 1425 8875 1500
$Comp
L pspice:0 #GND02
U 1 1 5E656E9D
P 9250 1500
F 0 "#GND02" H 9250 1400 50  0001 C CNN
F 1 "0" H 9250 1400 50  0000 C CNN
F 2 "" H 9250 1500 50  0001 C CNN
F 3 "~" H 9250 1500 50  0001 C CNN
	1    9250 1500
	1    0    0    -1  
$EndComp
Text GLabel 8875 2100 3    50   Input ~ 0
-VS
Text GLabel 8875 750  1    50   Input ~ 0
+VS
$Comp
L pspice:0 #GND01
U 1 1 5E6585B7
P 1100 1650
F 0 "#GND01" H 1100 1550 50  0001 C CNN
F 1 "0" H 1100 1550 50  0000 C CNN
F 2 "" H 1100 1650 50  0001 C CNN
F 3 "~" H 1100 1650 50  0001 C CNN
	1    1100 1650
	1    0    0    -1  
$EndComp
Text GLabel 2850 2850 3    50   Input ~ 0
-VS
Text GLabel 2850 2200 1    50   Input ~ 0
+VS
Wire Wire Line
	2850 2200 2850 2250
Connection ~ 2850 2250
Text GLabel 1625 1050 1    118  Input ~ 0
VtestA
Wire Wire Line
	5625 2750 5625 2800
Wire Wire Line
	5700 2750 5625 2750
$Comp
L pspice:0 #GND06
U 1 1 5E67653E
P 5625 2800
F 0 "#GND06" H 5625 2700 50  0001 C CNN
F 1 "0" H 5625 2700 50  0000 C CNN
F 2 "" H 5625 2800 50  0001 C CNN
F 3 "~" H 5625 2800 50  0001 C CNN
	1    5625 2800
	1    0    0    -1  
$EndComp
Wire Wire Line
	6075 1900 6425 1900
Wire Wire Line
	5625 2550 5700 2550
Connection ~ 5625 2550
Wire Wire Line
	5625 1900 5625 2550
$Comp
L Device:R R7
U 1 1 5E676548
P 5925 1900
F 0 "R7" V 5825 1900 50  0000 C CNN
F 1 "100k" V 6025 1900 50  0000 C CNN
F 2 "" V 5855 1900 50  0001 C CNN
F 3 "~" H 5925 1900 50  0001 C CNN
	1    5925 1900
	0    1    1    0   
$EndComp
Wire Wire Line
	6300 2650 6725 2650
Text GLabel 7325 2650 1    118  Input ~ 0
TI_stageA2
Wire Wire Line
	5900 2350 6000 2350
Wire Wire Line
	6000 2350 6000 2400
Wire Wire Line
	6725 1900 6725 2450
Wire Wire Line
	6725 2450 6100 2450
Wire Wire Line
	6725 2450 6725 2650
Connection ~ 6725 2450
$Comp
L Device:R R8
U 1 1 5E676556
P 6575 1900
F 0 "R8" V 6475 1900 50  0000 C CNN
F 1 "110" V 6650 1900 50  0000 C CNN
F 2 "" V 6505 1900 50  0001 C CNN
F 3 "~" H 6575 1900 50  0001 C CNN
	1    6575 1900
	0    1    1    0   
$EndComp
Text Notes 6500 1925 0    39   ~ 0
R_ON
$Comp
L Device:C C9
U 1 1 5E67655D
P 6900 2050
F 0 "C9" H 7015 2096 50  0000 L CNN
F 1 "18p" H 7015 2005 50  0000 L CNN
F 2 "" H 6938 1900 50  0001 C CNN
F 3 "~" H 6900 2050 50  0001 C CNN
	1    6900 2050
	1    0    0    -1  
$EndComp
Wire Wire Line
	6900 1900 6725 1900
Connection ~ 6725 1900
$Comp
L pspice:0 #GND08
U 1 1 5E676565
P 6900 2200
F 0 "#GND08" H 6900 2100 50  0001 C CNN
F 1 "0" H 7000 2075 50  0000 C CNN
F 2 "" H 6900 2200 50  0001 C CNN
F 3 "~" H 6900 2200 50  0001 C CNN
	1    6900 2200
	1    0    0    -1  
$EndComp
$Comp
L Device:C C7
U 1 1 5E67656B
P 5925 1650
F 0 "C7" V 5975 1550 50  0000 C CNN
F 1 "0.2p" V 5975 1775 50  0000 C CNN
F 2 "" H 5963 1500 50  0001 C CNN
F 3 "~" H 5925 1650 50  0001 C CNN
	1    5925 1650
	0    1    1    0   
$EndComp
Wire Wire Line
	5625 1900 5775 1900
Wire Wire Line
	5775 1650 5775 1900
Connection ~ 5775 1900
Wire Wire Line
	6075 1650 6075 1900
Connection ~ 6075 1900
Wire Wire Line
	6075 1325 6425 1325
$Comp
L Device:R R6
U 1 1 5E676577
P 5925 1325
F 0 "R6" V 5825 1325 50  0000 C CNN
F 1 "1k" V 5925 1325 50  0000 C CNN
F 2 "" V 5855 1325 50  0001 C CNN
F 3 "~" H 5925 1325 50  0001 C CNN
	1    5925 1325
	0    1    1    0   
$EndComp
$Comp
L Device:C C6
U 1 1 5E67657D
P 5925 1075
F 0 "C6" V 5975 975 50  0000 C CNN
F 1 "0.2p" V 5975 1200 50  0000 C CNN
F 2 "" H 5963 925 50  0001 C CNN
F 3 "~" H 5925 1075 50  0001 C CNN
	1    5925 1075
	0    1    1    0   
$EndComp
Wire Wire Line
	5625 1325 5775 1325
Wire Wire Line
	5775 1075 5775 1325
Connection ~ 5775 1325
Wire Wire Line
	6075 1075 6075 1325
Connection ~ 6075 1325
Wire Wire Line
	5625 1325 5625 1900
Connection ~ 5625 1900
Text Notes 6450 1150 0    50   ~ 0
OFF - LOW GAIN
Text Notes 6425 1725 0    50   ~ 0
ON - HIGH GAIN
$Comp
L Device:C C8
U 1 1 5E67658C
P 6575 1325
F 0 "C8" V 6625 1225 50  0000 C CNN
F 1 "5p" V 6500 1225 50  0000 C CNN
F 2 "" H 6613 1175 50  0001 C CNN
F 3 "~" H 6575 1325 50  0001 C CNN
	1    6575 1325
	0    1    1    0   
$EndComp
$Comp
L pspice:0 #GND07
U 1 1 5E676592
P 6725 1375
F 0 "#GND07" H 6725 1275 50  0001 C CNN
F 1 "0" H 6775 1300 50  0000 C CNN
F 2 "" H 6725 1375 50  0001 C CNN
F 3 "~" H 6725 1375 50  0001 C CNN
	1    6725 1375
	1    0    0    -1  
$EndComp
Wire Wire Line
	6725 1325 6725 1375
Wire Notes Line
	6350 1075 7175 1075
Wire Notes Line
	7175 1075 7175 2375
Wire Notes Line
	7175 2375 6350 2375
Wire Notes Line
	6350 2375 6350 1075
Text Notes 6325 1025 0    118  ~ 0
ADG604 MUX\nParasitics
$Comp
L opa818:OPA818 U2
U 1 1 5E6765A4
P 6000 2650
F 0 "U2" H 6344 2696 50  0000 L CNN
F 1 "OPA818" H 6344 2605 50  0000 L CNN
F 2 "" H 6000 2650 50  0001 L CNN
F 3 "http://www.ti.com/product/OPA818" H 6000 2650 50  0001 C CNN
F 4 "X" H 6000 2650 50  0001 C CNN "Spice_Primitive"
F 5 "OPA818" H 6000 2650 50  0001 C CNN "Spice_Model"
F 6 "Y" H 6000 2650 50  0001 C CNN "Spice_Netlist_Enabled"
F 7 "4 3 8 5 7" H 6000 2650 50  0001 C CNN "Spice_Node_Sequence"
F 8 "lib/OPA818_PSPICE/OPA818.lib" H 6000 2650 50  0001 C CNN "Spice_Lib_File"
	1    6000 2650
	1    0    0    -1  
$EndComp
Wire Wire Line
	6725 2650 7325 2650
Connection ~ 6725 2650
Text GLabel 5900 2950 3    50   Input ~ 0
-VS
Text GLabel 5900 2300 1    50   Input ~ 0
+VS
Wire Wire Line
	5900 2300 5900 2350
Connection ~ 5900 2350
$Comp
L Device:R R5
U 1 1 5E681D85
P 4775 2550
F 0 "R5" V 4675 2550 50  0000 C CNN
F 1 "1k" V 4775 2550 50  0000 C CNN
F 2 "" V 4705 2550 50  0001 C CNN
F 3 "~" H 4775 2550 50  0001 C CNN
	1    4775 2550
	0    1    1    0   
$EndComp
Wire Wire Line
	3675 2550 4625 2550
Wire Notes Line
	4600 2150 5350 2150
Wire Notes Line
	5350 2150 5350 2925
Wire Notes Line
	5350 2925 4600 2925
Wire Notes Line
	4600 2925 4600 2150
Text Notes 4750 2325 0    50   ~ 0
Optional\nAC coupling
Wire Wire Line
	4925 2550 5625 2550
Wire Wire Line
	2600 5925 2600 5975
Wire Wire Line
	2675 5925 2600 5925
Wire Wire Line
	1800 5725 2600 5725
Wire Wire Line
	1800 4825 1800 5725
$Comp
L pspice:VSOURCE V6
U 1 1 5E6C5194
P 1125 4625
F 0 "V6" H 1353 4671 50  0000 L CNN
F 1 "Vtest_10mV_AC" H 950 5000 50  0000 L CNN
F 2 "" H 1125 4625 50  0001 C CNN
F 3 "~" H 1125 4625 50  0001 C CNN
F 4 "V" H 1125 4625 50  0001 C CNN "Spice_Primitive"
F 5 "dc 0 ac 10m" H 1125 4625 50  0001 C CNN "Spice_Model"
F 6 "Y" H 1125 4625 50  0001 C CNN "Spice_Netlist_Enabled"
	1    1125 4625
	1    0    0    -1  
$EndComp
$Comp
L pspice:R R9
U 1 1 5E6C519A
P 1800 4575
F 0 "R9" H 1868 4621 50  0000 L CNN
F 1 "100k" H 1868 4530 50  0000 L CNN
F 2 "" H 1800 4575 50  0001 C CNN
F 3 "~" H 1800 4575 50  0001 C CNN
	1    1800 4575
	1    0    0    -1  
$EndComp
Wire Wire Line
	1125 4325 1800 4325
$Comp
L pspice:0 #GND011
U 1 1 5E6C51A1
P 2600 5975
F 0 "#GND011" H 2600 5875 50  0001 C CNN
F 1 "0" H 2600 5875 50  0000 C CNN
F 2 "" H 2600 5975 50  0001 C CNN
F 3 "~" H 2600 5975 50  0001 C CNN
	1    2600 5975
	1    0    0    -1  
$EndComp
Wire Wire Line
	3050 5075 3400 5075
Wire Wire Line
	2600 5725 2675 5725
Connection ~ 2600 5725
Wire Wire Line
	2600 5075 2600 5725
$Comp
L Device:R R11
U 1 1 5E6C51B4
P 2900 5075
F 0 "R11" V 2800 5075 50  0000 C CNN
F 1 "100k" V 3000 5075 50  0000 C CNN
F 2 "" V 2830 5075 50  0001 C CNN
F 3 "~" H 2900 5075 50  0001 C CNN
	1    2900 5075
	0    1    1    0   
$EndComp
Wire Wire Line
	3275 5825 3700 5825
Text GLabel 4300 5825 1    118  Input ~ 0
TI_stageB1
Wire Wire Line
	2875 5525 2975 5525
Wire Wire Line
	2975 5525 2975 5575
Wire Wire Line
	3700 5075 3700 5625
Wire Wire Line
	3700 5625 3075 5625
Wire Wire Line
	3700 5625 3700 5825
Connection ~ 3700 5625
$Comp
L Device:R R12
U 1 1 5E6C51C2
P 3550 5075
F 0 "R12" V 3450 5075 50  0000 C CNN
F 1 "110" V 3625 5075 50  0000 C CNN
F 2 "" V 3480 5075 50  0001 C CNN
F 3 "~" H 3550 5075 50  0001 C CNN
	1    3550 5075
	0    1    1    0   
$EndComp
Text Notes 3475 5100 0    39   ~ 0
R_ON
$Comp
L Device:C C13
U 1 1 5E6C51C9
P 3875 5225
F 0 "C13" H 3990 5271 50  0000 L CNN
F 1 "18p" H 3990 5180 50  0000 L CNN
F 2 "" H 3913 5075 50  0001 C CNN
F 3 "~" H 3875 5225 50  0001 C CNN
	1    3875 5225
	1    0    0    -1  
$EndComp
Wire Wire Line
	3875 5075 3700 5075
Connection ~ 3700 5075
$Comp
L pspice:0 #GND013
U 1 1 5E6C51D1
P 3875 5375
F 0 "#GND013" H 3875 5275 50  0001 C CNN
F 1 "0" H 3975 5250 50  0000 C CNN
F 2 "" H 3875 5375 50  0001 C CNN
F 3 "~" H 3875 5375 50  0001 C CNN
	1    3875 5375
	1    0    0    -1  
$EndComp
$Comp
L Device:C C11
U 1 1 5E6C51D7
P 2900 4825
F 0 "C11" V 2950 4725 50  0000 C CNN
F 1 "0.2p" V 2950 4950 50  0000 C CNN
F 2 "" H 2938 4675 50  0001 C CNN
F 3 "~" H 2900 4825 50  0001 C CNN
	1    2900 4825
	0    1    1    0   
$EndComp
Wire Wire Line
	2600 5075 2750 5075
Wire Wire Line
	2750 4825 2750 5075
Connection ~ 2750 5075
Wire Wire Line
	3050 4825 3050 5075
Connection ~ 3050 5075
Wire Wire Line
	3050 4500 3400 4500
$Comp
L Device:R R10
U 1 1 5E6C51E3
P 2900 4500
F 0 "R10" V 2800 4500 50  0000 C CNN
F 1 "1k" V 2900 4500 50  0000 C CNN
F 2 "" V 2830 4500 50  0001 C CNN
F 3 "~" H 2900 4500 50  0001 C CNN
	1    2900 4500
	0    1    1    0   
$EndComp
$Comp
L Device:C C10
U 1 1 5E6C51E9
P 2900 4250
F 0 "C10" V 2950 4150 50  0000 C CNN
F 1 "0.2p" V 2950 4375 50  0000 C CNN
F 2 "" H 2938 4100 50  0001 C CNN
F 3 "~" H 2900 4250 50  0001 C CNN
	1    2900 4250
	0    1    1    0   
$EndComp
Wire Wire Line
	2600 4500 2750 4500
Wire Wire Line
	2750 4250 2750 4500
Connection ~ 2750 4500
Wire Wire Line
	3050 4250 3050 4500
Connection ~ 3050 4500
Wire Wire Line
	2600 4500 2600 5075
Connection ~ 2600 5075
Text Notes 3425 4325 0    50   ~ 0
OFF - LOW GAIN
Text Notes 3400 4900 0    50   ~ 0
ON - HIGH GAIN
$Comp
L Device:C C12
U 1 1 5E6C51F8
P 3550 4500
F 0 "C12" V 3600 4400 50  0000 C CNN
F 1 "5p" V 3475 4400 50  0000 C CNN
F 2 "" H 3588 4350 50  0001 C CNN
F 3 "~" H 3550 4500 50  0001 C CNN
	1    3550 4500
	0    1    1    0   
$EndComp
$Comp
L pspice:0 #GND012
U 1 1 5E6C51FE
P 3700 4550
F 0 "#GND012" H 3700 4450 50  0001 C CNN
F 1 "0" H 3750 4475 50  0000 C CNN
F 2 "" H 3700 4550 50  0001 C CNN
F 3 "~" H 3700 4550 50  0001 C CNN
	1    3700 4550
	1    0    0    -1  
$EndComp
Wire Wire Line
	3700 4500 3700 4550
Wire Notes Line
	3325 4250 4150 4250
Wire Notes Line
	4150 4250 4150 5550
Wire Notes Line
	4150 5550 3325 5550
Wire Notes Line
	3325 5550 3325 4250
Text Notes 3300 4200 0    118  ~ 0
ADG604 MUX\nParasitics
$Comp
L opa818:OPA818 U3
U 1 1 5E6C5210
P 2975 5825
F 0 "U3" H 3319 5871 50  0000 L CNN
F 1 "OPA818" H 3319 5780 50  0000 L CNN
F 2 "" H 2975 5825 50  0001 L CNN
F 3 "http://www.ti.com/product/OPA818" H 2975 5825 50  0001 C CNN
F 4 "X" H 2975 5825 50  0001 C CNN "Spice_Primitive"
F 5 "OPA818" H 2975 5825 50  0001 C CNN "Spice_Model"
F 6 "Y" H 2975 5825 50  0001 C CNN "Spice_Netlist_Enabled"
F 7 "4 3 8 5 7" H 2975 5825 50  0001 C CNN "Spice_Node_Sequence"
F 8 "lib/OPA818_PSPICE/OPA818.lib" H 2975 5825 50  0001 C CNN "Spice_Lib_File"
	1    2975 5825
	1    0    0    -1  
$EndComp
Connection ~ 3700 5825
$Comp
L pspice:0 #GND09
U 1 1 5E6C5224
P 1125 4925
F 0 "#GND09" H 1125 4825 50  0001 C CNN
F 1 "0" H 1125 4825 50  0000 C CNN
F 2 "" H 1125 4925 50  0001 C CNN
F 3 "~" H 1125 4925 50  0001 C CNN
	1    1125 4925
	1    0    0    -1  
$EndComp
Text GLabel 2875 6125 3    50   Input ~ 0
-VS
Text GLabel 2875 5475 1    50   Input ~ 0
+VS
Wire Wire Line
	2875 5475 2875 5525
Connection ~ 2875 5525
Text GLabel 1650 4325 1    118  Input ~ 0
VtestB
Wire Wire Line
	5650 6025 5650 6075
Wire Wire Line
	5725 6025 5650 6025
$Comp
L pspice:0 #GND014
U 1 1 5E6C5231
P 5650 6075
F 0 "#GND014" H 5650 5975 50  0001 C CNN
F 1 "0" H 5650 5975 50  0000 C CNN
F 2 "" H 5650 6075 50  0001 C CNN
F 3 "~" H 5650 6075 50  0001 C CNN
	1    5650 6075
	1    0    0    -1  
$EndComp
Wire Wire Line
	6100 5175 6450 5175
Wire Wire Line
	5650 5825 5725 5825
Connection ~ 5650 5825
Wire Wire Line
	5650 5175 5650 5825
$Comp
L Device:R R15
U 1 1 5E6C523B
P 5950 5175
F 0 "R15" V 5850 5175 50  0000 C CNN
F 1 "100k" V 6050 5175 50  0000 C CNN
F 2 "" V 5880 5175 50  0001 C CNN
F 3 "~" H 5950 5175 50  0001 C CNN
	1    5950 5175
	0    1    1    0   
$EndComp
Wire Wire Line
	6325 5925 6750 5925
Text GLabel 7350 5925 1    118  Input ~ 0
TI_stageB2
$Comp
L Device:R R16
U 1 1 5E6C5249
P 6600 5175
F 0 "R16" V 6500 5175 50  0000 C CNN
F 1 "110" V 6675 5175 50  0000 C CNN
F 2 "" V 6530 5175 50  0001 C CNN
F 3 "~" H 6600 5175 50  0001 C CNN
	1    6600 5175
	0    1    1    0   
$EndComp
Text Notes 6525 5200 0    39   ~ 0
R_ON
$Comp
L Device:C C18
U 1 1 5E6C5250
P 6925 5325
F 0 "C18" H 7040 5371 50  0000 L CNN
F 1 "18p" H 7040 5280 50  0000 L CNN
F 2 "" H 6963 5175 50  0001 C CNN
F 3 "~" H 6925 5325 50  0001 C CNN
	1    6925 5325
	1    0    0    -1  
$EndComp
Wire Wire Line
	6925 5175 6750 5175
Connection ~ 6750 5175
$Comp
L pspice:0 #GND016
U 1 1 5E6C5258
P 6925 5475
F 0 "#GND016" H 6925 5375 50  0001 C CNN
F 1 "0" H 7025 5350 50  0000 C CNN
F 2 "" H 6925 5475 50  0001 C CNN
F 3 "~" H 6925 5475 50  0001 C CNN
	1    6925 5475
	1    0    0    -1  
$EndComp
$Comp
L Device:C C16
U 1 1 5E6C525E
P 5950 4925
F 0 "C16" V 6000 4825 50  0000 C CNN
F 1 "0.2p" V 6000 5050 50  0000 C CNN
F 2 "" H 5988 4775 50  0001 C CNN
F 3 "~" H 5950 4925 50  0001 C CNN
	1    5950 4925
	0    1    1    0   
$EndComp
Wire Wire Line
	5650 5175 5800 5175
Wire Wire Line
	5800 4925 5800 5175
Connection ~ 5800 5175
Wire Wire Line
	6100 4925 6100 5175
Connection ~ 6100 5175
Wire Wire Line
	6100 4600 6450 4600
$Comp
L Device:R R14
U 1 1 5E6C526A
P 5950 4600
F 0 "R14" V 5850 4600 50  0000 C CNN
F 1 "1k" V 5950 4600 50  0000 C CNN
F 2 "" V 5880 4600 50  0001 C CNN
F 3 "~" H 5950 4600 50  0001 C CNN
	1    5950 4600
	0    1    1    0   
$EndComp
$Comp
L Device:C C15
U 1 1 5E6C5270
P 5950 4350
F 0 "C15" V 6000 4250 50  0000 C CNN
F 1 "0.2p" V 6000 4475 50  0000 C CNN
F 2 "" H 5988 4200 50  0001 C CNN
F 3 "~" H 5950 4350 50  0001 C CNN
	1    5950 4350
	0    1    1    0   
$EndComp
Wire Wire Line
	5650 4600 5800 4600
Wire Wire Line
	5800 4350 5800 4600
Connection ~ 5800 4600
Wire Wire Line
	6100 4350 6100 4600
Connection ~ 6100 4600
Wire Wire Line
	5650 4600 5650 5175
Connection ~ 5650 5175
Text Notes 6475 4425 0    50   ~ 0
OFF - LOW GAIN
Text Notes 6450 5000 0    50   ~ 0
ON - HIGH GAIN
$Comp
L Device:C C17
U 1 1 5E6C527F
P 6600 4600
F 0 "C17" V 6650 4500 50  0000 C CNN
F 1 "5p" V 6525 4500 50  0000 C CNN
F 2 "" H 6638 4450 50  0001 C CNN
F 3 "~" H 6600 4600 50  0001 C CNN
	1    6600 4600
	0    1    1    0   
$EndComp
$Comp
L pspice:0 #GND015
U 1 1 5E6C5285
P 6750 4650
F 0 "#GND015" H 6750 4550 50  0001 C CNN
F 1 "0" H 6800 4575 50  0000 C CNN
F 2 "" H 6750 4650 50  0001 C CNN
F 3 "~" H 6750 4650 50  0001 C CNN
	1    6750 4650
	1    0    0    -1  
$EndComp
Wire Wire Line
	6750 4600 6750 4650
Wire Notes Line
	6375 4350 7200 4350
Wire Notes Line
	7200 4350 7200 5650
Wire Notes Line
	7200 5650 6375 5650
Wire Notes Line
	6375 5650 6375 4350
Text Notes 6350 4300 0    118  ~ 0
ADG604 MUX\nParasitics
Wire Wire Line
	6750 5925 7350 5925
Connection ~ 6750 5925
Text GLabel 5925 6225 3    50   Input ~ 0
-VS
Text GLabel 5925 5625 1    50   Input ~ 0
+VS
Wire Wire Line
	3700 5825 4650 5825
Text Notes 4775 5600 0    50   ~ 0
Optional\nAC coupling
Wire Wire Line
	5250 5825 5650 5825
$Comp
L Device:C C14
U 1 1 5E6C52AF
P 4800 5825
F 0 "C14" V 4675 5625 50  0000 L CNN
F 1 "100u" V 4975 5750 50  0000 L CNN
F 2 "" H 4838 5675 50  0001 C CNN
F 3 "~" H 4800 5825 50  0001 C CNN
	1    4800 5825
	0    1    1    0   
$EndComp
Wire Wire Line
	6750 5175 6750 5925
NoConn ~ 3875 8125
NoConn ~ 7925 6575
$Comp
L Device:R R13
U 1 1 5E6C52A2
P 5100 5825
F 0 "R13" V 5000 5825 50  0000 C CNN
F 1 "1k" V 5100 5825 50  0000 C CNN
F 2 "" V 5030 5825 50  0001 C CNN
F 3 "~" H 5100 5825 50  0001 C CNN
	1    5100 5825
	0    1    1    0   
$EndComp
$Comp
L opa657:OPA657 U4
U 1 1 5E726928
P 6025 5925
F 0 "U4" H 6369 5971 50  0000 L CNN
F 1 "OPA657" H 6369 5880 50  0000 L CNN
F 2 "" H 6025 5925 50  0001 L CNN
F 3 "http://www.ti.com/product/OPA657" H 6025 5925 50  0001 C CNN
F 4 "X" H 6025 5925 50  0001 C CNN "Spice_Primitive"
F 5 "OPA657" H 6025 5925 50  0001 C CNN "Spice_Model"
F 6 "Y" H 6025 5925 50  0001 C CNN "Spice_Netlist_Enabled"
F 7 "4 7 2 3 6" H 6025 5925 50  0001 C CNN "Spice_Node_Sequence"
F 8 "lib/OPA657_PSPICE_sbom137e/OPA657.lib" H 6025 5925 50  0001 C CNN "Spice_Lib_File"
	1    6025 5925
	1    0    0    -1  
$EndComp
Wire Wire Line
	9250 1425 9250 1500
$Comp
L Device:C C19
U 1 1 5E7640D8
P 1775 1925
F 0 "C19" V 1650 2025 50  0000 L CNN
F 1 "10u" H 1950 1850 50  0000 L CNN
F 2 "" H 1813 1775 50  0001 C CNN
F 3 "~" H 1775 1925 50  0001 C CNN
	1    1775 1925
	-1   0    0    1   
$EndComp
Wire Wire Line
	1775 1550 1775 1625
Wire Wire Line
	1775 2075 1775 2450
$Comp
L pspice:R R17
U 1 1 5E7791BB
P 2025 1625
F 0 "R17" H 2093 1671 50  0000 L CNN
F 1 "1G" H 2093 1580 50  0000 L CNN
F 2 "" H 2025 1625 50  0001 C CNN
F 3 "~" H 2025 1625 50  0001 C CNN
	1    2025 1625
	0    1    1    0   
$EndComp
Connection ~ 1775 1625
Wire Wire Line
	1775 1625 1775 1775
$Comp
L pspice:0 #GND010
U 1 1 5E779987
P 2275 1750
F 0 "#GND010" H 2275 1650 50  0001 C CNN
F 1 "0" H 2275 1650 50  0000 C CNN
F 2 "" H 2275 1750 50  0001 C CNN
F 3 "~" H 2275 1750 50  0001 C CNN
	1    2275 1750
	1    0    0    -1  
$EndComp
Wire Wire Line
	2275 1625 2275 1750
$EndSCHEMATC
