EESchema Schematic File Version 4
EELAYER 30 0
EELAYER END
$Descr A4 11693 8268
encoding utf-8
Sheet 1 1
Title ""
Date ""
Rev ""
Comp ""
Comment1 ""
Comment2 ""
Comment3 ""
Comment4 ""
$EndDescr
$Comp
L pspice:VSOURCE V3
U 1 1 5E57737B
P 3050 7025
F 0 "V3" H 3278 7071 50  0000 L CNN
F 1 "1.65V" H 3275 7000 50  0000 L CNN
F 2 "" H 3050 7025 50  0001 C CNN
F 3 "~" H 3050 7025 50  0001 C CNN
F 4 "V" H 3050 7025 50  0001 C CNN "Spice_Primitive"
F 5 "dc 1.65 ac 0" H 3050 7025 50  0001 C CNN "Spice_Model"
F 6 "Y" H 3050 7025 50  0001 C CNN "Spice_Netlist_Enabled"
	1    3050 7025
	1    0    0    -1  
$EndComp
$Comp
L pspice:VSOURCE V1
U 1 1 5E5773B9
P 1375 6450
F 0 "V1" H 1603 6496 50  0000 L CNN
F 1 "6V" H 1600 6400 50  0000 L CNN
F 2 "" H 1375 6450 50  0001 C CNN
F 3 "~" H 1375 6450 50  0001 C CNN
F 4 "V" H 1375 6450 50  0001 C CNN "Spice_Primitive"
F 5 "dc 6 ac 0" H 1375 6450 50  0001 C CNN "Spice_Model"
F 6 "Y" H 1375 6450 50  0001 C CNN "Spice_Netlist_Enabled"
	1    1375 6450
	1    0    0    -1  
$EndComp
Text Notes 1050 3850 0    118  ~ 0
.ac dec 10 0.01 1G
$Comp
L pspice:0 #GND01
U 1 1 5E656E9D
P 1375 6750
F 0 "#GND01" H 1375 6650 50  0001 C CNN
F 1 "0" H 1375 6650 50  0000 C CNN
F 2 "" H 1375 6750 50  0001 C CNN
F 3 "~" H 1375 6750 50  0001 C CNN
	1    1375 6750
	1    0    0    -1  
$EndComp
Text GLabel 1375 6150 1    50   Input ~ 0
+VS
Wire Wire Line
	3125 6225 3050 6225
Wire Wire Line
	2250 6025 2475 6025
Wire Wire Line
	2250 5125 2250 6025
$Comp
L pspice:VSOURCE V2
U 1 1 5E6C5194
P 1575 4925
F 0 "V2" H 1803 4971 50  0000 L CNN
F 1 "Vtest_DC_1.65V_AC_10mV" H 1000 5300 50  0000 L CNN
F 2 "" H 1575 4925 50  0001 C CNN
F 3 "~" H 1575 4925 50  0001 C CNN
F 4 "V" H 1575 4925 50  0001 C CNN "Spice_Primitive"
F 5 "dc 1.65 ac 10m" H 1575 4925 50  0001 C CNN "Spice_Model"
F 6 "Y" H 1575 4925 50  0001 C CNN "Spice_Netlist_Enabled"
	1    1575 4925
	1    0    0    -1  
$EndComp
$Comp
L pspice:R R1
U 1 1 5E6C519A
P 2250 4875
F 0 "R1" H 2318 4921 50  0000 L CNN
F 1 "10Meg" H 2318 4830 50  0000 L CNN
F 2 "" H 2250 4875 50  0001 C CNN
F 3 "~" H 2250 4875 50  0001 C CNN
	1    2250 4875
	1    0    0    -1  
$EndComp
Wire Wire Line
	1575 4625 2250 4625
$Comp
L pspice:0 #GND08
U 1 1 5E6C51A1
P 3325 6425
F 0 "#GND08" H 3325 6325 50  0001 C CNN
F 1 "0" H 3325 6325 50  0000 C CNN
F 2 "" H 3325 6425 50  0001 C CNN
F 3 "~" H 3325 6425 50  0001 C CNN
	1    3325 6425
	1    0    0    -1  
$EndComp
Wire Wire Line
	3050 6025 3125 6025
Connection ~ 3050 6025
$Comp
L Device:R R6
U 1 1 5E6C51B4
P 3800 5375
F 0 "R6" V 3700 5375 50  0000 C CNN
F 1 "10Meg" V 3900 5375 50  0000 C CNN
F 2 "" V 3730 5375 50  0001 C CNN
F 3 "~" H 3800 5375 50  0001 C CNN
	1    3800 5375
	0    1    1    0   
$EndComp
Wire Wire Line
	3725 6125 4150 6125
Wire Wire Line
	3325 5825 3425 5825
Wire Wire Line
	3425 5825 3425 5875
Wire Wire Line
	4150 5925 3525 5925
Wire Wire Line
	4150 5925 4150 6125
$Comp
L Device:C C7
U 1 1 5E6C51C9
P 4600 4950
F 0 "C7" H 4715 4996 50  0000 L CNN
F 1 "18p" H 4715 4905 50  0000 L CNN
F 2 "" H 4638 4800 50  0001 C CNN
F 3 "~" H 4600 4950 50  0001 C CNN
	1    4600 4950
	1    0    0    -1  
$EndComp
Wire Wire Line
	4600 4800 4425 4800
$Comp
L pspice:0 #GND09
U 1 1 5E6C51D1
P 4600 5100
F 0 "#GND09" H 4600 5000 50  0001 C CNN
F 1 "0" H 4700 4975 50  0000 C CNN
F 2 "" H 4600 5100 50  0001 C CNN
F 3 "~" H 4600 5100 50  0001 C CNN
	1    4600 5100
	1    0    0    -1  
$EndComp
$Comp
L Device:C C6
U 1 1 5E6C51D7
P 3800 5125
F 0 "C6" V 3850 5025 50  0000 C CNN
F 1 "400f" V 3700 5275 50  0000 C CNN
F 2 "" H 3838 4975 50  0001 C CNN
F 3 "~" H 3800 5125 50  0001 C CNN
	1    3800 5125
	0    1    1    0   
$EndComp
Wire Wire Line
	3050 5375 3650 5375
Wire Wire Line
	3650 5125 3650 5375
Connection ~ 3650 5375
Wire Wire Line
	3950 5125 3950 5375
$Comp
L Device:R R5
U 1 1 5E6C51E3
P 3800 4800
F 0 "R5" V 3700 4800 50  0000 C CNN
F 1 "1.1Meg" V 3875 4800 50  0000 C CNN
F 2 "" V 3730 4800 50  0001 C CNN
F 3 "~" H 3800 4800 50  0001 C CNN
	1    3800 4800
	0    1    1    0   
$EndComp
$Comp
L Device:C C5
U 1 1 5E6C51E9
P 3800 4550
F 0 "C5" V 3850 4450 50  0000 C CNN
F 1 "1.4p" V 3725 4700 50  0000 C CNN
F 2 "" H 3838 4400 50  0001 C CNN
F 3 "~" H 3800 4550 50  0001 C CNN
	1    3800 4550
	0    1    1    0   
$EndComp
Wire Wire Line
	3650 4550 3650 4800
Connection ~ 3650 4800
Wire Wire Line
	3950 4550 3950 4800
$Comp
L opa818:OPA818 U1
U 1 1 5E6C5210
P 3425 6125
F 0 "U1" H 3769 6171 50  0000 L CNN
F 1 "OPA818" H 3769 6080 50  0000 L CNN
F 2 "" H 3425 6125 50  0001 L CNN
F 3 "http://www.ti.com/product/OPA818" H 3425 6125 50  0001 C CNN
F 4 "X" H 3425 6125 50  0001 C CNN "Spice_Primitive"
F 5 "OPA818" H 3425 6125 50  0001 C CNN "Spice_Model"
F 6 "Y" H 3425 6125 50  0001 C CNN "Spice_Netlist_Enabled"
F 7 "4 3 8 5 7" H 3425 6125 50  0001 C CNN "Spice_Node_Sequence"
F 8 "lib/OPA818_PSPICE/OPA818.lib" H 3425 6125 50  0001 C CNN "Spice_Lib_File"
	1    3425 6125
	1    0    0    -1  
$EndComp
Connection ~ 4150 6125
$Comp
L pspice:0 #GND02
U 1 1 5E6C5224
P 1575 5225
F 0 "#GND02" H 1575 5125 50  0001 C CNN
F 1 "0" H 1575 5125 50  0000 C CNN
F 2 "" H 1575 5225 50  0001 C CNN
F 3 "~" H 1575 5225 50  0001 C CNN
	1    1575 5225
	1    0    0    -1  
$EndComp
Text GLabel 3325 5775 1    50   Input ~ 0
+VS
Wire Wire Line
	3325 5775 3325 5825
Connection ~ 3325 5825
Text GLabel 2100 4625 1    118  Input ~ 0
Vtest
$Comp
L Device:C C8
U 1 1 5E6C52AF
P 5250 6125
F 0 "C8" V 5125 5925 50  0000 L CNN
F 1 "100u" V 5325 5850 50  0000 L CNN
F 2 "" H 5288 5975 50  0001 C CNN
F 3 "~" H 5250 6125 50  0001 C CNN
	1    5250 6125
	0    1    1    0   
$EndComp
NoConn ~ 3875 8125
NoConn ~ 7925 6575
$Comp
L pspice:0 #GND04
U 1 1 5E6CFC09
P 3050 7325
F 0 "#GND04" H 3050 7225 50  0001 C CNN
F 1 "0" H 3050 7225 50  0000 C CNN
F 2 "" H 3050 7325 50  0001 C CNN
F 3 "~" H 3050 7325 50  0001 C CNN
	1    3050 7325
	1    0    0    -1  
$EndComp
Wire Wire Line
	3050 6225 3050 6725
Text GLabel 5775 6125 2    118  Input ~ 0
TI_final
Wire Wire Line
	5400 6125 5525 6125
$Comp
L Device:R R7
U 1 1 5E6ABA0D
P 5525 6275
F 0 "R7" H 5595 6321 50  0000 L CNN
F 1 "1Meg" H 5595 6230 50  0000 L CNN
F 2 "" V 5455 6275 50  0001 C CNN
F 3 "~" H 5525 6275 50  0001 C CNN
	1    5525 6275
	1    0    0    -1  
$EndComp
Connection ~ 5525 6125
Wire Wire Line
	5525 6125 5775 6125
$Comp
L pspice:0 #GND010
U 1 1 5E6ABDBC
P 5525 6425
F 0 "#GND010" H 5525 6325 50  0001 C CNN
F 1 "0" H 5525 6325 50  0000 C CNN
F 2 "" H 5525 6425 50  0001 C CNN
F 3 "~" H 5525 6425 50  0001 C CNN
	1    5525 6425
	1    0    0    -1  
$EndComp
Wire Wire Line
	4150 6125 4425 6125
$Comp
L Device:C C1
U 1 1 5E6B5F9D
P 2475 6175
F 0 "C1" H 2525 6075 50  0000 C CNN
F 1 "25p" H 2700 6200 50  0000 C CNN
F 2 "" H 2513 6025 50  0001 C CNN
F 3 "~" H 2475 6175 50  0001 C CNN
	1    2475 6175
	1    0    0    -1  
$EndComp
Connection ~ 2475 6025
Wire Wire Line
	2475 6025 3050 6025
$Comp
L pspice:0 #GND03
U 1 1 5E6B6E82
P 2475 6325
F 0 "#GND03" H 2475 6225 50  0001 C CNN
F 1 "0" H 2475 6225 50  0000 C CNN
F 2 "" H 2475 6325 50  0001 C CNN
F 3 "~" H 2475 6325 50  0001 C CNN
	1    2475 6325
	1    0    0    -1  
$EndComp
Text Notes 2050 6625 0    39   ~ 0
Input Leakage Capacitance \nof 1 foot grounded RG58
Wire Wire Line
	3950 5375 4150 5375
Wire Wire Line
	4150 5375 4150 5925
Connection ~ 3950 5375
Connection ~ 4150 5925
Wire Wire Line
	4425 4800 4425 6125
Connection ~ 3950 4800
Connection ~ 4425 6125
Wire Wire Line
	4425 6125 5100 6125
Text GLabel 4750 6125 1    50   Input ~ 0
TI
Connection ~ 4425 4800
Wire Wire Line
	3950 4800 4425 4800
$Comp
L pspice:0 #GND07
U 1 1 5E740BEF
P 3275 4875
F 0 "#GND07" H 3275 4775 50  0001 C CNN
F 1 "0" H 3375 4750 50  0000 C CNN
F 2 "" H 3275 4875 50  0001 C CNN
F 3 "~" H 3275 4875 50  0001 C CNN
	1    3275 4875
	1    0    0    -1  
$EndComp
Wire Wire Line
	3275 4800 3650 4800
Wire Wire Line
	3275 4800 3275 4875
$Comp
L Device:R R4
U 1 1 5E7641A3
P 3800 4200
F 0 "R4" V 3700 4200 50  0000 C CNN
F 1 "100k" V 3875 4200 50  0000 C CNN
F 2 "" V 3730 4200 50  0001 C CNN
F 3 "~" H 3800 4200 50  0001 C CNN
	1    3800 4200
	0    1    1    0   
$EndComp
$Comp
L Device:C C4
U 1 1 5E7641A9
P 3800 3950
F 0 "C4" V 3850 3850 50  0000 C CNN
F 1 "15p" V 3625 3950 50  0000 C CNN
F 2 "" H 3838 3800 50  0001 C CNN
F 3 "~" H 3800 3950 50  0001 C CNN
	1    3800 3950
	0    1    1    0   
$EndComp
Wire Wire Line
	3650 3950 3650 4200
Wire Wire Line
	3950 3950 3950 4200
Connection ~ 3950 4200
Wire Wire Line
	3950 4200 4425 4200
Wire Wire Line
	3050 5375 3050 6025
Wire Wire Line
	4425 4200 4425 4800
$Comp
L Device:R R3
U 1 1 5E777D93
P 3800 3600
F 0 "R3" V 3700 3600 50  0000 C CNN
F 1 "10k" V 3875 3600 50  0000 C CNN
F 2 "" V 3730 3600 50  0001 C CNN
F 3 "~" H 3800 3600 50  0001 C CNN
	1    3800 3600
	0    1    1    0   
$EndComp
$Comp
L Device:C C3
U 1 1 5E777D99
P 3800 3350
F 0 "C3" V 3850 3250 50  0000 C CNN
F 1 "150p" V 3625 3350 50  0000 C CNN
F 2 "" H 3838 3200 50  0001 C CNN
F 3 "~" H 3800 3350 50  0001 C CNN
	1    3800 3350
	0    1    1    0   
$EndComp
Wire Wire Line
	3650 3350 3650 3600
Wire Wire Line
	3950 3350 3950 3600
Connection ~ 3950 3600
Wire Wire Line
	3950 3600 4425 3600
$Comp
L pspice:0 #GND06
U 1 1 5E77C3F2
P 3275 4275
F 0 "#GND06" H 3275 4175 50  0001 C CNN
F 1 "0" H 3375 4150 50  0000 C CNN
F 2 "" H 3275 4275 50  0001 C CNN
F 3 "~" H 3275 4275 50  0001 C CNN
	1    3275 4275
	1    0    0    -1  
$EndComp
Wire Wire Line
	3275 4200 3275 4275
Wire Wire Line
	3275 4200 3650 4200
Connection ~ 3650 4200
Wire Wire Line
	4425 3600 4425 4200
Connection ~ 4425 4200
$Comp
L Device:R R2
U 1 1 5E78345C
P 3800 2975
F 0 "R2" V 3700 2975 50  0000 C CNN
F 1 "1k" V 3875 2975 50  0000 C CNN
F 2 "" V 3730 2975 50  0001 C CNN
F 3 "~" H 3800 2975 50  0001 C CNN
	1    3800 2975
	0    1    1    0   
$EndComp
$Comp
L Device:C C2
U 1 1 5E783462
P 3800 2725
F 0 "C2" V 3850 2625 50  0000 C CNN
F 1 "1.5n" V 3625 2725 50  0000 C CNN
F 2 "" H 3838 2575 50  0001 C CNN
F 3 "~" H 3800 2725 50  0001 C CNN
	1    3800 2725
	0    1    1    0   
$EndComp
Wire Wire Line
	3650 2725 3650 2975
Wire Wire Line
	3950 2725 3950 2975
Connection ~ 3950 2975
Wire Wire Line
	3950 2975 4425 2975
Wire Wire Line
	4425 2975 4425 3600
Connection ~ 4425 3600
$Comp
L pspice:0 #GND05
U 1 1 5E7876A2
P 3275 3675
F 0 "#GND05" H 3275 3575 50  0001 C CNN
F 1 "0" H 3375 3550 50  0000 C CNN
F 2 "" H 3275 3675 50  0001 C CNN
F 3 "~" H 3275 3675 50  0001 C CNN
	1    3275 3675
	1    0    0    -1  
$EndComp
Wire Wire Line
	3275 3600 3275 3675
Wire Wire Line
	3275 3600 3650 3600
Connection ~ 3650 3600
$Comp
L pspice:0 #GND?
U 1 1 5E79B761
P 3275 3050
F 0 "#GND?" H 3275 2950 50  0001 C CNN
F 1 "0" H 3375 2925 50  0000 C CNN
F 2 "" H 3275 3050 50  0001 C CNN
F 3 "~" H 3275 3050 50  0001 C CNN
	1    3275 3050
	1    0    0    -1  
$EndComp
Wire Wire Line
	3275 2975 3275 3050
Wire Wire Line
	3275 2975 3650 2975
Connection ~ 3650 2975
$EndSCHEMATC
