EESchema Schematic File Version 4
EELAYER 30 0
EELAYER END
$Descr A4 11693 8268
encoding utf-8
Sheet 1 1
Title ""
Date ""
Rev ""
Comp ""
Comment1 ""
Comment2 ""
Comment3 ""
Comment4 ""
$EndDescr
$Comp
L opa818:OPA818 U1
U 1 1 5E5609C0
P 2825 3850
F 0 "U1" H 3169 3896 50  0000 L CNN
F 1 "OPA818" H 3169 3805 50  0000 L CNN
F 2 "" H 2825 3850 50  0001 L CNN
F 3 "http://www.ti.com/product/OPA818" H 2825 3850 50  0001 C CNN
F 4 "X" H 2825 3850 50  0001 C CNN "Spice_Primitive"
F 5 "OPA818" H 2825 3850 50  0001 C CNN "Spice_Model"
F 6 "Y" H 2825 3850 50  0001 C CNN "Spice_Netlist_Enabled"
F 7 "3 4 8 5 7" H 2825 3850 50  0001 C CNN "Spice_Node_Sequence"
F 8 "lib/OPA818_PSPICE/OPA818.lib" H 2825 3850 50  0001 C CNN "Spice_Lib_File"
	1    2825 3850
	1    0    0    -1  
$EndComp
Wire Wire Line
	950  4775 2725 4775
Wire Wire Line
	2725 4150 2725 4775
Wire Wire Line
	2450 3950 2450 4000
Wire Wire Line
	2525 3950 2450 3950
Wire Wire Line
	2725 3375 2725 3550
Wire Wire Line
	950  3375 2725 3375
Wire Wire Line
	1650 3750 2450 3750
Wire Wire Line
	1650 2850 1650 3750
$Comp
L pspice:VSOURCE V2
U 1 1 5E57737B
P 950 4475
F 0 "V2" H 1178 4521 50  0000 L CNN
F 1 "-5V" H 875 4475 50  0000 L CNN
F 2 "" H 950 4475 50  0001 C CNN
F 3 "~" H 950 4475 50  0001 C CNN
F 4 "V" H 950 4475 50  0001 C CNN "Spice_Primitive"
F 5 "dc -5 ac 0" H 950 4475 50  0001 C CNN "Spice_Model"
F 6 "Y" H 950 4475 50  0001 C CNN "Spice_Netlist_Enabled"
	1    950  4475
	-1   0    0    1   
$EndComp
$Comp
L pspice:VSOURCE V3
U 1 1 5E577384
P 975 2650
F 0 "V3" H 1203 2696 50  0000 L CNN
F 1 "Vtest_10mV_AC" H 800 3025 50  0000 L CNN
F 2 "" H 975 2650 50  0001 C CNN
F 3 "~" H 975 2650 50  0001 C CNN
F 4 "V" H 975 2650 50  0001 C CNN "Spice_Primitive"
F 5 "dc 0 ac 10m" H 975 2650 50  0001 C CNN "Spice_Model"
F 6 "Y" H 975 2650 50  0001 C CNN "Spice_Netlist_Enabled"
	1    975  2650
	1    0    0    -1  
$EndComp
$Comp
L pspice:R R1
U 1 1 5E57738A
P 1650 2600
F 0 "R1" H 1718 2646 50  0000 L CNN
F 1 "1k" H 1718 2555 50  0000 L CNN
F 2 "" H 1650 2600 50  0001 C CNN
F 3 "~" H 1650 2600 50  0001 C CNN
	1    1650 2600
	1    0    0    -1  
$EndComp
$Comp
L power:GND #PWR01
U 1 1 5E577390
P 975 2950
F 0 "#PWR01" H 975 2700 50  0001 C CNN
F 1 "GND" H 980 2777 50  0000 C CNN
F 2 "" H 975 2950 50  0001 C CNN
F 3 "" H 975 2950 50  0001 C CNN
	1    975  2950
	1    0    0    -1  
$EndComp
Wire Wire Line
	975  2350 1650 2350
Text GLabel 1500 2350 1    118  Input ~ 0
Vtest3
$Comp
L pspice:0 #GND03
U 1 1 5E57739E
P 2450 4000
F 0 "#GND03" H 2450 3900 50  0001 C CNN
F 1 "0" H 2550 3875 50  0000 C CNN
F 2 "" H 2450 4000 50  0001 C CNN
F 3 "~" H 2450 4000 50  0001 C CNN
	1    2450 4000
	1    0    0    -1  
$EndComp
$Comp
L pspice:0 #GND01
U 1 1 5E5773A4
P 950 3975
F 0 "#GND01" H 950 3875 50  0001 C CNN
F 1 "0" H 1050 3850 50  0000 C CNN
F 2 "" H 950 3975 50  0001 C CNN
F 3 "~" H 950 3975 50  0001 C CNN
	1    950  3975
	1    0    0    -1  
$EndComp
$Comp
L pspice:0 #GND02
U 1 1 5E5773AA
P 950 4175
F 0 "#GND02" H 950 4075 50  0001 C CNN
F 1 "0" H 1050 4050 50  0000 C CNN
F 2 "" H 950 4175 50  0001 C CNN
F 3 "~" H 950 4175 50  0001 C CNN
	1    950  4175
	-1   0    0    1   
$EndComp
$Comp
L pspice:VSOURCE V1
U 1 1 5E5773B9
P 950 3675
F 0 "V1" H 1178 3721 50  0000 L CNN
F 1 "+5V" H 875 3675 50  0000 L CNN
F 2 "" H 950 3675 50  0001 C CNN
F 3 "~" H 950 3675 50  0001 C CNN
F 4 "V" H 950 3675 50  0001 C CNN "Spice_Primitive"
F 5 "dc 5 ac 0" H 950 3675 50  0001 C CNN "Spice_Model"
F 6 "Y" H 950 3675 50  0001 C CNN "Spice_Netlist_Enabled"
	1    950  3675
	1    0    0    -1  
$EndComp
Wire Wire Line
	2900 3100 3250 3100
Wire Wire Line
	2450 3750 2525 3750
Connection ~ 2450 3750
Wire Wire Line
	2450 3100 2450 3750
$Comp
L Device:R R3
U 1 1 5E5773C5
P 2750 3100
F 0 "R3" V 2650 3100 50  0000 C CNN
F 1 "100k" V 2850 3100 50  0000 C CNN
F 2 "" V 2680 3100 50  0001 C CNN
F 3 "~" H 2750 3100 50  0001 C CNN
	1    2750 3100
	0    1    1    0   
$EndComp
Wire Wire Line
	3125 3850 3550 3850
Text GLabel 4150 3850 1    118  Input ~ 0
TI_OPA818
Wire Wire Line
	2725 3550 2825 3550
Wire Wire Line
	2825 3550 2825 3600
Connection ~ 2725 3550
Wire Wire Line
	3550 3100 3550 3650
Wire Wire Line
	3550 3650 2925 3650
Wire Wire Line
	3550 3650 3550 3850
Connection ~ 3550 3650
$Comp
L Device:R R4
U 1 1 5E5B6CCA
P 3400 3100
F 0 "R4" V 3300 3100 50  0000 C CNN
F 1 "110" V 3475 3100 50  0000 C CNN
F 2 "" V 3330 3100 50  0001 C CNN
F 3 "~" H 3400 3100 50  0001 C CNN
	1    3400 3100
	0    1    1    0   
$EndComp
Text Notes 3325 3125 0    39   ~ 0
R_ON
$Comp
L Device:C C4
U 1 1 5E5B9766
P 3725 3250
F 0 "C4" H 3840 3296 50  0000 L CNN
F 1 "18p" H 3840 3205 50  0000 L CNN
F 2 "" H 3763 3100 50  0001 C CNN
F 3 "~" H 3725 3250 50  0001 C CNN
	1    3725 3250
	1    0    0    -1  
$EndComp
Wire Wire Line
	3725 3100 3550 3100
Connection ~ 3550 3100
$Comp
L pspice:0 #GND05
U 1 1 5E5BBA64
P 3725 3400
F 0 "#GND05" H 3725 3300 50  0001 C CNN
F 1 "0" H 3825 3275 50  0000 C CNN
F 2 "" H 3725 3400 50  0001 C CNN
F 3 "~" H 3725 3400 50  0001 C CNN
	1    3725 3400
	1    0    0    -1  
$EndComp
$Comp
L Device:C C2
U 1 1 5E5BC91C
P 2750 2850
F 0 "C2" V 2800 2750 50  0000 C CNN
F 1 "0.2p" V 2800 2975 50  0000 C CNN
F 2 "" H 2788 2700 50  0001 C CNN
F 3 "~" H 2750 2850 50  0001 C CNN
	1    2750 2850
	0    1    1    0   
$EndComp
Wire Wire Line
	2450 3100 2600 3100
Wire Wire Line
	2600 2850 2600 3100
Connection ~ 2600 3100
Wire Wire Line
	2900 2850 2900 3100
Connection ~ 2900 3100
Wire Wire Line
	2900 2525 3250 2525
$Comp
L Device:R R2
U 1 1 5E5C3EA6
P 2750 2525
F 0 "R2" V 2650 2525 50  0000 C CNN
F 1 "1k" V 2750 2525 50  0000 C CNN
F 2 "" V 2680 2525 50  0001 C CNN
F 3 "~" H 2750 2525 50  0001 C CNN
	1    2750 2525
	0    1    1    0   
$EndComp
$Comp
L Device:C C1
U 1 1 5E5C3EAC
P 2750 2275
F 0 "C1" V 2800 2175 50  0000 C CNN
F 1 "0.2p" V 2800 2400 50  0000 C CNN
F 2 "" H 2788 2125 50  0001 C CNN
F 3 "~" H 2750 2275 50  0001 C CNN
	1    2750 2275
	0    1    1    0   
$EndComp
Wire Wire Line
	2450 2525 2600 2525
Wire Wire Line
	2600 2275 2600 2525
Connection ~ 2600 2525
Wire Wire Line
	2900 2275 2900 2525
Connection ~ 2900 2525
Wire Wire Line
	2450 2525 2450 3100
Connection ~ 2450 3100
Text Notes 3275 2350 0    50   ~ 0
OFF - LOW GAIN
Text Notes 3250 2925 0    50   ~ 0
ON - HIGH GAIN
$Comp
L Device:C C3
U 1 1 5E5C8F3A
P 3400 2525
F 0 "C3" V 3450 2425 50  0000 C CNN
F 1 "5p" V 3325 2425 50  0000 C CNN
F 2 "" H 3438 2375 50  0001 C CNN
F 3 "~" H 3400 2525 50  0001 C CNN
	1    3400 2525
	0    1    1    0   
$EndComp
$Comp
L pspice:0 #GND04
U 1 1 5E5C950B
P 3550 2575
F 0 "#GND04" H 3550 2475 50  0001 C CNN
F 1 "0" H 3600 2500 50  0000 C CNN
F 2 "" H 3550 2575 50  0001 C CNN
F 3 "~" H 3550 2575 50  0001 C CNN
	1    3550 2575
	1    0    0    -1  
$EndComp
Wire Wire Line
	3550 2525 3550 2575
Wire Notes Line
	3175 2275 4000 2275
Wire Notes Line
	4000 2275 4000 3575
Wire Notes Line
	4000 3575 3175 3575
Wire Notes Line
	3175 3575 3175 2275
Text Notes 3150 2225 0    118  ~ 0
ADG604 MUX\nParasitics
Text GLabel 1400 3375 1    118  Input ~ 0
V+
Text GLabel 1425 4775 3    118  Input ~ 0
V-
Text GLabel 5650 3600 1    39   Input ~ 0
V+
Wire Wire Line
	5725 3150 6075 3150
$Comp
L Device:R R7
U 1 1 5E61B788
P 5575 3150
F 0 "R7" V 5475 3150 50  0000 C CNN
F 1 "100k" V 5675 3150 50  0000 C CNN
F 2 "" V 5505 3150 50  0001 C CNN
F 3 "~" H 5575 3150 50  0001 C CNN
	1    5575 3150
	0    1    1    0   
$EndComp
$Comp
L Device:R R8
U 1 1 5E61B78F
P 6225 3150
F 0 "R8" V 6125 3150 50  0000 C CNN
F 1 "110" V 6300 3150 50  0000 C CNN
F 2 "" V 6155 3150 50  0001 C CNN
F 3 "~" H 6225 3150 50  0001 C CNN
	1    6225 3150
	0    1    1    0   
$EndComp
Text Notes 6150 3175 0    39   ~ 0
R_ON
$Comp
L Device:C C9
U 1 1 5E61B796
P 6550 3300
F 0 "C9" H 6665 3346 50  0000 L CNN
F 1 "18p" H 6665 3255 50  0000 L CNN
F 2 "" H 6588 3150 50  0001 C CNN
F 3 "~" H 6550 3300 50  0001 C CNN
	1    6550 3300
	1    0    0    -1  
$EndComp
Wire Wire Line
	6550 3150 6375 3150
Connection ~ 6375 3150
$Comp
L pspice:0 #GND08
U 1 1 5E61B79E
P 6550 3450
F 0 "#GND08" H 6550 3350 50  0001 C CNN
F 1 "0" H 6600 3375 50  0000 C CNN
F 2 "" H 6550 3450 50  0001 C CNN
F 3 "~" H 6550 3450 50  0001 C CNN
	1    6550 3450
	1    0    0    -1  
$EndComp
Wire Wire Line
	5275 3150 5425 3150
Wire Wire Line
	5425 2900 5425 3150
Connection ~ 5425 3150
Wire Wire Line
	5725 2900 5725 3150
Connection ~ 5725 3150
Wire Wire Line
	5725 2575 6075 2575
$Comp
L Device:R R6
U 1 1 5E61B7B0
P 5575 2575
F 0 "R6" V 5475 2575 50  0000 C CNN
F 1 "1k" V 5575 2575 50  0000 C CNN
F 2 "" V 5505 2575 50  0001 C CNN
F 3 "~" H 5575 2575 50  0001 C CNN
	1    5575 2575
	0    1    1    0   
$EndComp
$Comp
L Device:C C6
U 1 1 5E61B7B6
P 5575 2325
F 0 "C6" V 5625 2225 50  0000 C CNN
F 1 "0.2p" V 5625 2450 50  0000 C CNN
F 2 "" H 5613 2175 50  0001 C CNN
F 3 "~" H 5575 2325 50  0001 C CNN
	1    5575 2325
	0    1    1    0   
$EndComp
Wire Wire Line
	5275 2575 5425 2575
Wire Wire Line
	5425 2325 5425 2575
Connection ~ 5425 2575
Wire Wire Line
	5725 2325 5725 2575
Connection ~ 5725 2575
Wire Wire Line
	5275 2575 5275 3150
Connection ~ 5275 3150
Text Notes 6100 2400 0    50   ~ 0
OFF - LOW GAIN
Text Notes 6075 2975 0    50   ~ 0
ON - HIGH GAIN
$Comp
L Device:C C8
U 1 1 5E61B7C5
P 6225 2575
F 0 "C8" V 6275 2475 50  0000 C CNN
F 1 "5p" V 6150 2475 50  0000 C CNN
F 2 "" H 6263 2425 50  0001 C CNN
F 3 "~" H 6225 2575 50  0001 C CNN
	1    6225 2575
	0    1    1    0   
$EndComp
$Comp
L pspice:0 #GND07
U 1 1 5E61B7CB
P 6375 2625
F 0 "#GND07" H 6375 2525 50  0001 C CNN
F 1 "0" H 6425 2550 50  0000 C CNN
F 2 "" H 6375 2625 50  0001 C CNN
F 3 "~" H 6375 2625 50  0001 C CNN
	1    6375 2625
	1    0    0    -1  
$EndComp
Wire Wire Line
	6375 2575 6375 2625
Wire Notes Line
	6000 2325 6825 2325
Wire Notes Line
	6825 2325 6825 3625
Wire Notes Line
	6000 3625 6000 2325
Text Notes 5975 2275 0    118  ~ 0
ADG604 MUX\nParasitics
$Comp
L Device:C C5
U 1 1 5E6831EA
P 4475 4425
F 0 "C5" V 4223 4425 50  0000 C CNN
F 1 "1000u" V 4314 4425 50  0000 C CNN
F 2 "" H 4513 4275 50  0001 C CNN
F 3 "~" H 4475 4425 50  0001 C CNN
F 4 "C" H 4475 4425 50  0001 C CNN "Spice_Primitive"
F 5 "1000u" H 4475 4425 50  0001 C CNN "Spice_Model"
F 6 "N" H 4475 4425 50  0001 C CNN "Spice_Netlist_Enabled"
	1    4475 4425
	0    1    1    0   
$EndComp
Text Notes 4400 3550 0    39   ~ 0
AC coupling
$Comp
L Device:R R5
U 1 1 5E697E40
P 4875 3850
F 0 "R5" V 4668 3850 50  0000 C CNN
F 1 "1k" V 4759 3850 50  0000 C CNN
F 2 "" V 4805 3850 50  0001 C CNN
F 3 "~" H 4875 3850 50  0001 C CNN
	1    4875 3850
	0    1    1    0   
$EndComp
Wire Wire Line
	5025 3850 5275 3850
Wire Wire Line
	5275 3150 5275 3850
Connection ~ 5275 3850
Wire Wire Line
	5275 3850 5450 3850
Wire Notes Line
	6000 3625 6825 3625
Wire Wire Line
	5450 4275 5450 4050
Wire Wire Line
	6375 3950 6050 3950
Wire Wire Line
	6375 3950 7200 3950
Connection ~ 6375 3950
Text GLabel 7200 3950 1    118  Input ~ 0
TI_final
Connection ~ 3550 3850
Wire Wire Line
	6375 3150 6375 3750
$Comp
L pspice:0 #GND06
U 1 1 5E6A35A8
P 5450 4275
F 0 "#GND06" H 5450 4175 50  0001 C CNN
F 1 "0" H 5550 4150 50  0000 C CNN
F 2 "" H 5450 4275 50  0001 C CNN
F 3 "~" H 5450 4275 50  0001 C CNN
	1    5450 4275
	1    0    0    -1  
$EndComp
Text GLabel 5650 4250 3    39   Input ~ 0
V-
$Comp
L Device:C C7
U 1 1 5E61B7A4
P 5575 2900
F 0 "C7" V 5625 2800 50  0000 C CNN
F 1 "0.2p" V 5625 3025 50  0000 C CNN
F 2 "" H 5613 2750 50  0001 C CNN
F 3 "~" H 5575 2900 50  0001 C CNN
	1    5575 2900
	0    1    1    0   
$EndComp
Text Notes 3300 4450 0    50   ~ 0
.ac dec 10 1 10MEG
$Comp
L opa818:OPA818 U2
U 1 1 5E7E24C3
P 5750 3950
F 0 "U2" H 6094 3996 50  0000 L CNN
F 1 "OPA818" H 6094 3905 50  0000 L CNN
F 2 "" H 5750 3950 50  0001 L CNN
F 3 "http://www.ti.com/product/OPA818" H 5750 3950 50  0001 C CNN
F 4 "X" H 5750 3950 50  0001 C CNN "Spice_Primitive"
F 5 "OPA818" H 5750 3950 50  0001 C CNN "Spice_Model"
F 6 "Y" H 5750 3950 50  0001 C CNN "Spice_Netlist_Enabled"
F 7 "3 4 8 5 7" H 5750 3950 50  0001 C CNN "Spice_Node_Sequence"
F 8 "lib/OPA818_PSPICE/OPA818.lib" H 5750 3950 50  0001 C CNN "Spice_Lib_File"
	1    5750 3950
	1    0    0    -1  
$EndComp
Wire Wire Line
	5650 3600 5650 3650
Wire Wire Line
	5650 3650 5750 3650
Wire Wire Line
	5750 3650 5750 3700
Connection ~ 5650 3650
Wire Wire Line
	5850 3750 6375 3750
Connection ~ 6375 3750
Wire Wire Line
	6375 3750 6375 3950
Wire Wire Line
	3550 3850 4725 3850
$EndSCHEMATC
