EESchema Schematic File Version 4
EELAYER 30 0
EELAYER END
$Descr A4 11693 8268
encoding utf-8
Sheet 1 1
Title ""
Date ""
Rev ""
Comp ""
Comment1 ""
Comment2 ""
Comment3 ""
Comment4 ""
$EndDescr
Wire Wire Line
	2550 2800 2550 2850
Wire Wire Line
	2625 2800 2550 2800
Wire Wire Line
	1750 2600 2550 2600
Wire Wire Line
	1750 1700 1750 2600
$Comp
L pspice:VSOURCE V5
U 1 1 5E57737B
P 1050 3275
F 0 "V5" H 1278 3321 50  0000 L CNN
F 1 "5V" H 1275 3250 50  0000 L CNN
F 2 "" H 1050 3275 50  0001 C CNN
F 3 "~" H 1050 3275 50  0001 C CNN
F 4 "V" H 1050 3275 50  0001 C CNN "Spice_Primitive"
F 5 "dc 5 ac 0" H 1050 3275 50  0001 C CNN "Spice_Model"
F 6 "Y" H 1050 3275 50  0001 C CNN "Spice_Netlist_Enabled"
	1    1050 3275
	1    0    0    -1  
$EndComp
$Comp
L pspice:VSOURCE V6
U 1 1 5E577384
P 1075 1500
F 0 "V6" H 1303 1546 50  0000 L CNN
F 1 "Vtest_10mV_AC" H 900 1875 50  0000 L CNN
F 2 "" H 1075 1500 50  0001 C CNN
F 3 "~" H 1075 1500 50  0001 C CNN
F 4 "V" H 1075 1500 50  0001 C CNN "Spice_Primitive"
F 5 "dc 0 ac 10m" H 1075 1500 50  0001 C CNN "Spice_Model"
F 6 "Y" H 1075 1500 50  0001 C CNN "Spice_Netlist_Enabled"
	1    1075 1500
	1    0    0    -1  
$EndComp
$Comp
L pspice:R R2
U 1 1 5E57738A
P 1750 1450
F 0 "R2" H 1818 1496 50  0000 L CNN
F 1 "1k" H 1818 1405 50  0000 L CNN
F 2 "" H 1750 1450 50  0001 C CNN
F 3 "~" H 1750 1450 50  0001 C CNN
	1    1750 1450
	1    0    0    -1  
$EndComp
Wire Wire Line
	1075 1200 1750 1200
$Comp
L pspice:0 #GND06
U 1 1 5E57739E
P 2550 2850
F 0 "#GND06" H 2550 2750 50  0001 C CNN
F 1 "0" H 2550 2750 50  0000 C CNN
F 2 "" H 2550 2850 50  0001 C CNN
F 3 "~" H 2550 2850 50  0001 C CNN
	1    2550 2850
	1    0    0    -1  
$EndComp
$Comp
L pspice:VSOURCE V4
U 1 1 5E5773B9
P 1050 2525
F 0 "V4" H 1278 2571 50  0000 L CNN
F 1 "5V" H 1275 2475 50  0000 L CNN
F 2 "" H 1050 2525 50  0001 C CNN
F 3 "~" H 1050 2525 50  0001 C CNN
F 4 "V" H 1050 2525 50  0001 C CNN "Spice_Primitive"
F 5 "dc 5 ac 0" H 1050 2525 50  0001 C CNN "Spice_Model"
F 6 "Y" H 1050 2525 50  0001 C CNN "Spice_Netlist_Enabled"
	1    1050 2525
	1    0    0    -1  
$EndComp
Wire Wire Line
	3000 1950 3350 1950
Wire Wire Line
	2550 2600 2625 2600
Connection ~ 2550 2600
Wire Wire Line
	2550 1950 2550 2600
$Comp
L Device:R R6
U 1 1 5E5773C5
P 2850 1950
F 0 "R6" V 2750 1950 50  0000 C CNN
F 1 "100k" V 2950 1950 50  0000 C CNN
F 2 "" V 2780 1950 50  0001 C CNN
F 3 "~" H 2850 1950 50  0001 C CNN
	1    2850 1950
	0    1    1    0   
$EndComp
Wire Wire Line
	3225 2700 3650 2700
Text GLabel 4250 2700 1    118  Input ~ 0
TI_A
Wire Wire Line
	2825 2400 2925 2400
Wire Wire Line
	2925 2400 2925 2450
Wire Wire Line
	3650 1950 3650 2500
Wire Wire Line
	3650 2500 3025 2500
Wire Wire Line
	3650 2500 3650 2700
Connection ~ 3650 2500
$Comp
L Device:R R8
U 1 1 5E5B6CCA
P 3500 1950
F 0 "R8" V 3400 1950 50  0000 C CNN
F 1 "110" V 3575 1950 50  0000 C CNN
F 2 "" V 3430 1950 50  0001 C CNN
F 3 "~" H 3500 1950 50  0001 C CNN
	1    3500 1950
	0    1    1    0   
$EndComp
Text Notes 3425 1975 0    39   ~ 0
R_ON
$Comp
L Device:C C8
U 1 1 5E5B9766
P 3825 2100
F 0 "C8" H 3940 2146 50  0000 L CNN
F 1 "18p" H 3940 2055 50  0000 L CNN
F 2 "" H 3863 1950 50  0001 C CNN
F 3 "~" H 3825 2100 50  0001 C CNN
	1    3825 2100
	1    0    0    -1  
$EndComp
Wire Wire Line
	3825 1950 3650 1950
Connection ~ 3650 1950
$Comp
L pspice:0 #GND010
U 1 1 5E5BBA64
P 3825 2250
F 0 "#GND010" H 3825 2150 50  0001 C CNN
F 1 "0" H 3925 2125 50  0000 C CNN
F 2 "" H 3825 2250 50  0001 C CNN
F 3 "~" H 3825 2250 50  0001 C CNN
	1    3825 2250
	1    0    0    -1  
$EndComp
$Comp
L Device:C C4
U 1 1 5E5BC91C
P 2850 1700
F 0 "C4" V 2900 1600 50  0000 C CNN
F 1 "2p" V 2900 1825 50  0000 C CNN
F 2 "" H 2888 1550 50  0001 C CNN
F 3 "~" H 2850 1700 50  0001 C CNN
	1    2850 1700
	0    1    1    0   
$EndComp
Wire Wire Line
	2550 1950 2700 1950
Wire Wire Line
	2700 1700 2700 1950
Connection ~ 2700 1950
Wire Wire Line
	3000 1700 3000 1950
Connection ~ 3000 1950
Wire Wire Line
	3000 1375 3350 1375
$Comp
L Device:R R5
U 1 1 5E5C3EA6
P 2850 1375
F 0 "R5" V 2750 1375 50  0000 C CNN
F 1 "1k" V 2850 1375 50  0000 C CNN
F 2 "" V 2780 1375 50  0001 C CNN
F 3 "~" H 2850 1375 50  0001 C CNN
	1    2850 1375
	0    1    1    0   
$EndComp
$Comp
L Device:C C3
U 1 1 5E5C3EAC
P 2850 1125
F 0 "C3" V 2900 1025 50  0000 C CNN
F 1 "0.2p" V 2900 1250 50  0000 C CNN
F 2 "" H 2888 975 50  0001 C CNN
F 3 "~" H 2850 1125 50  0001 C CNN
	1    2850 1125
	0    1    1    0   
$EndComp
Wire Wire Line
	2550 1375 2700 1375
Wire Wire Line
	2700 1125 2700 1375
Connection ~ 2700 1375
Wire Wire Line
	3000 1125 3000 1375
Connection ~ 3000 1375
Wire Wire Line
	2550 1375 2550 1950
Connection ~ 2550 1950
Text Notes 3375 1200 0    50   ~ 0
OFF - LOW GAIN
Text Notes 3350 1775 0    50   ~ 0
ON - HIGH GAIN
$Comp
L Device:C C6
U 1 1 5E5C8F3A
P 3500 1375
F 0 "C6" V 3550 1275 50  0000 C CNN
F 1 "5p" V 3425 1275 50  0000 C CNN
F 2 "" H 3538 1225 50  0001 C CNN
F 3 "~" H 3500 1375 50  0001 C CNN
	1    3500 1375
	0    1    1    0   
$EndComp
$Comp
L pspice:0 #GND08
U 1 1 5E5C950B
P 3650 1425
F 0 "#GND08" H 3650 1325 50  0001 C CNN
F 1 "0" H 3700 1350 50  0000 C CNN
F 2 "" H 3650 1425 50  0001 C CNN
F 3 "~" H 3650 1425 50  0001 C CNN
	1    3650 1425
	1    0    0    -1  
$EndComp
Wire Wire Line
	3650 1375 3650 1425
Wire Notes Line
	3275 1125 4100 1125
Wire Notes Line
	4100 1125 4100 2425
Wire Notes Line
	4100 2425 3275 2425
Wire Notes Line
	3275 2425 3275 1125
Text Notes 3250 1075 0    118  ~ 0
ADG604 MUX\nParasitics
Text Notes 3400 3300 0    50   ~ 0
.ac dec 10 1 10MEG
$Comp
L opa818:OPA818 U2
U 1 1 5E5609C0
P 2925 2700
F 0 "U2" H 3269 2746 50  0000 L CNN
F 1 "OPA818" H 3269 2655 50  0000 L CNN
F 2 "" H 2925 2700 50  0001 L CNN
F 3 "http://www.ti.com/product/OPA818" H 2925 2700 50  0001 C CNN
F 4 "X" H 2925 2700 50  0001 C CNN "Spice_Primitive"
F 5 "OPA818" H 2925 2700 50  0001 C CNN "Spice_Model"
F 6 "Y" H 2925 2700 50  0001 C CNN "Spice_Netlist_Enabled"
F 7 "4 3 8 5 7" H 2925 2700 50  0001 C CNN "Spice_Node_Sequence"
F 8 "lib/OPA818_PSPICE/OPA818.lib" H 2925 2700 50  0001 C CNN "Spice_Lib_File"
	1    2925 2700
	1    0    0    -1  
$EndComp
Wire Wire Line
	3650 2700 4250 2700
Connection ~ 3650 2700
Wire Wire Line
	1050 2825 1050 2900
Wire Wire Line
	1050 2900 1425 2900
Wire Wire Line
	1425 2900 1425 2950
Connection ~ 1050 2900
Wire Wire Line
	1050 2900 1050 2975
$Comp
L pspice:0 #GND04
U 1 1 5E656E9D
P 1425 2950
F 0 "#GND04" H 1425 2850 50  0001 C CNN
F 1 "0" H 1425 2850 50  0000 C CNN
F 2 "" H 1425 2950 50  0001 C CNN
F 3 "~" H 1425 2950 50  0001 C CNN
	1    1425 2950
	1    0    0    -1  
$EndComp
Text GLabel 1050 3575 3    50   Input ~ 0
-VS
Text GLabel 1050 2225 1    50   Input ~ 0
+VS
$Comp
L pspice:0 #GND02
U 1 1 5E6585B7
P 1075 1800
F 0 "#GND02" H 1075 1700 50  0001 C CNN
F 1 "0" H 1075 1700 50  0000 C CNN
F 2 "" H 1075 1800 50  0001 C CNN
F 3 "~" H 1075 1800 50  0001 C CNN
	1    1075 1800
	1    0    0    -1  
$EndComp
Text GLabel 2825 3000 3    50   Input ~ 0
-VS
Text GLabel 2825 2350 1    50   Input ~ 0
+VS
Wire Wire Line
	2825 2350 2825 2400
Connection ~ 2825 2400
Text GLabel 1600 1200 1    118  Input ~ 0
VtestA
Wire Wire Line
	2450 6050 2450 6100
Wire Wire Line
	2525 6050 2450 6050
Wire Wire Line
	1650 5850 2450 5850
Wire Wire Line
	1650 4950 1650 5850
$Comp
L pspice:VSOURCE V3
U 1 1 5E620874
P 975 4750
F 0 "V3" H 1203 4796 50  0000 L CNN
F 1 "Vtest_10mV_AC" H 800 5125 50  0000 L CNN
F 2 "" H 975 4750 50  0001 C CNN
F 3 "~" H 975 4750 50  0001 C CNN
F 4 "V" H 975 4750 50  0001 C CNN "Spice_Primitive"
F 5 "dc 0 ac 10m" H 975 4750 50  0001 C CNN "Spice_Model"
F 6 "Y" H 975 4750 50  0001 C CNN "Spice_Netlist_Enabled"
	1    975  4750
	1    0    0    -1  
$EndComp
$Comp
L pspice:R R1
U 1 1 5E62087A
P 1650 4700
F 0 "R1" H 1718 4746 50  0000 L CNN
F 1 "1k" H 1718 4655 50  0000 L CNN
F 2 "" H 1650 4700 50  0001 C CNN
F 3 "~" H 1650 4700 50  0001 C CNN
	1    1650 4700
	1    0    0    -1  
$EndComp
Wire Wire Line
	975  4450 1650 4450
$Comp
L pspice:0 #GND05
U 1 1 5E620881
P 2450 6100
F 0 "#GND05" H 2450 6000 50  0001 C CNN
F 1 "0" H 2450 6000 50  0000 C CNN
F 2 "" H 2450 6100 50  0001 C CNN
F 3 "~" H 2450 6100 50  0001 C CNN
	1    2450 6100
	1    0    0    -1  
$EndComp
Wire Wire Line
	2900 5200 3250 5200
Wire Wire Line
	2450 5850 2525 5850
Connection ~ 2450 5850
Wire Wire Line
	2450 5200 2450 5850
$Comp
L Device:R R4
U 1 1 5E620894
P 2750 5200
F 0 "R4" V 2650 5200 50  0000 C CNN
F 1 "100k" V 2850 5200 50  0000 C CNN
F 2 "" V 2680 5200 50  0001 C CNN
F 3 "~" H 2750 5200 50  0001 C CNN
	1    2750 5200
	0    1    1    0   
$EndComp
Wire Wire Line
	3125 5950 3550 5950
Text GLabel 4150 5950 1    118  Input ~ 0
TI_B
Wire Wire Line
	2725 5650 2825 5650
Wire Wire Line
	2825 5650 2825 5700
Wire Wire Line
	3550 5200 3550 5750
Wire Wire Line
	3550 5750 2925 5750
Wire Wire Line
	3550 5750 3550 5950
Connection ~ 3550 5750
$Comp
L Device:R R7
U 1 1 5E6208A2
P 3400 5200
F 0 "R7" V 3300 5200 50  0000 C CNN
F 1 "110" V 3475 5200 50  0000 C CNN
F 2 "" V 3330 5200 50  0001 C CNN
F 3 "~" H 3400 5200 50  0001 C CNN
	1    3400 5200
	0    1    1    0   
$EndComp
Text Notes 3325 5225 0    39   ~ 0
R_ON
$Comp
L Device:C C7
U 1 1 5E6208A9
P 3725 5350
F 0 "C7" H 3840 5396 50  0000 L CNN
F 1 "18p" H 3840 5305 50  0000 L CNN
F 2 "" H 3763 5200 50  0001 C CNN
F 3 "~" H 3725 5350 50  0001 C CNN
	1    3725 5350
	1    0    0    -1  
$EndComp
Wire Wire Line
	3725 5200 3550 5200
Connection ~ 3550 5200
$Comp
L pspice:0 #GND09
U 1 1 5E6208B1
P 3725 5500
F 0 "#GND09" H 3725 5400 50  0001 C CNN
F 1 "0" H 3825 5375 50  0000 C CNN
F 2 "" H 3725 5500 50  0001 C CNN
F 3 "~" H 3725 5500 50  0001 C CNN
	1    3725 5500
	1    0    0    -1  
$EndComp
$Comp
L Device:C C2
U 1 1 5E6208B7
P 2750 4950
F 0 "C2" V 2800 4850 50  0000 C CNN
F 1 "0.2p" V 2800 5075 50  0000 C CNN
F 2 "" H 2788 4800 50  0001 C CNN
F 3 "~" H 2750 4950 50  0001 C CNN
	1    2750 4950
	0    1    1    0   
$EndComp
Wire Wire Line
	2450 5200 2600 5200
Wire Wire Line
	2600 4950 2600 5200
Connection ~ 2600 5200
Wire Wire Line
	2900 4950 2900 5200
Connection ~ 2900 5200
Wire Wire Line
	2900 4625 3250 4625
$Comp
L Device:R R3
U 1 1 5E6208C3
P 2750 4625
F 0 "R3" V 2650 4625 50  0000 C CNN
F 1 "1k" V 2750 4625 50  0000 C CNN
F 2 "" V 2680 4625 50  0001 C CNN
F 3 "~" H 2750 4625 50  0001 C CNN
	1    2750 4625
	0    1    1    0   
$EndComp
$Comp
L Device:C C1
U 1 1 5E6208C9
P 2750 4375
F 0 "C1" V 2800 4275 50  0000 C CNN
F 1 "0.2p" V 2800 4500 50  0000 C CNN
F 2 "" H 2788 4225 50  0001 C CNN
F 3 "~" H 2750 4375 50  0001 C CNN
	1    2750 4375
	0    1    1    0   
$EndComp
Wire Wire Line
	2450 4625 2600 4625
Wire Wire Line
	2600 4375 2600 4625
Connection ~ 2600 4625
Wire Wire Line
	2900 4375 2900 4625
Connection ~ 2900 4625
Wire Wire Line
	2450 4625 2450 5200
Connection ~ 2450 5200
Text Notes 3275 4450 0    50   ~ 0
OFF - LOW GAIN
Text Notes 3250 5025 0    50   ~ 0
ON - HIGH GAIN
$Comp
L Device:C C5
U 1 1 5E6208D8
P 3400 4625
F 0 "C5" V 3450 4525 50  0000 C CNN
F 1 "5p" V 3325 4525 50  0000 C CNN
F 2 "" H 3438 4475 50  0001 C CNN
F 3 "~" H 3400 4625 50  0001 C CNN
	1    3400 4625
	0    1    1    0   
$EndComp
$Comp
L pspice:0 #GND07
U 1 1 5E6208DE
P 3550 4675
F 0 "#GND07" H 3550 4575 50  0001 C CNN
F 1 "0" H 3600 4600 50  0000 C CNN
F 2 "" H 3550 4675 50  0001 C CNN
F 3 "~" H 3550 4675 50  0001 C CNN
	1    3550 4675
	1    0    0    -1  
$EndComp
Wire Wire Line
	3550 4625 3550 4675
Wire Notes Line
	3175 4375 4000 4375
Wire Notes Line
	4000 4375 4000 5675
Wire Notes Line
	4000 5675 3175 5675
Wire Notes Line
	3175 5675 3175 4375
Text Notes 3150 4325 0    118  ~ 0
ADG604 MUX\nParasitics
Text Notes 3300 6550 0    50   ~ 0
.ac dec 10 1 10MEG
$Comp
L opa818:OPA818 U1
U 1 1 5E6208F0
P 2825 5950
F 0 "U1" H 3169 5996 50  0000 L CNN
F 1 "OPA818" H 3169 5905 50  0000 L CNN
F 2 "" H 2825 5950 50  0001 L CNN
F 3 "http://www.ti.com/product/OPA818" H 2825 5950 50  0001 C CNN
F 4 "X" H 2825 5950 50  0001 C CNN "Spice_Primitive"
F 5 "OPA818" H 2825 5950 50  0001 C CNN "Spice_Model"
F 6 "Y" H 2825 5950 50  0001 C CNN "Spice_Netlist_Enabled"
F 7 "4 3 8 5 7" H 2825 5950 50  0001 C CNN "Spice_Node_Sequence"
F 8 "lib/OPA818_PSPICE/OPA818.lib" H 2825 5950 50  0001 C CNN "Spice_Lib_File"
	1    2825 5950
	1    0    0    -1  
$EndComp
Wire Wire Line
	3550 5950 4150 5950
Connection ~ 3550 5950
Wire Wire Line
	1325 6150 1325 6200
$Comp
L pspice:0 #GND01
U 1 1 5E620905
P 975 5050
F 0 "#GND01" H 975 4950 50  0001 C CNN
F 1 "0" H 975 4950 50  0000 C CNN
F 2 "" H 975 5050 50  0001 C CNN
F 3 "~" H 975 5050 50  0001 C CNN
	1    975  5050
	1    0    0    -1  
$EndComp
Text GLabel 2725 6250 3    50   Input ~ 0
-VS
Text GLabel 2725 5600 1    50   Input ~ 0
+VS
Wire Wire Line
	2725 5600 2725 5650
Connection ~ 2725 5650
Text GLabel 1500 4450 1    118  Input ~ 0
VtestB
$EndSCHEMATC
