EESchema Schematic File Version 4
EELAYER 30 0
EELAYER END
$Descr A4 11693 8268
encoding utf-8
Sheet 1 1
Title ""
Date ""
Rev ""
Comp ""
Comment1 ""
Comment2 ""
Comment3 ""
Comment4 ""
$EndDescr
$Comp
L Device:R R2
U 1 1 5F989DB1
P 775 6275
F 0 "R2" H 845 6321 50  0000 L CNN
F 1 "R" H 845 6230 50  0000 L CNN
F 2 "Resistor_THT:R_Axial_DIN0207_L6.3mm_D2.5mm_P10.16mm_Horizontal" V 705 6275 50  0001 C CNN
F 3 "~" H 775 6275 50  0001 C CNN
	1    775  6275
	1    0    0    -1  
$EndComp
Text GLabel 1150 6450 0    50   Input ~ 0
SCL
$Comp
L power:+3V3 #PWR04
U 1 1 5F98B87C
P 775 6125
F 0 "#PWR04" H 775 5975 50  0001 C CNN
F 1 "+3V3" H 790 6298 50  0000 C CNN
F 2 "" H 775 6125 50  0001 C CNN
F 3 "" H 775 6125 50  0001 C CNN
	1    775  6125
	1    0    0    -1  
$EndComp
$Comp
L Device:R R4
U 1 1 5F98BC9A
P 1150 6300
F 0 "R4" H 1220 6346 50  0000 L CNN
F 1 "R" H 1220 6255 50  0000 L CNN
F 2 "Resistor_THT:R_Axial_DIN0207_L6.3mm_D2.5mm_P10.16mm_Horizontal" V 1080 6300 50  0001 C CNN
F 3 "~" H 1150 6300 50  0001 C CNN
	1    1150 6300
	1    0    0    -1  
$EndComp
$Comp
L power:+3V3 #PWR06
U 1 1 5F98C06B
P 1150 6150
F 0 "#PWR06" H 1150 6000 50  0001 C CNN
F 1 "+3V3" H 1165 6323 50  0000 C CNN
F 2 "" H 1150 6150 50  0001 C CNN
F 3 "" H 1150 6150 50  0001 C CNN
	1    1150 6150
	1    0    0    -1  
$EndComp
Text GLabel 775  6425 0    50   Input ~ 0
SDA
$Comp
L power:+3V3 #PWR025
U 1 1 5F996AAC
P 7325 1775
F 0 "#PWR025" H 7325 1625 50  0001 C CNN
F 1 "+3V3" V 7340 1903 50  0000 L CNN
F 2 "" H 7325 1775 50  0001 C CNN
F 3 "" H 7325 1775 50  0001 C CNN
	1    7325 1775
	-1   0    0    1   
$EndComp
$Comp
L power:GND #PWR026
U 1 1 5F997480
P 7525 2175
F 0 "#PWR026" H 7525 1925 50  0001 C CNN
F 1 "GND" H 7530 2002 50  0000 C CNN
F 2 "" H 7525 2175 50  0001 C CNN
F 3 "" H 7525 2175 50  0001 C CNN
	1    7525 2175
	0    -1   -1   0   
$EndComp
Text GLabel 7625 1775 3    50   Input ~ 0
SCL
Text GLabel 7825 1775 3    50   Input ~ 0
SDA
Wire Wire Line
	7525 2175 7525 1775
$Comp
L Mechanical:MountingHole H2
U 1 1 5F9CF5FF
P 6600 2875
F 0 "H2" H 6700 2921 50  0000 L CNN
F 1 "MountingHole" H 6700 2830 50  0000 L CNN
F 2 "MountingHole:MountingHole_3.5mm" H 6600 2875 50  0001 C CNN
F 3 "~" H 6600 2875 50  0001 C CNN
	1    6600 2875
	1    0    0    -1  
$EndComp
$Comp
L Mechanical:MountingHole H3
U 1 1 5F9CFBAC
P 6600 3100
F 0 "H3" H 6700 3146 50  0000 L CNN
F 1 "MountingHole" H 6700 3055 50  0000 L CNN
F 2 "MountingHole:MountingHole_3.5mm" H 6600 3100 50  0001 C CNN
F 3 "~" H 6600 3100 50  0001 C CNN
	1    6600 3100
	1    0    0    -1  
$EndComp
$Comp
L Mechanical:MountingHole H4
U 1 1 5F9D006D
P 6600 3325
F 0 "H4" H 6700 3371 50  0000 L CNN
F 1 "MountingHole" H 6700 3280 50  0000 L CNN
F 2 "MountingHole:MountingHole_3.5mm" H 6600 3325 50  0001 C CNN
F 3 "~" H 6600 3325 50  0001 C CNN
	1    6600 3325
	1    0    0    -1  
$EndComp
$Comp
L Connector:Conn_01x08_Female J9
U 1 1 5FADE7E5
P 7625 1575
F 0 "J9" V 7790 1505 50  0000 C CNN
F 1 "BME390" V 7699 1505 50  0000 C CNN
F 2 "Connector_PinSocket_2.54mm:PinSocket_1x08_P2.54mm_Vertical" H 7625 1575 50  0001 C CNN
F 3 "~" H 7625 1575 50  0001 C CNN
	1    7625 1575
	0    -1   -1   0   
$EndComp
$Comp
L Connector:Conn_01x07_Female J8
U 1 1 5FB57B67
P 6475 1675
F 0 "J8" H 6503 1701 50  0000 L CNN
F 1 "SCD30" H 6503 1610 50  0000 L CNN
F 2 "Connector_PinSocket_2.54mm:PinSocket_1x07_P2.54mm_Vertical" H 6475 1675 50  0001 C CNN
F 3 "~" H 6475 1675 50  0001 C CNN
	1    6475 1675
	1    0    0    -1  
$EndComp
$Comp
L power:+3V3 #PWR023
U 1 1 5FBA156B
P 6275 1375
F 0 "#PWR023" H 6275 1225 50  0001 C CNN
F 1 "+3V3" H 6290 1548 50  0000 C CNN
F 2 "" H 6275 1375 50  0001 C CNN
F 3 "" H 6275 1375 50  0001 C CNN
	1    6275 1375
	1    0    0    -1  
$EndComp
$Comp
L power:GND #PWR020
U 1 1 5FBA258D
P 5925 1475
F 0 "#PWR020" H 5925 1225 50  0001 C CNN
F 1 "GND" H 5930 1302 50  0000 C CNN
F 2 "" H 5925 1475 50  0001 C CNN
F 3 "" H 5925 1475 50  0001 C CNN
	1    5925 1475
	1    0    0    -1  
$EndComp
Wire Wire Line
	6275 1475 5925 1475
Text GLabel 6275 1575 0    50   Input ~ 0
SCL
Text GLabel 6275 1675 0    50   Input ~ 0
SDA
Text Notes 1175 5650 0    79   ~ 0
i2c pullups
Text Notes 6100 1100 0    79   ~ 0
SCD30
Text Notes 7450 1250 0    79   ~ 0
BME388/90
$Comp
L Mechanical:MountingHole H1
U 1 1 5FDF5FDF
P 6600 2650
F 0 "H1" H 6700 2696 50  0000 L CNN
F 1 "MountingHole" H 6700 2605 50  0000 L CNN
F 2 "MountingHole:MountingHole_3.7mm" H 6600 2650 50  0001 C CNN
F 3 "~" H 6600 2650 50  0001 C CNN
	1    6600 2650
	1    0    0    -1  
$EndComp
$Comp
L Connector:Conn_01x04_Female J10
U 1 1 60000D99
P 8425 4525
F 0 "J10" H 8453 4501 50  0000 L CNN
F 1 "ssd1306" H 8453 4410 50  0000 L CNN
F 2 "Connector_PinSocket_2.54mm:PinSocket_1x04_P2.54mm_Vertical" H 8425 4525 50  0001 C CNN
F 3 "~" H 8425 4525 50  0001 C CNN
	1    8425 4525
	1    0    0    -1  
$EndComp
$Comp
L power:GND #PWR027
U 1 1 60000DA1
P 7850 4425
F 0 "#PWR027" H 7850 4175 50  0001 C CNN
F 1 "GND" H 7855 4252 50  0000 C CNN
F 2 "" H 7850 4425 50  0001 C CNN
F 3 "" H 7850 4425 50  0001 C CNN
	1    7850 4425
	1    0    0    -1  
$EndComp
$Comp
L power:+3V3 #PWR028
U 1 1 60000DA7
P 8100 4350
F 0 "#PWR028" H 8100 4200 50  0001 C CNN
F 1 "+3V3" V 8115 4478 50  0000 L CNN
F 2 "" H 8100 4350 50  0001 C CNN
F 3 "" H 8100 4350 50  0001 C CNN
	1    8100 4350
	1    0    0    -1  
$EndComp
Wire Wire Line
	8225 4525 8100 4525
Wire Wire Line
	8100 4525 8100 4350
Wire Wire Line
	8225 4425 7850 4425
$Comp
L Connector:Conn_01x12_Female J1
U 1 1 6018A4D9
P 1650 2400
F 0 "J1" H 1678 2376 50  0000 L CNN
F 1 "Conn_01x12_Female" V 1800 2100 50  0000 L CNN
F 2 "Connector_PinSocket_2.54mm:PinSocket_1x12_P2.54mm_Vertical" H 1650 2400 50  0001 C CNN
F 3 "~" H 1650 2400 50  0001 C CNN
	1    1650 2400
	-1   0    0    1   
$EndComp
$Comp
L Connector:Conn_01x16_Female J3
U 1 1 6018BB4F
P 2550 2500
F 0 "J3" H 2500 3350 50  0000 C CNN
F 1 "Conn_01x16_Female" V 2650 2400 50  0000 C CNN
F 2 "Connector_PinSocket_2.54mm:PinSocket_1x16_P2.54mm_Vertical" H 2550 2500 50  0001 C CNN
F 3 "~" H 2550 2500 50  0001 C CNN
	1    2550 2500
	-1   0    0    -1  
$EndComp
Text GLabel 1850 2900 2    50   Input ~ 0
VBAT
Text GLabel 1850 2700 2    50   Input ~ 0
VBUS
$Comp
L power:+3V3 #PWR09
U 1 1 601B9ECE
P 2750 3200
F 0 "#PWR09" H 2750 3050 50  0001 C CNN
F 1 "+3V3" H 2765 3373 50  0000 C CNN
F 2 "" H 2750 3200 50  0001 C CNN
F 3 "" H 2750 3200 50  0001 C CNN
	1    2750 3200
	0    1    1    0   
$EndComp
$Comp
L power:GND #PWR08
U 1 1 601BDD3D
P 2750 3000
F 0 "#PWR08" H 2750 2750 50  0001 C CNN
F 1 "GND" H 2755 2827 50  0000 C CNN
F 2 "" H 2750 3000 50  0001 C CNN
F 3 "" H 2750 3000 50  0001 C CNN
	1    2750 3000
	0    -1   -1   0   
$EndComp
Text GLabel 1850 2300 2    50   Input ~ 0
10
Text GLabel 2750 2300 2    50   Input ~ 0
SCK
Text GLabel 2750 2200 2    50   Input ~ 0
MOSI
Text GLabel 2750 2100 2    50   Input ~ 0
MISO
Text Notes 7800 4000 0    79   ~ 0
SSD1306
Text GLabel 1850 1900 2    50   Input ~ 0
SCL
Text GLabel 1850 1800 2    50   Input ~ 0
SDA
Text Notes 1950 1450 2    79   ~ 0
Adafruit Feather M0 LoRa
$Comp
L Switch:SW_Push_Dual SW1
U 1 1 6028B8CB
P 5150 4850
F 0 "SW1" H 5150 5135 50  0000 C CNN
F 1 "SW_Push_Dual" H 5150 5044 50  0000 C CNN
F 2 "Button_Switch_THT:SW_TH_Tactile_Omron_B3F-10xx" H 5150 5050 50  0001 C CNN
F 3 "~" H 5150 5050 50  0001 C CNN
	1    5150 4850
	1    0    0    -1  
$EndComp
Wire Wire Line
	5350 4850 5350 4650
Wire Wire Line
	5350 4650 4950 4650
Wire Wire Line
	4950 4650 4950 4850
Wire Wire Line
	5350 5050 5350 4900
Wire Wire Line
	5350 4900 4950 4900
Wire Wire Line
	4950 4900 4950 5050
$Comp
L power:GND #PWR019
U 1 1 6028DB07
P 5350 5050
F 0 "#PWR019" H 5350 4800 50  0001 C CNN
F 1 "GND" H 5355 4877 50  0000 C CNN
F 2 "" H 5350 5050 50  0001 C CNN
F 3 "" H 5350 5050 50  0001 C CNN
	1    5350 5050
	1    0    0    -1  
$EndComp
Connection ~ 5350 5050
$Comp
L Device:R R6
U 1 1 6028DEF2
P 4700 4700
F 0 "R6" H 4770 4746 50  0000 L CNN
F 1 "4.7K" H 4770 4655 50  0000 L CNN
F 2 "Resistor_THT:R_Axial_DIN0207_L6.3mm_D2.5mm_P10.16mm_Horizontal" V 4630 4700 50  0001 C CNN
F 3 "~" H 4700 4700 50  0001 C CNN
	1    4700 4700
	1    0    0    -1  
$EndComp
$Comp
L power:+3V3 #PWR018
U 1 1 6028E7B5
P 4700 4550
F 0 "#PWR018" H 4700 4400 50  0001 C CNN
F 1 "+3V3" H 4715 4723 50  0000 C CNN
F 2 "" H 4700 4550 50  0001 C CNN
F 3 "" H 4700 4550 50  0001 C CNN
	1    4700 4550
	1    0    0    -1  
$EndComp
Wire Wire Line
	4950 4850 4700 4850
Connection ~ 4950 4850
Text Notes 4800 4300 0    79   ~ 0
BUTTON A
Text Notes 4100 1150 0    79   ~ 0
Breakouts
$Comp
L Switch:SW_Push_Dual SW2
U 1 1 6025455B
P 6600 5000
F 0 "SW2" H 6600 5285 50  0000 C CNN
F 1 "SW_Push_Dual" H 6600 5194 50  0000 C CNN
F 2 "Button_Switch_THT:SW_TH_Tactile_Omron_B3F-10xx" H 6600 5200 50  0001 C CNN
F 3 "~" H 6600 5200 50  0001 C CNN
	1    6600 5000
	1    0    0    -1  
$EndComp
Wire Wire Line
	6800 5000 6800 4800
Wire Wire Line
	6800 4800 6400 4800
Wire Wire Line
	6400 4800 6400 5000
Wire Wire Line
	6800 5200 6800 5050
Wire Wire Line
	6800 5050 6400 5050
Wire Wire Line
	6400 5050 6400 5200
$Comp
L power:GND #PWR024
U 1 1 602547D7
P 6800 5200
F 0 "#PWR024" H 6800 4950 50  0001 C CNN
F 1 "GND" H 6805 5027 50  0000 C CNN
F 2 "" H 6800 5200 50  0001 C CNN
F 3 "" H 6800 5200 50  0001 C CNN
	1    6800 5200
	1    0    0    -1  
$EndComp
Connection ~ 6800 5200
$Comp
L power:+3V3 #PWR022
U 1 1 602547EC
P 6150 4700
F 0 "#PWR022" H 6150 4550 50  0001 C CNN
F 1 "+3V3" H 6165 4873 50  0000 C CNN
F 2 "" H 6150 4700 50  0001 C CNN
F 3 "" H 6150 4700 50  0001 C CNN
	1    6150 4700
	1    0    0    -1  
$EndComp
Wire Wire Line
	6400 5000 6150 5000
Connection ~ 6400 5000
Text Notes 6250 4450 0    79   ~ 0
BUTTON B
$Comp
L Connector:Micro_SD_Card J2
U 1 1 602BBEEF
P 2000 4450
F 0 "J2" H 1950 5167 50  0000 C CNN
F 1 "Micro_SD_Card" H 1950 5076 50  0000 C CNN
F 2 "footprints:DM3D-SF" H 3150 4750 50  0001 C CNN
F 3 "http://katalog.we-online.de/em/datasheet/693072010801.pdf" H 2000 4450 50  0001 C CNN
	1    2000 4450
	1    0    0    -1  
$EndComp
Text GLabel 1100 4550 0    50   Input ~ 0
SCK
Text GLabel 1100 4750 0    50   Input ~ 0
MISO
Text GLabel 1100 4350 0    50   Input ~ 0
MOSI
Text GLabel 1100 4250 0    50   Input ~ 0
10
$Comp
L power:+3V3 #PWR01
U 1 1 602C0454
P 600 4250
F 0 "#PWR01" H 600 4100 50  0001 C CNN
F 1 "+3V3" H 615 4423 50  0000 C CNN
F 2 "" H 600 4250 50  0001 C CNN
F 3 "" H 600 4250 50  0001 C CNN
	1    600  4250
	1    0    0    -1  
$EndComp
$Comp
L power:GND #PWR02
U 1 1 602C0FF4
P 700 4650
F 0 "#PWR02" H 700 4400 50  0001 C CNN
F 1 "GND" H 705 4477 50  0000 C CNN
F 2 "" H 700 4650 50  0001 C CNN
F 3 "" H 700 4650 50  0001 C CNN
	1    700  4650
	1    0    0    -1  
$EndComp
Wire Wire Line
	1100 4650 700  4650
Wire Wire Line
	1100 4450 600  4450
Wire Wire Line
	600  4450 600  4250
$Comp
L power:GND #PWR010
U 1 1 602C9A4C
P 2800 5050
F 0 "#PWR010" H 2800 4800 50  0001 C CNN
F 1 "GND" H 2805 4877 50  0000 C CNN
F 2 "" H 2800 5050 50  0001 C CNN
F 3 "" H 2800 5050 50  0001 C CNN
	1    2800 5050
	1    0    0    -1  
$EndComp
Text GLabel 1850 2000 2    50   Input ~ 0
5
Text GLabel 1850 2100 2    50   Input ~ 0
6
Text GLabel 1850 2200 2    50   Input ~ 0
9
Text GLabel 4200 4850 0    50   Input ~ 0
11
Text GLabel 1850 2500 2    50   Input ~ 0
12
Text GLabel 1850 2600 2    50   Input ~ 0
13
Text GLabel 2750 1800 2    50   Input ~ 0
DIO1
Text GLabel 2750 1900 2    50   Input ~ 0
TX1
Text GLabel 2750 2000 2    50   Input ~ 0
RX0
Text GLabel 2750 2400 2    50   Input ~ 0
A5
Text GLabel 2750 2500 2    50   Input ~ 0
A4
Text GLabel 2750 2600 2    50   Input ~ 0
A3
Text GLabel 2750 2700 2    50   Input ~ 0
A2
Text GLabel 2750 2800 2    50   Input ~ 0
A1
Text GLabel 2750 2900 2    50   Input ~ 0
A0
Text GLabel 2500 6750 0    50   Input ~ 0
VBUS
$Comp
L power:GND #PWR07
U 1 1 601B48F9
P 2500 6550
F 0 "#PWR07" H 2500 6300 50  0001 C CNN
F 1 "GND" H 2505 6377 50  0000 C CNN
F 2 "" H 2500 6550 50  0001 C CNN
F 3 "" H 2500 6550 50  0001 C CNN
	1    2500 6550
	0    1    1    0   
$EndComp
Text Notes 2975 6375 0    79   ~ 0
POWER
Text GLabel 4550 1600 0    50   Input ~ 0
A1
Text GLabel 4550 1500 0    50   Input ~ 0
A2
Text GLabel 4550 1400 0    50   Input ~ 0
SCL
Text GLabel 4550 1800 0    50   Input ~ 0
VBUS
Text GLabel 4550 1300 0    50   Input ~ 0
SDA
$Comp
L power:+3V3 #PWR014
U 1 1 601BD700
P 4100 1900
F 0 "#PWR014" H 4100 1750 50  0001 C CNN
F 1 "+3V3" H 4115 2073 50  0000 C CNN
F 2 "" H 4100 1900 50  0001 C CNN
F 3 "" H 4100 1900 50  0001 C CNN
	1    4100 1900
	1    0    0    -1  
$EndComp
$Comp
L power:GND #PWR015
U 1 1 601BEB98
P 4250 2000
F 0 "#PWR015" H 4250 1750 50  0001 C CNN
F 1 "GND" H 4255 1827 50  0000 C CNN
F 2 "" H 4250 2000 50  0001 C CNN
F 3 "" H 4250 2000 50  0001 C CNN
	1    4250 2000
	1    0    0    -1  
$EndComp
$Comp
L Connector:Conn_01x04_Female J6
U 1 1 601C5921
P 4475 2800
F 0 "J6" H 4503 2776 50  0000 L CNN
F 1 "Conn_01x04_Female" V 4650 2350 50  0000 L CNN
F 2 "Connector_JST:JST_SH_SM04B-SRSS-TB_1x04-1MP_P1.00mm_Horizontal" H 4475 2800 50  0001 C CNN
F 3 "~" H 4475 2800 50  0001 C CNN
	1    4475 2800
	1    0    0    -1  
$EndComp
$Comp
L power:GND #PWR013
U 1 1 601C98BE
P 3875 2700
F 0 "#PWR013" H 3875 2450 50  0001 C CNN
F 1 "GND" H 3880 2527 50  0000 C CNN
F 2 "" H 3875 2700 50  0001 C CNN
F 3 "" H 3875 2700 50  0001 C CNN
	1    3875 2700
	1    0    0    -1  
$EndComp
$Comp
L power:+3V3 #PWR016
U 1 1 601CA8AD
P 4100 2800
F 0 "#PWR016" H 4100 2650 50  0001 C CNN
F 1 "+3V3" H 4115 2973 50  0000 C CNN
F 2 "" H 4100 2800 50  0001 C CNN
F 3 "" H 4100 2800 50  0001 C CNN
	1    4100 2800
	1    0    0    -1  
$EndComp
Text GLabel 4275 2900 0    50   Input ~ 0
SDA
Text GLabel 4275 3000 0    50   Input ~ 0
SCL
Wire Wire Line
	4275 2700 3875 2700
Wire Wire Line
	4275 2800 4100 2800
$Comp
L device:C C1
U 1 1 601E3F96
P 3425 5175
F 0 "C1" H 3540 5221 50  0000 L CNN
F 1 "0.1uF" H 3540 5130 50  0000 L CNN
F 2 "Capacitor_SMD:C_0805_2012Metric_Pad1.15x1.40mm_HandSolder" H 3463 5025 50  0001 C CNN
F 3 "" H 3425 5175 50  0001 C CNN
	1    3425 5175
	1    0    0    -1  
$EndComp
$Comp
L power:GND #PWR012
U 1 1 601E4483
P 3425 5325
F 0 "#PWR012" H 3425 5075 50  0001 C CNN
F 1 "GND" H 3430 5152 50  0000 C CNN
F 2 "" H 3425 5325 50  0001 C CNN
F 3 "" H 3425 5325 50  0001 C CNN
	1    3425 5325
	1    0    0    -1  
$EndComp
$Comp
L power:+3V3 #PWR011
U 1 1 601E5440
P 3425 5025
F 0 "#PWR011" H 3425 4875 50  0001 C CNN
F 1 "+3V3" H 3440 5198 50  0000 C CNN
F 2 "" H 3425 5025 50  0001 C CNN
F 3 "" H 3425 5025 50  0001 C CNN
	1    3425 5025
	1    0    0    -1  
$EndComp
$Comp
L Device:R R8
U 1 1 602547E2
P 6150 4850
F 0 "R8" H 6220 4896 50  0000 L CNN
F 1 "4.7K" H 6220 4805 50  0000 L CNN
F 2 "Resistor_THT:R_Axial_DIN0207_L6.3mm_D2.5mm_P10.16mm_Horizontal" V 6080 4850 50  0001 C CNN
F 3 "~" H 6150 4850 50  0001 C CNN
	1    6150 4850
	1    0    0    -1  
$EndComp
$Comp
L Device:R R5
U 1 1 602D018E
P 4350 4700
F 0 "R5" H 4420 4746 50  0000 L CNN
F 1 "4.7K" H 4420 4655 50  0000 L CNN
F 2 "Resistor_SMD:R_0805_2012Metric_Pad1.15x1.40mm_HandSolder" V 4280 4700 50  0001 C CNN
F 3 "~" H 4350 4700 50  0001 C CNN
	1    4350 4700
	1    0    0    -1  
$EndComp
Wire Wire Line
	4200 4850 4350 4850
Wire Wire Line
	4350 4850 4700 4850
Connection ~ 4350 4850
Connection ~ 4700 4850
$Comp
L power:+3V3 #PWR017
U 1 1 602D6DC1
P 4350 4550
F 0 "#PWR017" H 4350 4400 50  0001 C CNN
F 1 "+3V3" H 4365 4723 50  0000 C CNN
F 2 "" H 4350 4550 50  0001 C CNN
F 3 "" H 4350 4550 50  0001 C CNN
	1    4350 4550
	1    0    0    -1  
$EndComp
$Comp
L Device:R R7
U 1 1 602D86EA
P 5975 4850
F 0 "R7" H 6045 4896 50  0000 L CNN
F 1 "4.7K" H 6045 4805 50  0000 L CNN
F 2 "Resistor_SMD:R_0805_2012Metric_Pad1.15x1.40mm_HandSolder" V 5905 4850 50  0001 C CNN
F 3 "~" H 5975 4850 50  0001 C CNN
	1    5975 4850
	1    0    0    -1  
$EndComp
Wire Wire Line
	6150 5000 5975 5000
Connection ~ 6150 5000
Wire Wire Line
	5975 5000 5875 5000
Connection ~ 5975 5000
$Comp
L power:+3V3 #PWR021
U 1 1 602D9FCD
P 5975 4700
F 0 "#PWR021" H 5975 4550 50  0001 C CNN
F 1 "+3V3" H 5990 4873 50  0000 C CNN
F 2 "" H 5975 4700 50  0001 C CNN
F 3 "" H 5975 4700 50  0001 C CNN
	1    5975 4700
	1    0    0    -1  
$EndComp
Text GLabel 8225 4625 0    50   Input ~ 0
SCL
Text GLabel 8225 4725 0    50   Input ~ 0
SDA
$Comp
L Connector:Conn_01x02_Male J5
U 1 1 607C3DF2
P 4350 3650
F 0 "J5" H 4458 3831 50  0000 C CNN
F 1 "Conn_01x02_Male" H 4458 3740 50  0000 C CNN
F 2 "Connector_PinHeader_2.54mm:PinHeader_1x02_P2.54mm_Vertical" H 4350 3650 50  0001 C CNN
F 3 "~" H 4350 3650 50  0001 C CNN
	1    4350 3650
	1    0    0    -1  
$EndComp
Text GLabel 4550 3750 2    50   Input ~ 0
DIO1
Text GLabel 4550 3650 2    50   Input ~ 0
6
Text Notes 4675 3450 0    79   ~ 0
LORAWAN
$Comp
L Device:Jumper_NO_Small JP1
U 1 1 607C9147
P 5300 3725
F 0 "JP1" H 5300 3910 50  0000 C CNN
F 1 "Jumper_NO_Small" H 5300 3819 50  0000 C CNN
F 2 "Jumper:SolderJumper-2_P1.3mm_Open_RoundedPad1.0x1.5mm" H 5300 3725 50  0001 C CNN
F 3 "~" H 5300 3725 50  0001 C CNN
	1    5300 3725
	1    0    0    -1  
$EndComp
Text GLabel 5200 3725 0    50   Input ~ 0
DIO1
Text GLabel 5400 3725 2    50   Input ~ 0
6
Text GLabel 5875 5000 0    50   Input ~ 0
12
$Comp
L Connector:Barrel_Jack_MountingPin J4
U 1 1 607F42DF
P 2800 6650
F 0 "J4" H 2570 6522 50  0000 R CNN
F 1 "Barrel_Jack_MountingPin" H 2570 6613 50  0000 R CNN
F 2 "Connector_BarrelJack:BarrelJack_Horizontal" H 2850 6610 50  0001 C CNN
F 3 "~" H 2850 6610 50  0001 C CNN
	1    2800 6650
	-1   0    0    1   
$EndComp
Wire Wire Line
	2500 6350 2500 6550
Wire Wire Line
	2500 6350 2800 6350
Connection ~ 2500 6550
$Comp
L Switch:SW_Coded_SH-7010 SW3
U 1 1 6083DFB0
P 8050 3050
F 0 "SW3" H 8107 3517 50  0000 C CNN
F 1 "SW_Coded_SH-7010" H 8107 3426 50  0000 C CNN
F 2 "footprints:sd2010_dip" H 7750 2600 50  0001 L CNN
F 3 "https://www.nidec-copal-electronics.com/e/catalog/switch/sh-7000.pdf" H 8050 3050 50  0001 C CNN
	1    8050 3050
	1    0    0    -1  
$EndComp
$Comp
L Mechanical:MountingHole H7
U 1 1 6086C61D
P 5050 6600
F 0 "H7" H 5150 6646 50  0000 L CNN
F 1 "MountingHole" H 5150 6555 50  0000 L CNN
F 2 "MountingHole:MountingHole_2.2mm_M2" H 5050 6600 50  0001 C CNN
F 3 "~" H 5050 6600 50  0001 C CNN
	1    5050 6600
	1    0    0    -1  
$EndComp
$Comp
L Mechanical:MountingHole H6
U 1 1 6086C0E9
P 5050 6350
F 0 "H6" H 5150 6396 50  0000 L CNN
F 1 "MountingHole" H 5150 6305 50  0000 L CNN
F 2 "MountingHole:MountingHole_2.2mm_M2" H 5050 6350 50  0001 C CNN
F 3 "~" H 5050 6350 50  0001 C CNN
	1    5050 6350
	1    0    0    -1  
$EndComp
$Comp
L Mechanical:MountingHole H5
U 1 1 6036906D
P 5050 6100
F 0 "H5" H 5150 6146 50  0000 L CNN
F 1 "MountingHole" H 5150 6055 50  0000 L CNN
F 2 "MountingHole:MountingHole_2.2mm_M2" H 5050 6100 50  0001 C CNN
F 3 "~" H 5050 6100 50  0001 C CNN
	1    5050 6100
	1    0    0    -1  
$EndComp
$Comp
L Mechanical:MountingHole H8
U 1 1 6087972C
P 5050 6875
F 0 "H8" H 5150 6921 50  0000 L CNN
F 1 "MountingHole" H 5150 6830 50  0000 L CNN
F 2 "MountingHole:MountingHole_2.2mm_M2" H 5050 6875 50  0001 C CNN
F 3 "~" H 5050 6875 50  0001 C CNN
	1    5050 6875
	1    0    0    -1  
$EndComp
$Comp
L power:+3V3 #PWR029
U 1 1 60663FBD
P 8600 2850
F 0 "#PWR029" H 8600 2700 50  0001 C CNN
F 1 "+3V3" V 8615 2978 50  0000 L CNN
F 2 "" H 8600 2850 50  0001 C CNN
F 3 "" H 8600 2850 50  0001 C CNN
	1    8600 2850
	1    0    0    -1  
$EndComp
Wire Wire Line
	8600 2850 8450 2850
Text GLabel 1850 2400 2    50   Input ~ 0
11
Text GLabel 750  7150 0    50   Input ~ 0
SDA
$Comp
L power:+3V3 #PWR05
U 1 1 602C56A8
P 1125 6875
F 0 "#PWR05" H 1125 6725 50  0001 C CNN
F 1 "+3V3" H 1140 7048 50  0000 C CNN
F 2 "" H 1125 6875 50  0001 C CNN
F 3 "" H 1125 6875 50  0001 C CNN
	1    1125 6875
	1    0    0    -1  
$EndComp
$Comp
L Device:R R3
U 1 1 602C569E
P 1125 7025
F 0 "R3" H 1195 7071 50  0000 L CNN
F 1 "R" H 1195 6980 50  0000 L CNN
F 2 "Resistor_SMD:R_0805_2012Metric_Pad1.15x1.40mm_HandSolder" V 1055 7025 50  0001 C CNN
F 3 "~" H 1125 7025 50  0001 C CNN
	1    1125 7025
	1    0    0    -1  
$EndComp
$Comp
L power:+3V3 #PWR03
U 1 1 602C5694
P 750 6850
F 0 "#PWR03" H 750 6700 50  0001 C CNN
F 1 "+3V3" H 765 7023 50  0000 C CNN
F 2 "" H 750 6850 50  0001 C CNN
F 3 "" H 750 6850 50  0001 C CNN
	1    750  6850
	1    0    0    -1  
$EndComp
Text GLabel 1125 7175 0    50   Input ~ 0
SCL
$Comp
L Device:R R1
U 1 1 602C5503
P 750 7000
F 0 "R1" H 820 7046 50  0000 L CNN
F 1 "R" H 820 6955 50  0000 L CNN
F 2 "Resistor_SMD:R_0805_2012Metric_Pad1.15x1.40mm_HandSolder" V 680 7000 50  0001 C CNN
F 3 "~" H 750 7000 50  0001 C CNN
	1    750  7000
	1    0    0    -1  
$EndComp
$Comp
L device:R R16
U 1 1 606C19B0
P 10800 3100
F 0 "R16" H 10870 3146 50  0000 L CNN
F 1 "R" H 10870 3055 50  0000 L CNN
F 2 "Resistor_SMD:R_0805_2012Metric_Pad1.15x1.40mm_HandSolder" V 10730 3100 50  0001 C CNN
F 3 "" H 10800 3100 50  0001 C CNN
	1    10800 3100
	1    0    0    -1  
$EndComp
$Comp
L device:R R15
U 1 1 606C2AE8
P 10550 3100
F 0 "R15" H 10620 3146 50  0000 L CNN
F 1 "R" H 10620 3055 50  0000 L CNN
F 2 "Resistor_THT:R_Axial_DIN0207_L6.3mm_D2.5mm_P10.16mm_Horizontal" V 10480 3100 50  0001 C CNN
F 3 "" H 10550 3100 50  0001 C CNN
	1    10550 3100
	1    0    0    -1  
$EndComp
$Comp
L device:R R14
U 1 1 606C347F
P 10300 3200
F 0 "R14" H 10370 3246 50  0000 L CNN
F 1 "R" H 10370 3155 50  0000 L CNN
F 2 "Resistor_SMD:R_0805_2012Metric_Pad1.15x1.40mm_HandSolder" V 10230 3200 50  0001 C CNN
F 3 "" H 10300 3200 50  0001 C CNN
	1    10300 3200
	1    0    0    -1  
$EndComp
$Comp
L device:R R13
U 1 1 606C39E6
P 10050 3200
F 0 "R13" H 10120 3246 50  0000 L CNN
F 1 "R" H 10120 3155 50  0000 L CNN
F 2 "Resistor_THT:R_Axial_DIN0207_L6.3mm_D2.5mm_P10.16mm_Horizontal" V 9980 3200 50  0001 C CNN
F 3 "" H 10050 3200 50  0001 C CNN
	1    10050 3200
	1    0    0    -1  
$EndComp
$Comp
L device:R R12
U 1 1 606D883A
P 9800 3300
F 0 "R12" H 9870 3346 50  0000 L CNN
F 1 "R" H 9870 3255 50  0000 L CNN
F 2 "Resistor_SMD:R_0805_2012Metric_Pad1.15x1.40mm_HandSolder" V 9730 3300 50  0001 C CNN
F 3 "" H 9800 3300 50  0001 C CNN
	1    9800 3300
	1    0    0    -1  
$EndComp
$Comp
L device:R R11
U 1 1 606D9004
P 9550 3300
F 0 "R11" H 9620 3346 50  0000 L CNN
F 1 "R" H 9620 3255 50  0000 L CNN
F 2 "Resistor_THT:R_Axial_DIN0207_L6.3mm_D2.5mm_P10.16mm_Horizontal" V 9480 3300 50  0001 C CNN
F 3 "" H 9550 3300 50  0001 C CNN
	1    9550 3300
	1    0    0    -1  
$EndComp
$Comp
L device:R R10
U 1 1 606D96CA
P 9300 3400
F 0 "R10" H 9370 3446 50  0000 L CNN
F 1 "R" H 9370 3355 50  0000 L CNN
F 2 "Resistor_SMD:R_0805_2012Metric_Pad1.15x1.40mm_HandSolder" V 9230 3400 50  0001 C CNN
F 3 "" H 9300 3400 50  0001 C CNN
	1    9300 3400
	1    0    0    -1  
$EndComp
$Comp
L device:R R9
U 1 1 606D9CC7
P 9050 3400
F 0 "R9" H 9120 3446 50  0000 L CNN
F 1 "R" H 9120 3355 50  0000 L CNN
F 2 "Resistor_THT:R_Axial_DIN0207_L6.3mm_D2.5mm_P10.16mm_Horizontal" V 8980 3400 50  0001 C CNN
F 3 "" H 9050 3400 50  0001 C CNN
	1    9050 3400
	1    0    0    -1  
$EndComp
Wire Wire Line
	8450 2950 10550 2950
Wire Wire Line
	10550 2950 10800 2950
Connection ~ 10550 2950
Wire Wire Line
	10300 3050 10050 3050
Wire Wire Line
	8450 3050 10050 3050
Connection ~ 10050 3050
Wire Wire Line
	9800 3150 9550 3150
Wire Wire Line
	8450 3150 9550 3150
Connection ~ 9550 3150
Wire Wire Line
	9300 3250 9050 3250
Wire Wire Line
	8450 3250 9050 3250
Connection ~ 9050 3250
$Comp
L power:GND #PWR030
U 1 1 606E1128
P 9050 3550
F 0 "#PWR030" H 9050 3300 50  0001 C CNN
F 1 "GND" H 9055 3377 50  0000 C CNN
F 2 "" H 9050 3550 50  0001 C CNN
F 3 "" H 9050 3550 50  0001 C CNN
	1    9050 3550
	1    0    0    -1  
$EndComp
$Comp
L power:GND #PWR031
U 1 1 606E1808
P 9300 3550
F 0 "#PWR031" H 9300 3300 50  0001 C CNN
F 1 "GND" H 9305 3377 50  0000 C CNN
F 2 "" H 9300 3550 50  0001 C CNN
F 3 "" H 9300 3550 50  0001 C CNN
	1    9300 3550
	1    0    0    -1  
$EndComp
$Comp
L power:GND #PWR032
U 1 1 606E1D62
P 9550 3450
F 0 "#PWR032" H 9550 3200 50  0001 C CNN
F 1 "GND" H 9555 3277 50  0000 C CNN
F 2 "" H 9550 3450 50  0001 C CNN
F 3 "" H 9550 3450 50  0001 C CNN
	1    9550 3450
	1    0    0    -1  
$EndComp
$Comp
L power:GND #PWR033
U 1 1 606E22F7
P 9800 3450
F 0 "#PWR033" H 9800 3200 50  0001 C CNN
F 1 "GND" H 9805 3277 50  0000 C CNN
F 2 "" H 9800 3450 50  0001 C CNN
F 3 "" H 9800 3450 50  0001 C CNN
	1    9800 3450
	1    0    0    -1  
$EndComp
$Comp
L power:GND #PWR034
U 1 1 606E2881
P 10050 3350
F 0 "#PWR034" H 10050 3100 50  0001 C CNN
F 1 "GND" H 10055 3177 50  0000 C CNN
F 2 "" H 10050 3350 50  0001 C CNN
F 3 "" H 10050 3350 50  0001 C CNN
	1    10050 3350
	1    0    0    -1  
$EndComp
$Comp
L power:GND #PWR035
U 1 1 606E2DB0
P 10300 3350
F 0 "#PWR035" H 10300 3100 50  0001 C CNN
F 1 "GND" H 10305 3177 50  0000 C CNN
F 2 "" H 10300 3350 50  0001 C CNN
F 3 "" H 10300 3350 50  0001 C CNN
	1    10300 3350
	1    0    0    -1  
$EndComp
$Comp
L power:GND #PWR036
U 1 1 606E3368
P 10550 3250
F 0 "#PWR036" H 10550 3000 50  0001 C CNN
F 1 "GND" H 10555 3077 50  0000 C CNN
F 2 "" H 10550 3250 50  0001 C CNN
F 3 "" H 10550 3250 50  0001 C CNN
	1    10550 3250
	1    0    0    -1  
$EndComp
$Comp
L power:GND #PWR037
U 1 1 606E480E
P 10800 3250
F 0 "#PWR037" H 10800 3000 50  0001 C CNN
F 1 "GND" H 10805 3077 50  0000 C CNN
F 2 "" H 10800 3250 50  0001 C CNN
F 3 "" H 10800 3250 50  0001 C CNN
	1    10800 3250
	1    0    0    -1  
$EndComp
Wire Wire Line
	10550 2950 10550 2750
Wire Wire Line
	10050 3050 10050 2750
Wire Wire Line
	9550 3150 9550 2750
Wire Wire Line
	9050 3250 9050 2750
$Comp
L Connector:Conn_01x08_Female J7
U 1 1 6072B3E9
P 4750 1600
F 0 "J7" H 4778 1576 50  0000 L CNN
F 1 "Conn_01x08_Female" H 4778 1485 50  0000 L CNN
F 2 "Connector_PinSocket_2.54mm:PinSocket_1x08_P2.54mm_Vertical" H 4750 1600 50  0001 C CNN
F 3 "~" H 4750 1600 50  0001 C CNN
	1    4750 1600
	1    0    0    -1  
$EndComp
Wire Wire Line
	4550 2000 4250 2000
Wire Wire Line
	4550 1900 4100 1900
Text GLabel 4550 1700 0    50   Input ~ 0
A0
$Comp
L power:GND #PWR0101
U 1 1 60798E1F
P 5025 2700
F 0 "#PWR0101" H 5025 2450 50  0001 C CNN
F 1 "GND" H 5030 2527 50  0000 C CNN
F 2 "" H 5025 2700 50  0001 C CNN
F 3 "" H 5025 2700 50  0001 C CNN
	1    5025 2700
	1    0    0    -1  
$EndComp
$Comp
L power:+3V3 #PWR0102
U 1 1 60798E29
P 5250 2800
F 0 "#PWR0102" H 5250 2650 50  0001 C CNN
F 1 "+3V3" H 5265 2973 50  0000 C CNN
F 2 "" H 5250 2800 50  0001 C CNN
F 3 "" H 5250 2800 50  0001 C CNN
	1    5250 2800
	1    0    0    -1  
$EndComp
Text GLabel 5425 2900 0    50   Input ~ 0
SDA
Text GLabel 5425 3000 0    50   Input ~ 0
SCL
Wire Wire Line
	5425 2700 5025 2700
Wire Wire Line
	5425 2800 5250 2800
Text GLabel 10550 2750 2    50   Input ~ 0
A5
Text GLabel 10050 2750 2    50   Input ~ 0
A4
Text GLabel 9550 2750 2    50   Input ~ 0
A3
$Comp
L Connector:Conn_01x04_Female J11
U 1 1 6079898D
P 5625 2800
F 0 "J11" H 5653 2776 50  0000 L CNN
F 1 "Conn_01x04_Female" V 5800 2350 50  0000 L CNN
F 2 "Connector_JST:JST_SH_SM04B-SRSS-TB_1x04-1MP_P1.00mm_Horizontal" H 5625 2800 50  0001 C CNN
F 3 "~" H 5625 2800 50  0001 C CNN
	1    5625 2800
	1    0    0    -1  
$EndComp
Text Notes 4800 2450 0    79   ~ 0
QWIIC
Text GLabel 9050 2750 2    50   Input ~ 0
5
$EndSCHEMATC
