<?xml version="1.0" standalone="no"?>
 <!DOCTYPE svg PUBLIC "-//W3C//DTD SVG 1.1//EN" 
 "http://www.w3.org/Graphics/SVG/1.1/DTD/svg11.dtd"> 
<svg
  xmlns:svg="http://www.w3.org/2000/svg"
  xmlns="http://www.w3.org/2000/svg"
  xmlns:xlink="http://www.w3.org/1999/xlink"
  version="1.1"
  width="8.305800cm" height="12.654280cm" viewBox="0 0 32700 49820">
<title>SVG Picture created as remote-F_Mask.svg date 2021/02/12 17:34:57 </title>
  <desc>Picture generated by PCBNEW </desc>
<g style="fill:#000000; fill-opacity:1;stroke:#000000; stroke-opacity:1;
stroke-linecap:round; stroke-linejoin:round;"
 transform="translate(0 0) scale(1 1)">
</g>
<g style="fill:#000000; fill-opacity:0.0; 
stroke:#000000; stroke-width:-0.000393701; stroke-opacity:1; 
stroke-linecap:round; stroke-linejoin:round;">
<g >
</g>
<g >
</g>
<g >
</g>
<g >
</g>
<g >
</g>
<g >
</g>
<g >
</g>
<g >
</g>
<g style="fill:#000000; fill-opacity:0.0; 
stroke:#000000; stroke-width:-0.000393701; stroke-opacity:1; 
stroke-linecap:round; stroke-linejoin:round;">
</g>
<g style="fill:#000000; fill-opacity:1.0; 
stroke:#000000; stroke-width:0; stroke-opacity:1; 
stroke-linecap:round; stroke-linejoin:round;">
<circle cx="23859.9" cy="32120" r="334.646" /> 
<circle cx="19859.9" cy="32120" r="334.646" /> 
</g>
<g style="fill:#000000; fill-opacity:1.0; 
stroke:#000000; stroke-width:39.3701; stroke-opacity:1; 
stroke-linecap:round; stroke-linejoin:round;">
</g>
<g >
</g>
<g style="fill:#000000; fill-opacity:1.0; 
stroke:#000000; stroke-width:39.3701; stroke-opacity:1; 
stroke-linecap:round; stroke-linejoin:round;">
</g>
<g style="fill:#000000; fill-opacity:1.0; 
stroke:#000000; stroke-width:0; stroke-opacity:1; 
stroke-linecap:round; stroke-linejoin:round;">
<circle cx="23859.9" cy="30820" r="334.646" /> 
<circle cx="19859.9" cy="30820" r="334.646" /> 
</g>
<g style="fill:#000000; fill-opacity:1.0; 
stroke:#000000; stroke-width:39.3701; stroke-opacity:1; 
stroke-linecap:round; stroke-linejoin:round;">
</g>
<g >
</g>
<g style="fill:#000000; fill-opacity:1.0; 
stroke:#000000; stroke-width:39.3701; stroke-opacity:1; 
stroke-linecap:round; stroke-linejoin:round;">
</g>
<g style="fill:#000000; fill-opacity:1.0; 
stroke:#000000; stroke-width:0; stroke-opacity:1; 
stroke-linecap:round; stroke-linejoin:round;">
<circle cx="23909.9" cy="25620" r="334.646" /> 
<circle cx="19909.9" cy="25620" r="334.646" /> 
</g>
<g style="fill:#000000; fill-opacity:1.0; 
stroke:#000000; stroke-width:39.3701; stroke-opacity:1; 
stroke-linecap:round; stroke-linejoin:round;">
</g>
<g >
</g>
<g style="fill:#000000; fill-opacity:1.0; 
stroke:#000000; stroke-width:39.3701; stroke-opacity:1; 
stroke-linecap:round; stroke-linejoin:round;">
</g>
<g style="fill:#000000; fill-opacity:1.0; 
stroke:#000000; stroke-width:0; stroke-opacity:1; 
stroke-linecap:round; stroke-linejoin:round;">
<circle cx="27415" cy="47320.8" r="708.661" /> 
</g>
<g style="fill:#000000; fill-opacity:1.0; 
stroke:#000000; stroke-width:39.3701; stroke-opacity:1; 
stroke-linecap:round; stroke-linejoin:round;">
</g>
<g >
</g>
<g style="fill:#000000; fill-opacity:1.0; 
stroke:#000000; stroke-width:39.3701; stroke-opacity:1; 
stroke-linecap:round; stroke-linejoin:round;">
</g>
<g style="fill:#000000; fill-opacity:1.0; 
stroke:#000000; stroke-width:0; stroke-opacity:1; 
stroke-linecap:round; stroke-linejoin:round;">
<circle cx="8359.9" cy="47320.8" r="708.661" /> 
</g>
<g style="fill:#000000; fill-opacity:1.0; 
stroke:#000000; stroke-width:39.3701; stroke-opacity:1; 
stroke-linecap:round; stroke-linejoin:round;">
</g>
<g >
</g>
<g style="fill:#000000; fill-opacity:1.0; 
stroke:#000000; stroke-width:39.3701; stroke-opacity:1; 
stroke-linecap:round; stroke-linejoin:round;">
</g>
<g style="fill:#000000; fill-opacity:1.0; 
stroke:#000000; stroke-width:0; stroke-opacity:1; 
stroke-linecap:round; stroke-linejoin:round;">
<circle cx="27415" cy="8620.04" r="708.661" /> 
</g>
<g style="fill:#000000; fill-opacity:1.0; 
stroke:#000000; stroke-width:39.3701; stroke-opacity:1; 
stroke-linecap:round; stroke-linejoin:round;">
</g>
<g >
</g>
<g style="fill:#000000; fill-opacity:1.0; 
stroke:#000000; stroke-width:39.3701; stroke-opacity:1; 
stroke-linecap:round; stroke-linejoin:round;">
</g>
<g style="fill:#000000; fill-opacity:1.0; 
stroke:#000000; stroke-width:0; stroke-opacity:1; 
stroke-linecap:round; stroke-linejoin:round;">
<circle cx="8359.9" cy="8620.04" r="708.661" /> 
</g>
<g style="fill:#000000; fill-opacity:1.0; 
stroke:#000000; stroke-width:39.3701; stroke-opacity:1; 
stroke-linecap:round; stroke-linejoin:round;">
</g>
<g >
</g>
<g style="fill:#000000; fill-opacity:1.0; 
stroke:#000000; stroke-width:39.3701; stroke-opacity:1; 
stroke-linecap:round; stroke-linejoin:round;">
</g>
<g style="fill:#000000; fill-opacity:1.0; 
stroke:#000000; stroke-width:0; stroke-opacity:1; 
stroke-linecap:round; stroke-linejoin:round;">
<circle cx="24150.8" cy="16841.7" r="354.331" /> 
</g>
<g style="fill:#000000; fill-opacity:1.0; 
stroke:#000000; stroke-width:39.3701; stroke-opacity:1; 
stroke-linecap:round; stroke-linejoin:round;">
</g>
<g style="fill:#000000; fill-opacity:1.0; 
stroke:#000000; stroke-width:0; stroke-opacity:1; 
stroke-linecap:round; stroke-linejoin:round;">
<circle cx="26709.9" cy="16841.7" r="354.331" /> 
</g>
<g style="fill:#000000; fill-opacity:1.0; 
stroke:#000000; stroke-width:39.3701; stroke-opacity:1; 
stroke-linecap:round; stroke-linejoin:round;">
</g>
<g style="fill:#000000; fill-opacity:1.0; 
stroke:#000000; stroke-width:0; stroke-opacity:1; 
stroke-linecap:round; stroke-linejoin:round;">
<circle cx="24150.8" cy="15070" r="354.331" /> 
</g>
<g style="fill:#000000; fill-opacity:1.0; 
stroke:#000000; stroke-width:39.3701; stroke-opacity:1; 
stroke-linecap:round; stroke-linejoin:round;">
</g>
<g style="fill:#000000; fill-opacity:1.0; 
stroke:#000000; stroke-width:0; stroke-opacity:1; 
stroke-linecap:round; stroke-linejoin:round;">
<circle cx="26709.9" cy="15070" r="354.331" /> 
</g>
<g style="fill:#000000; fill-opacity:1.0; 
stroke:#000000; stroke-width:39.3701; stroke-opacity:1; 
stroke-linecap:round; stroke-linejoin:round;">
</g>
<g >
</g>
<g style="fill:#000000; fill-opacity:1.0; 
stroke:#000000; stroke-width:39.3701; stroke-opacity:1; 
stroke-linecap:round; stroke-linejoin:round;">
</g>
<g style="fill:#000000; fill-opacity:1.0; 
stroke:#000000; stroke-width:0; stroke-opacity:1; 
stroke-linecap:round; stroke-linejoin:round;">
<circle cx="26709.9" cy="18770" r="354.331" /> 
</g>
<g style="fill:#000000; fill-opacity:1.0; 
stroke:#000000; stroke-width:39.3701; stroke-opacity:1; 
stroke-linecap:round; stroke-linejoin:round;">
</g>
<g style="fill:#000000; fill-opacity:1.0; 
stroke:#000000; stroke-width:0; stroke-opacity:1; 
stroke-linecap:round; stroke-linejoin:round;">
<circle cx="24150.8" cy="18770" r="354.331" /> 
</g>
<g style="fill:#000000; fill-opacity:1.0; 
stroke:#000000; stroke-width:39.3701; stroke-opacity:1; 
stroke-linecap:round; stroke-linejoin:round;">
</g>
<g style="fill:#000000; fill-opacity:1.0; 
stroke:#000000; stroke-width:0; stroke-opacity:1; 
stroke-linecap:round; stroke-linejoin:round;">
<circle cx="26709.9" cy="20541.7" r="354.331" /> 
</g>
<g style="fill:#000000; fill-opacity:1.0; 
stroke:#000000; stroke-width:39.3701; stroke-opacity:1; 
stroke-linecap:round; stroke-linejoin:round;">
</g>
<g style="fill:#000000; fill-opacity:1.0; 
stroke:#000000; stroke-width:0; stroke-opacity:1; 
stroke-linecap:round; stroke-linejoin:round;">
<circle cx="24150.8" cy="20541.7" r="354.331" /> 
</g>
<g style="fill:#000000; fill-opacity:1.0; 
stroke:#000000; stroke-width:39.3701; stroke-opacity:1; 
stroke-linecap:round; stroke-linejoin:round;">
</g>
<g >
</g>
<g style="fill:#000000; fill-opacity:1.0; 
stroke:#000000; stroke-width:39.3701; stroke-opacity:1; 
stroke-linecap:round; stroke-linejoin:round;">
</g>
<g style="fill:#000000; fill-opacity:1.0; 
stroke:#000000; stroke-width:0; stroke-opacity:1; 
stroke-linecap:round; stroke-linejoin:round;">
<circle cx="19905.6" cy="22981.3" r="334.646" /> 
<circle cx="23905.6" cy="22981.3" r="334.646" /> 
</g>
<g style="fill:#000000; fill-opacity:1.0; 
stroke:#000000; stroke-width:39.3701; stroke-opacity:1; 
stroke-linecap:round; stroke-linejoin:round;">
</g>
<g >
</g>
<g >
</g>
<g style="fill:#000000; fill-opacity:1.0; 
stroke:#000000; stroke-width:39.3701; stroke-opacity:1; 
stroke-linecap:round; stroke-linejoin:round;">
</g>
<g style="fill:#000000; fill-opacity:1.0; 
stroke:#000000; stroke-width:0; stroke-opacity:1; 
stroke-linecap:round; stroke-linejoin:round;">
<circle cx="27359.9" cy="29745" r="354.331" /> 
<circle cx="27359.9" cy="28745" r="354.331" /> 
<circle cx="27359.9" cy="27745" r="354.331" /> 
<circle cx="27359.9" cy="26745" r="354.331" /> 
<circle cx="27359.9" cy="25745" r="354.331" /> 
<circle cx="27359.9" cy="24745" r="354.331" /> 
<path style="fill:#000000; fill-opacity:1.0; 
stroke:#000000; stroke-width:0; stroke-opacity:1; 
stroke-linecap:round; stroke-linejoin:round;fill-rule:evenodd;"
d="M 27696.5,23390.8
27698.4,23391.1
27700.3,23391.6
27702.1,23392.2
27703.8,23393
27705.5,23394
27707,23395.2
27708.5,23396.5
27709.8,23397.9
27710.9,23399.5
27711.9,23401.1
27712.7,23402.9
27713.4,23404.7
27713.9,23406.6
27714.1,23408.5
27714.2,23410.4
27714.2,24079.7
27714.1,24081.6
27713.9,24083.5
27713.4,24085.4
27712.7,24087.2
27711.9,24089
27710.9,24090.6
27709.8,24092.2
27708.5,24093.6
27707,24094.9
27705.5,24096.1
27703.8,24097
27702.1,24097.9
27700.3,24098.5
27698.4,24099
27696.5,24099.3
27694.5,24099.4
27025.3,24099.4
27023.3,24099.3
27021.4,24099
27019.5,24098.5
27017.7,24097.9
27016,24097
27014.3,24096.1
27012.8,24094.9
27011.3,24093.6
27010,24092.2
27008.9,24090.6
27007.9,24089
27007.1,24087.2
27006.4,24085.4
27005.9,24083.5
27005.7,24081.6
27005.6,24079.7
27005.6,23410.4
27005.7,23408.5
27005.9,23406.6
27006.4,23404.7
27007.1,23402.9
27007.9,23401.1
27008.9,23399.5
27010,23397.9
27011.3,23396.5
27012.8,23395.2
27014.3,23394
27016,23393
27017.7,23392.2
27019.5,23391.6
27021.4,23391.1
27023.3,23390.8
27025.3,23390.7
27694.5,23390.7
Z" /> 
</g>
<g >
</g>
<g >
</g>
<g style="fill:#000000; fill-opacity:1.0; 
stroke:#000000; stroke-width:0; stroke-opacity:1; 
stroke-linecap:round; stroke-linejoin:round;">
<circle cx="16091.4" cy="46670" r="531.496" /> 
</g>
<g style="fill:#000000; fill-opacity:1.0; 
stroke:#000000; stroke-width:39.3701; stroke-opacity:1; 
stroke-linecap:round; stroke-linejoin:round;">
</g>
<g style="fill:#000000; fill-opacity:1.0; 
stroke:#000000; stroke-width:0; stroke-opacity:1; 
stroke-linecap:round; stroke-linejoin:round;">
<path style="fill:#000000; fill-opacity:1.0; 
stroke:#000000; stroke-width:0; stroke-opacity:1; 
stroke-linecap:round; stroke-linejoin:round;fill-rule:evenodd;"
d="M 18573.6,46138.6
18575.6,46138.9
18577.4,46139.4
18579.2,46140
18581,46140.9
18582.6,46141.9
18584.2,46143
18585.6,46144.3
18586.9,46145.7
18588.1,46147.3
18589.1,46148.9
18589.9,46150.7
18590.5,46152.5
18591,46154.4
18591.3,46156.3
18591.4,46158.2
18591.4,47181.9
18591.3,47183.8
18591,47185.7
18590.5,47187.6
18589.9,47189.4
18589.1,47191.1
18588.1,47192.8
18586.9,47194.3
18585.6,47195.8
18584.2,47197.1
18582.6,47198.2
18581,47199.2
18579.2,47200
18577.4,47200.7
18575.6,47201.2
18573.6,47201.4
18571.7,47201.5
17548.1,47201.5
17546.2,47201.4
17544.2,47201.2
17542.4,47200.7
17540.6,47200
17538.8,47199.2
17537.2,47198.2
17535.6,47197.1
17534.2,47195.8
17532.9,47194.3
17531.7,47192.8
17530.7,47191.1
17529.9,47189.4
17529.3,47187.6
17528.8,47185.7
17528.5,47183.8
17528.4,47181.9
17528.4,46158.2
17528.5,46156.3
17528.8,46154.4
17529.3,46152.5
17529.9,46150.7
17530.7,46148.9
17531.7,46147.3
17532.9,46145.7
17534.2,46144.3
17535.6,46143
17537.2,46141.9
17538.8,46140.9
17540.6,46140
17542.4,46139.4
17544.2,46138.9
17546.2,46138.6
17548.1,46138.5
18571.7,46138.5
Z" /> 
</g>
<g >
</g>
<g >
</g>
<g style="fill:#000000; fill-opacity:1.0; 
stroke:#000000; stroke-width:0; stroke-opacity:1; 
stroke-linecap:round; stroke-linejoin:round;">
<path style="fill:#000000; fill-opacity:1.0; 
stroke:#000000; stroke-width:0; stroke-opacity:1; 
stroke-linecap:round; stroke-linejoin:round;fill-rule:evenodd;"
d="M 9246.47,11265.8
9248.39,11266.1
9250.26,11266.6
9252.08,11267.2
9253.82,11268
9255.48,11269
9257.03,11270.2
9258.46,11271.5
9259.76,11272.9
9260.91,11274.5
9261.91,11276.1
9262.73,11277.9
9263.38,11279.7
9263.85,11281.6
9264.13,11283.5
9264.23,11285.4
9264.23,11954.7
9264.13,11956.6
9263.85,11958.5
9263.38,11960.4
9262.73,11962.2
9261.91,11964
9260.91,11965.6
9259.76,11967.2
9258.46,11968.6
9257.03,11969.9
9255.48,11971.1
9253.82,11972
9252.08,11972.9
9250.26,11973.5
9248.39,11974
9246.47,11974.3
9244.54,11974.4
8575.25,11974.4
8573.32,11974.3
8571.41,11974
8569.54,11973.5
8567.72,11972.9
8565.97,11972
8564.32,11971.1
8562.76,11969.9
8561.33,11968.6
8560.04,11967.2
8558.89,11965.6
8557.89,11964
8557.07,11962.2
8556.42,11960.4
8555.95,11958.5
8555.66,11956.6
8555.57,11954.7
8555.57,11285.4
8555.66,11283.5
8555.95,11281.6
8556.42,11279.7
8557.07,11277.9
8557.89,11276.1
8558.89,11274.5
8560.04,11272.9
8561.33,11271.5
8562.76,11270.2
8564.32,11269
8565.97,11268
8567.72,11267.2
8569.54,11266.6
8571.41,11266.1
8573.32,11265.8
8575.25,11265.7
9244.54,11265.7
Z" /> 
</g>
<g >
</g>
<g style="fill:#000000; fill-opacity:1.0; 
stroke:#000000; stroke-width:0; stroke-opacity:1; 
stroke-linecap:round; stroke-linejoin:round;">
<path style="fill:#000000; fill-opacity:1.0; 
stroke:#000000; stroke-width:0; stroke-opacity:1; 
stroke-linecap:round; stroke-linejoin:round;fill-rule:evenodd;"
d="M 20926.5,10955.8
20928.4,10956.1
20930.3,10956.6
20932.1,10957.2
20933.8,10958
20935.5,10959
20937,10960.2
20938.5,10961.5
20939.8,10962.9
20940.9,10964.5
20941.9,10966.1
20942.7,10967.9
20943.4,10969.7
20943.9,10971.6
20944.1,10973.5
20944.2,10975.4
20944.2,11644.7
20944.1,11646.6
20943.9,11648.5
20943.4,11650.4
20942.7,11652.2
20941.9,11654
20940.9,11655.6
20939.8,11657.2
20938.5,11658.6
20937,11659.9
20935.5,11661.1
20933.8,11662
20932.1,11662.9
20930.3,11663.5
20928.4,11664
20926.5,11664.3
20924.5,11664.4
20255.3,11664.4
20253.3,11664.3
20251.4,11664
20249.5,11663.5
20247.7,11662.9
20246,11662
20244.3,11661.1
20242.8,11659.9
20241.3,11658.6
20240,11657.2
20238.9,11655.6
20237.9,11654
20237.1,11652.2
20236.4,11650.4
20235.9,11648.5
20235.7,11646.6
20235.6,11644.7
20235.6,10975.4
20235.7,10973.5
20235.9,10971.6
20236.4,10969.7
20237.1,10967.9
20237.9,10966.1
20238.9,10964.5
20240,10962.9
20241.3,10961.5
20242.8,10960.2
20244.3,10959
20246,10958
20247.7,10957.2
20249.5,10956.6
20251.4,10956.1
20253.3,10955.8
20255.3,10955.7
20924.5,10955.7
Z" /> 
<circle cx="21589.9" cy="11310" r="354.331" /> 
<circle cx="22589.9" cy="11310" r="354.331" /> 
<circle cx="23589.9" cy="11310" r="354.331" /> 
</g>
<g >
</g>
<g style="fill:#000000; fill-opacity:1.0; 
stroke:#000000; stroke-width:0; stroke-opacity:1; 
stroke-linecap:round; stroke-linejoin:round;">
<circle cx="15065.9" cy="33110" r="354.331" /> 
<circle cx="15065.9" cy="32110" r="354.331" /> 
<circle cx="15065.9" cy="31110" r="354.331" /> 
<circle cx="15065.9" cy="30110" r="354.331" /> 
<circle cx="15065.9" cy="29110" r="354.331" /> 
<circle cx="15065.9" cy="28110" r="354.331" /> 
<circle cx="15065.9" cy="27110" r="354.331" /> 
<path style="fill:#000000; fill-opacity:1.0; 
stroke:#000000; stroke-width:0; stroke-opacity:1; 
stroke-linecap:round; stroke-linejoin:round;fill-rule:evenodd;"
d="M 15402.5,25755.8
15404.4,25756.1
15406.3,25756.6
15408.1,25757.2
15409.8,25758
15411.5,25759
15413,25760.2
15414.5,25761.5
15415.8,25762.9
15416.9,25764.5
15417.9,25766.1
15418.7,25767.9
15419.4,25769.7
15419.9,25771.6
15420.1,25773.5
15420.2,25775.4
15420.2,26444.7
15420.1,26446.6
15419.9,26448.5
15419.4,26450.4
15418.7,26452.2
15417.9,26454
15416.9,26455.6
15415.8,26457.2
15414.5,26458.6
15413,26459.9
15411.5,26461.1
15409.8,26462
15408.1,26462.9
15406.3,26463.5
15404.4,26464
15402.5,26464.3
15400.5,26464.4
14731.3,26464.4
14729.3,26464.3
14727.4,26464
14725.5,26463.5
14723.7,26462.9
14722,26462
14720.3,26461.1
14718.8,26459.9
14717.3,26458.6
14716,26457.2
14714.9,26455.6
14713.9,26454
14713.1,26452.2
14712.4,26450.4
14711.9,26448.5
14711.7,26446.6
14711.6,26444.7
14711.6,25775.4
14711.7,25773.5
14711.9,25771.6
14712.4,25769.7
14713.1,25767.9
14713.9,25766.1
14714.9,25764.5
14716,25762.9
14717.3,25761.5
14718.8,25760.2
14720.3,25759
14722,25758
14723.7,25757.2
14725.5,25756.6
14727.4,25756.1
14729.3,25755.8
14731.3,25755.7
15400.5,25755.7
Z" /> 
</g>
<g >
</g>
<g style="fill:#000000; fill-opacity:1.0; 
stroke:#000000; stroke-width:0; stroke-opacity:1; 
stroke-linecap:round; stroke-linejoin:round;">
<circle cx="16029.9" cy="17310" r="354.331" /> 
<circle cx="16029.9" cy="16310" r="354.331" /> 
<circle cx="16029.9" cy="15310" r="354.331" /> 
<circle cx="16029.9" cy="14310" r="354.331" /> 
<circle cx="16029.9" cy="13310" r="354.331" /> 
<circle cx="16029.9" cy="12310" r="354.331" /> 
<path style="fill:#000000; fill-opacity:1.0; 
stroke:#000000; stroke-width:0; stroke-opacity:1; 
stroke-linecap:round; stroke-linejoin:round;fill-rule:evenodd;"
d="M 16366.5,10955.8
16368.4,10956.1
16370.3,10956.6
16372.1,10957.2
16373.8,10958
16375.5,10959
16377,10960.2
16378.5,10961.5
16379.8,10962.9
16380.9,10964.5
16381.9,10966.1
16382.7,10967.9
16383.4,10969.7
16383.9,10971.6
16384.1,10973.5
16384.2,10975.4
16384.2,11644.7
16384.1,11646.6
16383.9,11648.5
16383.4,11650.4
16382.7,11652.2
16381.9,11654
16380.9,11655.6
16379.8,11657.2
16378.5,11658.6
16377,11659.9
16375.5,11661.1
16373.8,11662
16372.1,11662.9
16370.3,11663.5
16368.4,11664
16366.5,11664.3
16364.5,11664.4
15695.3,11664.4
15693.3,11664.3
15691.4,11664
15689.5,11663.5
15687.7,11662.9
15686,11662
15684.3,11661.1
15682.8,11659.9
15681.3,11658.6
15680,11657.2
15678.9,11655.6
15677.9,11654
15677.1,11652.2
15676.4,11650.4
15675.9,11648.5
15675.7,11646.6
15675.6,11644.7
15675.6,10975.4
15675.7,10973.5
15675.9,10971.6
15676.4,10969.7
15677.1,10967.9
15677.9,10966.1
15678.9,10964.5
15680,10962.9
15681.3,10961.5
15682.8,10960.2
15684.3,10959
15686,10958
15687.7,10957.2
15689.5,10956.6
15691.4,10956.1
15693.3,10955.8
15695.3,10955.7
16364.5,10955.7
Z" /> 
</g>
<g >
</g>
<g style="fill:#000000; fill-opacity:1.0; 
stroke:#000000; stroke-width:0; stroke-opacity:1; 
stroke-linecap:round; stroke-linejoin:round;">
<path style="fill:#000000; fill-opacity:1.0; 
stroke:#000000; stroke-width:0; stroke-opacity:1; 
stroke-linecap:round; stroke-linejoin:round;fill-rule:evenodd;"
d="M 12602.2,33052.4
12604.1,33052.7
12605.9,33053.2
12607.8,33053.8
12609.5,33054.6
12611.2,33055.6
12612.7,33056.8
12614.1,33058.1
12615.4,33059.5
12616.6,33061.1
12617.6,33062.7
12618.4,33064.5
12619.1,33066.3
12619.5,33068.2
12619.8,33070.1
12619.9,33072
12619.9,33741.3
12619.8,33743.2
12619.5,33745.1
12619.1,33747
12618.4,33748.8
12617.6,33750.6
12616.6,33752.2
12615.4,33753.8
12614.1,33755.2
12612.7,33756.5
12611.2,33757.7
12609.5,33758.7
12607.8,33759.5
12605.9,33760.1
12604.1,33760.6
12602.2,33760.9
12600.2,33761
11930.9,33761
11929,33760.9
11927.1,33760.6
11925.2,33760.1
11923.4,33759.5
11921.7,33758.7
11920,33757.7
11918.5,33756.5
11917,33755.2
11915.7,33753.8
11914.6,33752.2
11913.6,33750.6
11912.8,33748.8
11912.1,33747
11911.6,33745.1
11911.3,33743.2
11911.3,33741.3
11911.3,33072
11911.3,33070.1
11911.6,33068.2
11912.1,33066.3
11912.8,33064.5
11913.6,33062.7
11914.6,33061.1
11915.7,33059.5
11917,33058.1
11918.5,33056.8
11920,33055.6
11921.7,33054.6
11923.4,33053.8
11925.2,33053.2
11927.1,33052.7
11929,33052.4
11930.9,33052.3
12600.2,33052.3
Z" /> 
<circle cx="11265.6" cy="33406.7" r="354.331" /> 
<circle cx="10265.6" cy="33406.7" r="354.331" /> 
</g>
<g >
</g>
<g style="fill:#000000; fill-opacity:1.0; 
stroke:#000000; stroke-width:0; stroke-opacity:1; 
stroke-linecap:round; stroke-linejoin:round;">
<circle cx="19909.9" cy="26920" r="334.646" /> 
</g>
<g style="fill:#000000; fill-opacity:1.0; 
stroke:#000000; stroke-width:39.3701; stroke-opacity:1; 
stroke-linecap:round; stroke-linejoin:round;">
</g>
<g style="fill:#000000; fill-opacity:1.0; 
stroke:#000000; stroke-width:0; stroke-opacity:1; 
stroke-linecap:round; stroke-linejoin:round;">
<circle cx="23909.9" cy="26920" r="334.646" /> 
</g>
<g >
</g>
<g style="fill:#000000; fill-opacity:1.0; 
stroke:#000000; stroke-width:0; stroke-opacity:1; 
stroke-linecap:round; stroke-linejoin:round;">
<circle cx="25579.9" cy="38730" r="354.331" /> 
<circle cx="25579.9" cy="37730" r="354.331" /> 
<circle cx="25579.9" cy="36730" r="354.331" /> 
<circle cx="25579.9" cy="35730" r="354.331" /> 
<circle cx="25579.9" cy="34730" r="354.331" /> 
<circle cx="25579.9" cy="33730" r="354.331" /> 
<circle cx="25579.9" cy="32730" r="354.331" /> 
<circle cx="25579.9" cy="31730" r="354.331" /> 
<circle cx="25579.9" cy="30730" r="354.331" /> 
<circle cx="25579.9" cy="29730" r="354.331" /> 
<circle cx="25579.9" cy="28730" r="354.331" /> 
<circle cx="25579.9" cy="27730" r="354.331" /> 
<circle cx="25579.9" cy="26730" r="354.331" /> 
<circle cx="25579.9" cy="25730" r="354.331" /> 
<circle cx="25579.9" cy="24730" r="354.331" /> 
<path style="fill:#000000; fill-opacity:1.0; 
stroke:#000000; stroke-width:0; stroke-opacity:1; 
stroke-linecap:round; stroke-linejoin:round;fill-rule:evenodd;"
d="M 25916.5,23375.8
25918.4,23376.1
25920.3,23376.6
25922.1,23377.2
25923.8,23378
25925.5,23379
25927,23380.2
25928.5,23381.5
25929.8,23382.9
25930.9,23384.5
25931.9,23386.1
25932.7,23387.9
25933.4,23389.7
25933.9,23391.6
25934.1,23393.5
25934.2,23395.4
25934.2,24064.7
25934.1,24066.6
25933.9,24068.5
25933.4,24070.4
25932.7,24072.2
25931.9,24074
25930.9,24075.6
25929.8,24077.2
25928.5,24078.6
25927,24079.9
25925.5,24081.1
25923.8,24082
25922.1,24082.9
25920.3,24083.5
25918.4,24084
25916.5,24084.3
25914.5,24084.4
25245.3,24084.4
25243.3,24084.3
25241.4,24084
25239.5,24083.5
25237.7,24082.9
25236,24082
25234.3,24081.1
25232.8,24079.9
25231.3,24078.6
25230,24077.2
25228.9,24075.6
25227.9,24074
25227.1,24072.2
25226.4,24070.4
25225.9,24068.5
25225.7,24066.6
25225.6,24064.7
25225.6,23395.4
25225.7,23393.5
25225.9,23391.6
25226.4,23389.7
25227.1,23387.9
25227.9,23386.1
25228.9,23384.5
25230,23382.9
25231.3,23381.5
25232.8,23380.2
25234.3,23379
25236,23378
25237.7,23377.2
25239.5,23376.6
25241.4,23376.1
25243.3,23375.8
25245.3,23375.7
25914.5,23375.7
Z" /> 
</g>
<g >
</g>
<g style="fill:#000000; fill-opacity:1.0; 
stroke:#000000; stroke-width:0; stroke-opacity:1; 
stroke-linecap:round; stroke-linejoin:round;">
<path style="fill:#000000; fill-opacity:1.0; 
stroke:#000000; stroke-width:0; stroke-opacity:1; 
stroke-linecap:round; stroke-linejoin:round;fill-rule:evenodd;"
d="M 17892.5,34382.2
17894.4,34382.5
17896.2,34382.9
17898.1,34383.6
17899.8,34384.4
17901.5,34385.4
17903,34386.6
17904.4,34387.9
17905.7,34389.3
17906.9,34390.8
17907.9,34392.5
17908.7,34394.2
17909.4,34396.1
17909.8,34397.9
17910.1,34399.8
17910.2,34401.8
17910.2,35071.1
17910.1,35073
17909.8,35074.9
17909.4,35076.8
17908.7,35078.6
17907.9,35080.3
17906.9,35082
17905.7,35083.6
17904.4,35085
17903,35086.3
17901.5,35087.4
17899.8,35088.4
17898.1,35089.2
17896.2,35089.9
17894.4,35090.4
17892.5,35090.7
17890.5,35090.7
17221.2,35090.7
17219.3,35090.7
17217.4,35090.4
17215.5,35089.9
17213.7,35089.2
17212,35088.4
17210.3,35087.4
17208.7,35086.3
17207.3,35085
17206,35083.6
17204.9,35082
17203.9,35080.3
17203.1,35078.6
17202.4,35076.8
17201.9,35074.9
17201.6,35073
17201.6,35071.1
17201.6,34401.8
17201.6,34399.8
17201.9,34397.9
17202.4,34396.1
17203.1,34394.2
17203.9,34392.5
17204.9,34390.8
17206,34389.3
17207.3,34387.9
17208.7,34386.6
17210.3,34385.4
17212,34384.4
17213.7,34383.6
17215.5,34382.9
17217.4,34382.5
17219.3,34382.2
17221.2,34382.1
17890.5,34382.1
Z" /> 
<circle cx="17555.9" cy="33736.4" r="354.331" /> 
<circle cx="17555.9" cy="32736.4" r="354.331" /> 
<circle cx="17555.9" cy="31736.4" r="354.331" /> 
<circle cx="17555.9" cy="30736.4" r="354.331" /> 
<circle cx="17555.9" cy="29736.4" r="354.331" /> 
<circle cx="17555.9" cy="28736.4" r="354.331" /> 
<circle cx="17555.9" cy="27736.4" r="354.331" /> 
<circle cx="17555.9" cy="26736.4" r="354.331" /> 
<circle cx="17555.9" cy="25736.4" r="354.331" /> 
<circle cx="17555.9" cy="24736.4" r="354.331" /> 
<circle cx="17555.9" cy="23736.4" r="354.331" /> 
</g>
<g >
</g>
<g >
</g>
<g style="fill:#000000; fill-opacity:1.0; 
stroke:#000000; stroke-width:0; stroke-opacity:1; 
stroke-linecap:round; stroke-linejoin:round;">
<circle cx="19908.8" cy="24211.6" r="334.646" /> 
<circle cx="23908.8" cy="24211.6" r="334.646" /> 
</g>
<g style="fill:#000000; fill-opacity:1.0; 
stroke:#000000; stroke-width:39.3701; stroke-opacity:1; 
stroke-linecap:round; stroke-linejoin:round;">
</g>
<g >
</g>
<g >
</g>
<g >
</g>
</g>
<g style="fill:#000000; fill-opacity:1.0; 
stroke:#000000; stroke-width:39.3701; stroke-opacity:1; 
stroke-linecap:round; stroke-linejoin:round;">
</g>
<g style="fill:#000000; fill-opacity:0.0; 
stroke:#000000; stroke-width:19.685; stroke-opacity:1; 
stroke-linecap:round; stroke-linejoin:round;">
<path d="M23853.2 49070.4 A747.654 747.654 0.0 0 0 24605.9 49818" />
<path d="M22327 42815
L20845 42815
" />
<path d="M24605 49818
L27359 49817
" />
<path d="M23852 44337
L23853 49070
" />
<path d="M23853 44337.7 A1525 1525 0.0 0 0 22328 42815.3" />
<path d="M18567.2 49817.7 A747.654 747.654 0.0 0 0 19319.9 49070" />
<path d="M20845.9 42815.7 A1527.36 1527.36 0.0 0 0 19318.5 44343" />
<path d="M19318 44343
L19319 49070
" />
<path d="M25434.9 5360.09 A3840.05 3840.05 0.0 0 0 21594.8 1520.04" />
<path d="M25434.9 5360.09 A534.282 534.282 0.0 0 0 25935.7 5920.08" />
<path d="M9759.13 5920.08 A534.282 534.282 0.0 0 0 10259.9 5360.09" />
<path d="M14100 1520.04 A3840.05 3840.05 0.0 0 0 10259.9 5360.09" />
<path d="M21591 5222
L14092 5222
" />
<path d="M21591.9 5222.25 A1321.1 1321.1 0.0 0 0 22913 3901.14" />
<path d="M21591 2580
L14092 2580
" />
<path d="M12770.9 3901.14 A1321.1 1321.1 0.0 0 0 14092 5222.25" />
<path d="M22913 3901.14 A1321.1 1321.1 0.0 0 0 21591.9 2580.04" />
<path d="M14092 2580.04 A1321.1 1321.1 0.0 0 0 12770.9 3901.14" />
<path d="M27359.9 49817.7 A2700 2700 0.0 0 0 30059.6 47160" />
<path d="M8359 5920
L9759 5920
" />
<path d="M21594 1520
L14099 1520
" />
<path d="M5659.9 47120 A2700 2700 0.0 0 0 8245.9 49817.6" />
<path d="M30059.9 8620.04 A2700 2700 0.0 0 0 27359.9 5920.04" />
<path d="M8359.9 5920.04 A2700 2700 0.0 0 0 5659.9 8620.04" />
<path d="M27359 5920
L25935 5920
" />
<path d="M30059 47160
L30059 8620
" />
<path d="M8245 49817
L18567 49817
" />
<path d="M5659 8620
L5659 47120
" />
<g >
</g>
<g >
</g>
<g >
</g>
<g >
</g>
<g >
</g>
<g >
</g>
<g >
</g>
<g >
</g>
<g >
</g>
<g >
</g>
<g >
</g>
<g >
</g>
<g >
</g>
<g >
</g>
<g >
</g>
<g >
</g>
<g >
</g>
<g >
</g>
<g >
</g>
<g >
</g>
<g >
</g>
<g >
</g>
<g >
</g>
<g >
</g>
<g >
</g>
<g >
</g>
<g >
</g>
<g >
</g>
<g >
</g>
<g >
</g>
<g >
</g>
<g >
</g>
<g >
</g>
</g> 
</svg>
