EESchema Schematic File Version 4
EELAYER 30 0
EELAYER END
$Descr A4 11693 8268
encoding utf-8
Sheet 1 1
Title ""
Date ""
Rev ""
Comp ""
Comment1 ""
Comment2 ""
Comment3 ""
Comment4 ""
$EndDescr
$Comp
L Device:R R1
U 1 1 5F989DB1
P 775 6275
F 0 "R1" H 845 6321 50  0000 L CNN
F 1 "R" H 845 6230 50  0000 L CNN
F 2 "Resistor_THT:R_Axial_DIN0207_L6.3mm_D2.5mm_P10.16mm_Horizontal" V 705 6275 50  0001 C CNN
F 3 "~" H 775 6275 50  0001 C CNN
	1    775  6275
	1    0    0    -1  
$EndComp
Text GLabel 1150 6450 0    50   Input ~ 0
SCL
$Comp
L power:+3V3 #PWR01
U 1 1 5F98B87C
P 775 6125
F 0 "#PWR01" H 775 5975 50  0001 C CNN
F 1 "+3V3" H 790 6298 50  0000 C CNN
F 2 "" H 775 6125 50  0001 C CNN
F 3 "" H 775 6125 50  0001 C CNN
	1    775  6125
	1    0    0    -1  
$EndComp
$Comp
L Device:R R2
U 1 1 5F98BC9A
P 1150 6300
F 0 "R2" H 1220 6346 50  0000 L CNN
F 1 "R" H 1220 6255 50  0000 L CNN
F 2 "Resistor_THT:R_Axial_DIN0207_L6.3mm_D2.5mm_P10.16mm_Horizontal" V 1080 6300 50  0001 C CNN
F 3 "~" H 1150 6300 50  0001 C CNN
	1    1150 6300
	1    0    0    -1  
$EndComp
$Comp
L power:+3V3 #PWR04
U 1 1 5F98C06B
P 1150 6150
F 0 "#PWR04" H 1150 6000 50  0001 C CNN
F 1 "+3V3" H 1165 6323 50  0000 C CNN
F 2 "" H 1150 6150 50  0001 C CNN
F 3 "" H 1150 6150 50  0001 C CNN
	1    1150 6150
	1    0    0    -1  
$EndComp
Text GLabel 775  6425 0    50   Input ~ 0
SDA
$Comp
L power:+3V3 #PWR015
U 1 1 5F996AAC
P 7325 1775
F 0 "#PWR015" H 7325 1625 50  0001 C CNN
F 1 "+3V3" V 7340 1903 50  0000 L CNN
F 2 "" H 7325 1775 50  0001 C CNN
F 3 "" H 7325 1775 50  0001 C CNN
	1    7325 1775
	-1   0    0    1   
$EndComp
$Comp
L power:GND #PWR016
U 1 1 5F997480
P 7525 2175
F 0 "#PWR016" H 7525 1925 50  0001 C CNN
F 1 "GND" H 7530 2002 50  0000 C CNN
F 2 "" H 7525 2175 50  0001 C CNN
F 3 "" H 7525 2175 50  0001 C CNN
	1    7525 2175
	0    -1   -1   0   
$EndComp
Text GLabel 7625 1775 3    50   Input ~ 0
SCL
Text GLabel 7825 1775 3    50   Input ~ 0
SDA
Wire Wire Line
	7525 2175 7525 1775
$Comp
L Mechanical:MountingHole H2
U 1 1 5F9CF5FF
P 6600 2875
F 0 "H2" H 6700 2921 50  0000 L CNN
F 1 "MountingHole" H 6700 2830 50  0000 L CNN
F 2 "MountingHole:MountingHole_3.5mm" H 6600 2875 50  0001 C CNN
F 3 "~" H 6600 2875 50  0001 C CNN
	1    6600 2875
	1    0    0    -1  
$EndComp
$Comp
L Mechanical:MountingHole H3
U 1 1 5F9CFBAC
P 6600 3100
F 0 "H3" H 6700 3146 50  0000 L CNN
F 1 "MountingHole" H 6700 3055 50  0000 L CNN
F 2 "MountingHole:MountingHole_3.5mm" H 6600 3100 50  0001 C CNN
F 3 "~" H 6600 3100 50  0001 C CNN
	1    6600 3100
	1    0    0    -1  
$EndComp
$Comp
L Mechanical:MountingHole H4
U 1 1 5F9D006D
P 6600 3325
F 0 "H4" H 6700 3371 50  0000 L CNN
F 1 "MountingHole" H 6700 3280 50  0000 L CNN
F 2 "MountingHole:MountingHole_3.5mm" H 6600 3325 50  0001 C CNN
F 3 "~" H 6600 3325 50  0001 C CNN
	1    6600 3325
	1    0    0    -1  
$EndComp
$Comp
L Connector:Conn_01x08_Female J8
U 1 1 5FADE7E5
P 7625 1575
F 0 "J8" V 7790 1505 50  0000 C CNN
F 1 "BME390" V 7699 1505 50  0000 C CNN
F 2 "Connector_PinSocket_2.54mm:PinSocket_1x08_P2.54mm_Vertical" H 7625 1575 50  0001 C CNN
F 3 "~" H 7625 1575 50  0001 C CNN
	1    7625 1575
	0    -1   -1   0   
$EndComp
$Comp
L Connector:Conn_01x07_Female J6
U 1 1 5FB57B67
P 6475 1675
F 0 "J6" H 6503 1701 50  0000 L CNN
F 1 "SCD30" H 6503 1610 50  0000 L CNN
F 2 "Connector_PinSocket_2.54mm:PinSocket_1x07_P2.54mm_Vertical" H 6475 1675 50  0001 C CNN
F 3 "~" H 6475 1675 50  0001 C CNN
	1    6475 1675
	1    0    0    -1  
$EndComp
$Comp
L power:+3V3 #PWR012
U 1 1 5FBA156B
P 6275 1375
F 0 "#PWR012" H 6275 1225 50  0001 C CNN
F 1 "+3V3" H 6290 1548 50  0000 C CNN
F 2 "" H 6275 1375 50  0001 C CNN
F 3 "" H 6275 1375 50  0001 C CNN
	1    6275 1375
	1    0    0    -1  
$EndComp
$Comp
L power:GND #PWR011
U 1 1 5FBA258D
P 5925 1475
F 0 "#PWR011" H 5925 1225 50  0001 C CNN
F 1 "GND" H 5930 1302 50  0000 C CNN
F 2 "" H 5925 1475 50  0001 C CNN
F 3 "" H 5925 1475 50  0001 C CNN
	1    5925 1475
	1    0    0    -1  
$EndComp
Wire Wire Line
	6275 1475 5925 1475
Text GLabel 6275 1575 0    50   Input ~ 0
SCL
Text GLabel 6275 1675 0    50   Input ~ 0
SDA
Text Notes 1175 5650 0    79   ~ 0
i2c pullups
Text Notes 6100 1100 0    79   ~ 0
SCD30
Text Notes 7450 1250 0    79   ~ 0
BME388/90
$Comp
L Mechanical:MountingHole H1
U 1 1 5FDF5FDF
P 6600 2650
F 0 "H1" H 6700 2696 50  0000 L CNN
F 1 "MountingHole" H 6700 2605 50  0000 L CNN
F 2 "MountingHole:MountingHole_3.5mm" H 6600 2650 50  0001 C CNN
F 3 "~" H 6600 2650 50  0001 C CNN
	1    6600 2650
	1    0    0    -1  
$EndComp
$Comp
L Connector:Conn_01x04_Female J12
U 1 1 60000D99
P 8425 4525
F 0 "J12" H 8453 4501 50  0000 L CNN
F 1 "ssd1306" H 8453 4410 50  0000 L CNN
F 2 "Connector_PinSocket_2.54mm:PinSocket_1x04_P2.54mm_Vertical" H 8425 4525 50  0001 C CNN
F 3 "~" H 8425 4525 50  0001 C CNN
	1    8425 4525
	1    0    0    -1  
$EndComp
Text GLabel 8225 4725 0    50   Input ~ 0
16
Text GLabel 8225 4625 0    50   Input ~ 0
17
$Comp
L power:GND #PWR023
U 1 1 60000DA1
P 7850 4425
F 0 "#PWR023" H 7850 4175 50  0001 C CNN
F 1 "GND" H 7855 4252 50  0000 C CNN
F 2 "" H 7850 4425 50  0001 C CNN
F 3 "" H 7850 4425 50  0001 C CNN
	1    7850 4425
	1    0    0    -1  
$EndComp
$Comp
L power:+3V3 #PWR024
U 1 1 60000DA7
P 8100 4350
F 0 "#PWR024" H 8100 4200 50  0001 C CNN
F 1 "+3V3" V 8115 4478 50  0000 L CNN
F 2 "" H 8100 4350 50  0001 C CNN
F 3 "" H 8100 4350 50  0001 C CNN
	1    8100 4350
	1    0    0    -1  
$EndComp
Wire Wire Line
	8225 4525 8100 4525
Wire Wire Line
	8100 4525 8100 4350
Wire Wire Line
	8225 4425 7850 4425
$Comp
L Connector:Conn_01x12_Female J2
U 1 1 6018A4D9
P 2000 2300
F 0 "J2" H 2028 2276 50  0000 L CNN
F 1 "Conn_01x12_Female" V 2150 2000 50  0000 L CNN
F 2 "Connector_PinSocket_2.54mm:PinSocket_1x12_P2.54mm_Vertical" H 2000 2300 50  0001 C CNN
F 3 "~" H 2000 2300 50  0001 C CNN
	1    2000 2300
	1    0    0    -1  
$EndComp
$Comp
L Connector:Conn_01x16_Female J3
U 1 1 6018BB4F
P 3050 2600
F 0 "J3" H 2942 1575 50  0000 C CNN
F 1 "Conn_01x16_Female" V 3150 2500 50  0000 C CNN
F 2 "Connector_PinSocket_2.54mm:PinSocket_1x16_P2.54mm_Vertical" H 3050 2600 50  0001 C CNN
F 3 "~" H 3050 2600 50  0001 C CNN
	1    3050 2600
	1    0    0    1   
$EndComp
Text GLabel 1800 1800 0    50   Input ~ 0
VBAT
Text GLabel 1800 2000 0    50   Input ~ 0
VBUS
$Comp
L power:+3V3 #PWR05
U 1 1 601B9ECE
P 2850 1900
F 0 "#PWR05" H 2850 1750 50  0001 C CNN
F 1 "+3V3" H 2865 2073 50  0000 C CNN
F 2 "" H 2850 1900 50  0001 C CNN
F 3 "" H 2850 1900 50  0001 C CNN
	1    2850 1900
	0    -1   -1   0   
$EndComp
$Comp
L power:GND #PWR06
U 1 1 601BDD3D
P 2850 2100
F 0 "#PWR06" H 2850 1850 50  0001 C CNN
F 1 "GND" H 2855 1927 50  0000 C CNN
F 2 "" H 2850 2100 50  0001 C CNN
F 3 "" H 2850 2100 50  0001 C CNN
	1    2850 2100
	0    1    1    0   
$EndComp
Text GLabel 1800 2400 0    50   Input ~ 0
33
Text GLabel 2850 2800 0    50   Input ~ 0
SCK
Text GLabel 2850 2900 0    50   Input ~ 0
MOSI
Text GLabel 2850 3000 0    50   Input ~ 0
MISO
Text Notes 7800 4000 0    79   ~ 0
SSD1306
Text GLabel 1800 2800 0    50   Input ~ 0
SCL
Text GLabel 1800 2900 0    50   Input ~ 0
SDA
Text Notes 1950 1450 0    79   ~ 0
Feather ESP32
$Comp
L mysensors_radios:RFM95HW U1
U 1 1 60241FD3
P 9750 1550
F 0 "U1" H 9750 2350 40  0000 C CNN
F 1 "RFM95HW" H 9750 2450 40  0000 C CNN
F 2 "footprints:RFM95" H 9750 1550 30  0001 C CIN
F 3 "https://cdn-learn.adafruit.com/assets/assets/000/031/659/original/RFM95_96_97_98W.pdf?1460518717" V 10650 50  60  0000 C CNN
	1    9750 1550
	1    0    0    -1  
$EndComp
$Comp
L Connector:Conn_01x03_Female J4
U 1 1 602768B9
P 3500 6350
F 0 "J4" H 3528 6376 50  0000 L CNN
F 1 "M4466" H 3528 6285 50  0000 L CNN
F 2 "Connector_PinSocket_2.54mm:PinSocket_1x03_P2.54mm_Vertical" H 3500 6350 50  0001 C CNN
F 3 "~" H 3500 6350 50  0001 C CNN
	1    3500 6350
	1    0    0    -1  
$EndComp
Text Notes 3150 6050 0    79   ~ 0
MAX4466\n
$Comp
L Switch:SW_Push_Dual SW1
U 1 1 6028B8CB
P 5150 4850
F 0 "SW1" H 5150 5135 50  0000 C CNN
F 1 "SW_Push_Dual" H 5150 5044 50  0000 C CNN
F 2 "Button_Switch_THT:SW_TH_Tactile_Omron_B3F-10xx" H 5150 5050 50  0001 C CNN
F 3 "~" H 5150 5050 50  0001 C CNN
	1    5150 4850
	1    0    0    -1  
$EndComp
Wire Wire Line
	5350 4850 5350 4650
Wire Wire Line
	5350 4650 4950 4650
Wire Wire Line
	4950 4650 4950 4850
Wire Wire Line
	5350 5050 5350 4900
Wire Wire Line
	5350 4900 4950 4900
Wire Wire Line
	4950 4900 4950 5050
$Comp
L power:GND #PWR010
U 1 1 6028DB07
P 5350 5050
F 0 "#PWR010" H 5350 4800 50  0001 C CNN
F 1 "GND" H 5355 4877 50  0000 C CNN
F 2 "" H 5350 5050 50  0001 C CNN
F 3 "" H 5350 5050 50  0001 C CNN
	1    5350 5050
	1    0    0    -1  
$EndComp
Connection ~ 5350 5050
$Comp
L Device:R R6
U 1 1 6028DEF2
P 4700 4700
F 0 "R6" H 4770 4746 50  0000 L CNN
F 1 "4.7K" H 4770 4655 50  0000 L CNN
F 2 "Resistor_THT:R_Axial_DIN0207_L6.3mm_D2.5mm_P10.16mm_Horizontal" V 4630 4700 50  0001 C CNN
F 3 "~" H 4700 4700 50  0001 C CNN
	1    4700 4700
	1    0    0    -1  
$EndComp
$Comp
L power:+3V3 #PWR09
U 1 1 6028E7B5
P 4700 4550
F 0 "#PWR09" H 4700 4400 50  0001 C CNN
F 1 "+3V3" H 4715 4723 50  0000 C CNN
F 2 "" H 4700 4550 50  0001 C CNN
F 3 "" H 4700 4550 50  0001 C CNN
	1    4700 4550
	1    0    0    -1  
$EndComp
Wire Wire Line
	4950 4850 4700 4850
Connection ~ 4950 4850
Text Notes 4800 4300 0    79   ~ 0
BUTTON A
$Comp
L Connector:Conn_01x01_Female J11
U 1 1 602C1B7A
P 8800 1400
F 0 "J11" H 8692 1175 50  0000 C CNN
F 1 "Conn_01x01_Female" V 8900 1550 50  0000 C CNN
F 2 "Connector_PinSocket_2.54mm:PinSocket_1x01_P2.54mm_Vertical" H 8800 1400 50  0001 C CNN
F 3 "~" H 8800 1400 50  0001 C CNN
	1    8800 1400
	-1   0    0    1   
$EndComp
Wire Wire Line
	9200 1400 9150 1400
Text Notes 4200 1350 0    79   ~ 0
Breakouts
$Comp
L Switch:SW_Push_Dual SW2
U 1 1 6025455B
P 6600 5000
F 0 "SW2" H 6600 5285 50  0000 C CNN
F 1 "SW_Push_Dual" H 6600 5194 50  0000 C CNN
F 2 "Button_Switch_THT:SW_TH_Tactile_Omron_B3F-10xx" H 6600 5200 50  0001 C CNN
F 3 "~" H 6600 5200 50  0001 C CNN
	1    6600 5000
	1    0    0    -1  
$EndComp
Wire Wire Line
	6800 5000 6800 4800
Wire Wire Line
	6800 4800 6400 4800
Wire Wire Line
	6400 4800 6400 5000
Wire Wire Line
	6800 5200 6800 5050
Wire Wire Line
	6800 5050 6400 5050
Wire Wire Line
	6400 5050 6400 5200
$Comp
L power:GND #PWR0101
U 1 1 602547D7
P 6800 5200
F 0 "#PWR0101" H 6800 4950 50  0001 C CNN
F 1 "GND" H 6805 5027 50  0000 C CNN
F 2 "" H 6800 5200 50  0001 C CNN
F 3 "" H 6800 5200 50  0001 C CNN
	1    6800 5200
	1    0    0    -1  
$EndComp
Connection ~ 6800 5200
$Comp
L power:+3V3 #PWR0102
U 1 1 602547EC
P 6150 4700
F 0 "#PWR0102" H 6150 4550 50  0001 C CNN
F 1 "+3V3" H 6165 4873 50  0000 C CNN
F 2 "" H 6150 4700 50  0001 C CNN
F 3 "" H 6150 4700 50  0001 C CNN
	1    6150 4700
	1    0    0    -1  
$EndComp
Wire Wire Line
	6400 5000 6150 5000
Connection ~ 6400 5000
Text Notes 6250 4450 0    79   ~ 0
BUTTON B
$Comp
L Connector:Micro_SD_Card J10
U 1 1 602BBEEF
P 2000 4450
F 0 "J10" H 1950 5167 50  0000 C CNN
F 1 "Micro_SD_Card" H 1950 5076 50  0000 C CNN
F 2 "footprints:DM3D-SF" H 3150 4750 50  0001 C CNN
F 3 "http://katalog.we-online.de/em/datasheet/693072010801.pdf" H 2000 4450 50  0001 C CNN
	1    2000 4450
	1    0    0    -1  
$EndComp
Text GLabel 1100 4550 0    50   Input ~ 0
SCK
Text GLabel 1100 4750 0    50   Input ~ 0
MISO
Text GLabel 1100 4350 0    50   Input ~ 0
MOSI
Text GLabel 1100 4250 0    50   Input ~ 0
33
$Comp
L power:+3V3 #PWR0103
U 1 1 602C0454
P 600 4250
F 0 "#PWR0103" H 600 4100 50  0001 C CNN
F 1 "+3V3" H 615 4423 50  0000 C CNN
F 2 "" H 600 4250 50  0001 C CNN
F 3 "" H 600 4250 50  0001 C CNN
	1    600  4250
	1    0    0    -1  
$EndComp
$Comp
L power:GND #PWR0104
U 1 1 602C0FF4
P 700 4650
F 0 "#PWR0104" H 700 4400 50  0001 C CNN
F 1 "GND" H 705 4477 50  0000 C CNN
F 2 "" H 700 4650 50  0001 C CNN
F 3 "" H 700 4650 50  0001 C CNN
	1    700  4650
	1    0    0    -1  
$EndComp
Wire Wire Line
	1100 4650 700  4650
Wire Wire Line
	1100 4450 600  4450
Wire Wire Line
	600  4450 600  4250
$Comp
L power:GND #PWR0105
U 1 1 602C9A4C
P 2800 5050
F 0 "#PWR0105" H 2800 4800 50  0001 C CNN
F 1 "GND" H 2805 4877 50  0000 C CNN
F 2 "" H 2800 5050 50  0001 C CNN
F 3 "" H 2800 5050 50  0001 C CNN
	1    2800 5050
	1    0    0    -1  
$EndComp
Text GLabel 1800 2700 0    50   Input ~ 0
14
Text GLabel 1800 2600 0    50   Input ~ 0
32
Text GLabel 1800 2500 0    50   Input ~ 0
15
Text GLabel 1800 2300 0    50   Input ~ 0
27
Text GLabel 1800 2200 0    50   Input ~ 0
12
Text GLabel 1800 2100 0    50   Input ~ 0
13
Text GLabel 2850 3300 0    50   Input ~ 0
21
Text GLabel 2850 3200 0    50   Input ~ 0
17
Text GLabel 2850 3100 0    50   Input ~ 0
16
Text GLabel 2850 2700 0    50   Input ~ 0
4
Text GLabel 2850 2600 0    50   Input ~ 0
36
Text GLabel 2850 2500 0    50   Input ~ 0
39
Text GLabel 2850 2400 0    50   Input ~ 0
34
Text GLabel 2850 2300 0    50   Input ~ 0
25
Text GLabel 2850 2200 0    50   Input ~ 0
26
Text GLabel 9200 1900 0    50   Input ~ 0
26
Text GLabel 9200 1600 0    50   Input ~ 0
14
Text GLabel 9200 1700 0    50   Input ~ 0
21
Text GLabel 9200 1800 0    50   Input ~ 0
25
Text GLabel 9200 2100 0    50   Input ~ 0
27
Text GLabel 10300 1550 2    50   Input ~ 0
15
$Comp
L power:+3V3 #PWR0106
U 1 1 60304BD3
P 9750 1200
F 0 "#PWR0106" H 9750 1050 50  0001 C CNN
F 1 "+3V3" V 9765 1328 50  0000 L CNN
F 2 "" H 9750 1200 50  0001 C CNN
F 3 "" H 9750 1200 50  0001 C CNN
	1    9750 1200
	1    0    0    -1  
$EndComp
$Comp
L power:GND #PWR0107
U 1 1 603057F4
P 9750 2550
F 0 "#PWR0107" H 9750 2300 50  0001 C CNN
F 1 "GND" H 9755 2377 50  0000 C CNN
F 2 "" H 9750 2550 50  0001 C CNN
F 3 "" H 9750 2550 50  0001 C CNN
	1    9750 2550
	1    0    0    -1  
$EndComp
Wire Wire Line
	9650 2400 9750 2400
Wire Wire Line
	9750 2400 9850 2400
Connection ~ 9750 2400
Wire Wire Line
	9750 2400 9750 2550
$Comp
L Device:R R3
U 1 1 6036A899
P 1650 6325
F 0 "R3" H 1720 6371 50  0000 L CNN
F 1 "R" H 1720 6280 50  0000 L CNN
F 2 "Resistor_THT:R_Axial_DIN0207_L6.3mm_D2.5mm_P10.16mm_Horizontal" V 1580 6325 50  0001 C CNN
F 3 "~" H 1650 6325 50  0001 C CNN
	1    1650 6325
	1    0    0    -1  
$EndComp
Text GLabel 2025 6500 0    50   Input ~ 0
16
$Comp
L power:+3V3 #PWR0108
U 1 1 6036AA12
P 1650 6175
F 0 "#PWR0108" H 1650 6025 50  0001 C CNN
F 1 "+3V3" H 1665 6348 50  0000 C CNN
F 2 "" H 1650 6175 50  0001 C CNN
F 3 "" H 1650 6175 50  0001 C CNN
	1    1650 6175
	1    0    0    -1  
$EndComp
$Comp
L Device:R R4
U 1 1 6036AA1C
P 2025 6350
F 0 "R4" H 2095 6396 50  0000 L CNN
F 1 "R" H 2095 6305 50  0000 L CNN
F 2 "Resistor_THT:R_Axial_DIN0207_L6.3mm_D2.5mm_P10.16mm_Horizontal" V 1955 6350 50  0001 C CNN
F 3 "~" H 2025 6350 50  0001 C CNN
	1    2025 6350
	1    0    0    -1  
$EndComp
$Comp
L power:+3V3 #PWR0109
U 1 1 6036AA26
P 2025 6200
F 0 "#PWR0109" H 2025 6050 50  0001 C CNN
F 1 "+3V3" H 2040 6373 50  0000 C CNN
F 2 "" H 2025 6200 50  0001 C CNN
F 3 "" H 2025 6200 50  0001 C CNN
	1    2025 6200
	1    0    0    -1  
$EndComp
Text GLabel 1650 6475 0    50   Input ~ 0
17
$Comp
L power:+3V3 #PWR0110
U 1 1 60399BD0
P 3300 6250
F 0 "#PWR0110" H 3300 6100 50  0001 C CNN
F 1 "+3V3" H 3315 6423 50  0000 C CNN
F 2 "" H 3300 6250 50  0001 C CNN
F 3 "" H 3300 6250 50  0001 C CNN
	1    3300 6250
	1    0    0    -1  
$EndComp
$Comp
L power:GND #PWR0111
U 1 1 6039A1FD
P 3050 6350
F 0 "#PWR0111" H 3050 6100 50  0001 C CNN
F 1 "GND" H 3055 6177 50  0000 C CNN
F 2 "" H 3050 6350 50  0001 C CNN
F 3 "" H 3050 6350 50  0001 C CNN
	1    3050 6350
	1    0    0    -1  
$EndComp
Wire Wire Line
	3300 6350 3050 6350
Text GLabel 4200 4850 0    50   Input ~ 0
34
Text GLabel 5875 5000 0    50   Input ~ 0
36
Text GLabel 3300 6450 0    50   Input ~ 0
39
$Comp
L Connector:Screw_Terminal_01x02 J1
U 1 1 601B2C07
P 1925 850
F 0 "J1" H 2005 842 50  0000 L CNN
F 1 "Screw_Terminal_01x02" H 2005 751 50  0000 L CNN
F 2 "TerminalBlock_Phoenix:TerminalBlock_Phoenix_PT-1,5-2-5.0-H_1x02_P5.00mm_Horizontal" H 1925 850 50  0001 C CNN
F 3 "~" H 1925 850 50  0001 C CNN
	1    1925 850 
	1    0    0    -1  
$EndComp
Text GLabel 1725 950  0    50   Input ~ 0
VBUS
$Comp
L power:GND #PWR0112
U 1 1 601B48F9
P 1725 850
F 0 "#PWR0112" H 1725 600 50  0001 C CNN
F 1 "GND" H 1730 677 50  0000 C CNN
F 2 "" H 1725 850 50  0001 C CNN
F 3 "" H 1725 850 50  0001 C CNN
	1    1725 850 
	0    1    1    0   
$EndComp
Text Notes 1950 725  0    79   ~ 0
ALT-POWER
Text GLabel 4550 1700 0    50   Input ~ 0
4
Text GLabel 4550 1800 0    50   Input ~ 0
39
Text GLabel 4550 1600 0    50   Input ~ 0
SCL
Text GLabel 4550 1900 0    50   Input ~ 0
VBUS
Text GLabel 10300 1650 2    50   Input ~ 0
32
Text GLabel 4550 1500 0    50   Input ~ 0
SDA
$Comp
L power:+3V3 #PWR0113
U 1 1 601BD700
P 4150 2000
F 0 "#PWR0113" H 4150 1850 50  0001 C CNN
F 1 "+3V3" H 4165 2173 50  0000 C CNN
F 2 "" H 4150 2000 50  0001 C CNN
F 3 "" H 4150 2000 50  0001 C CNN
	1    4150 2000
	1    0    0    -1  
$EndComp
$Comp
L power:GND #PWR0114
U 1 1 601BEB98
P 4150 2100
F 0 "#PWR0114" H 4150 1850 50  0001 C CNN
F 1 "GND" H 4155 1927 50  0000 C CNN
F 2 "" H 4150 2100 50  0001 C CNN
F 3 "" H 4150 2100 50  0001 C CNN
	1    4150 2100
	1    0    0    -1  
$EndComp
Wire Wire Line
	4550 2000 4150 2000
Wire Wire Line
	4550 2100 4150 2100
$Comp
L Connector:Conn_01x07_Female J13
U 1 1 601C2817
P 4750 1800
F 0 "J13" H 4778 1826 50  0000 L CNN
F 1 "Conn_01x07_Female" H 4778 1735 50  0000 L CNN
F 2 "Connector_PinSocket_2.54mm:PinSocket_1x07_P2.54mm_Vertical" H 4750 1800 50  0001 C CNN
F 3 "~" H 4750 1800 50  0001 C CNN
	1    4750 1800
	1    0    0    -1  
$EndComp
$Comp
L Connector:Conn_01x04_Female J7
U 1 1 601C5921
P 4725 2750
F 0 "J7" H 4753 2726 50  0000 L CNN
F 1 "Conn_01x04_Female" H 4753 2635 50  0000 L CNN
F 2 "Connector_JST:JST_SH_SM04B-SRSS-TB_1x04-1MP_P1.00mm_Horizontal" H 4725 2750 50  0001 C CNN
F 3 "~" H 4725 2750 50  0001 C CNN
	1    4725 2750
	1    0    0    -1  
$EndComp
$Comp
L power:GND #PWR0115
U 1 1 601C98BE
P 4125 2650
F 0 "#PWR0115" H 4125 2400 50  0001 C CNN
F 1 "GND" H 4130 2477 50  0000 C CNN
F 2 "" H 4125 2650 50  0001 C CNN
F 3 "" H 4125 2650 50  0001 C CNN
	1    4125 2650
	1    0    0    -1  
$EndComp
$Comp
L power:+3V3 #PWR0116
U 1 1 601CA8AD
P 4350 2750
F 0 "#PWR0116" H 4350 2600 50  0001 C CNN
F 1 "+3V3" H 4365 2923 50  0000 C CNN
F 2 "" H 4350 2750 50  0001 C CNN
F 3 "" H 4350 2750 50  0001 C CNN
	1    4350 2750
	1    0    0    -1  
$EndComp
Text GLabel 4525 2850 0    50   Input ~ 0
SDA
Text GLabel 4525 2950 0    50   Input ~ 0
SCL
Wire Wire Line
	4525 2650 4125 2650
Wire Wire Line
	4525 2750 4350 2750
$Comp
L device:C C1
U 1 1 601E3F96
P 3425 5175
F 0 "C1" H 3540 5221 50  0000 L CNN
F 1 "0.1uF" H 3540 5130 50  0000 L CNN
F 2 "Capacitor_SMD:C_0805_2012Metric_Pad1.15x1.40mm_HandSolder" H 3463 5025 50  0001 C CNN
F 3 "" H 3425 5175 50  0001 C CNN
	1    3425 5175
	1    0    0    -1  
$EndComp
$Comp
L power:GND #PWR0117
U 1 1 601E4483
P 3425 5325
F 0 "#PWR0117" H 3425 5075 50  0001 C CNN
F 1 "GND" H 3430 5152 50  0000 C CNN
F 2 "" H 3425 5325 50  0001 C CNN
F 3 "" H 3425 5325 50  0001 C CNN
	1    3425 5325
	1    0    0    -1  
$EndComp
$Comp
L power:+3V3 #PWR0118
U 1 1 601E5440
P 3425 5025
F 0 "#PWR0118" H 3425 4875 50  0001 C CNN
F 1 "+3V3" H 3440 5198 50  0000 C CNN
F 2 "" H 3425 5025 50  0001 C CNN
F 3 "" H 3425 5025 50  0001 C CNN
	1    3425 5025
	1    0    0    -1  
$EndComp
$Comp
L Device:R R5
U 1 1 602547E2
P 6150 4850
F 0 "R5" H 6220 4896 50  0000 L CNN
F 1 "4.7K" H 6220 4805 50  0000 L CNN
F 2 "Resistor_THT:R_Axial_DIN0207_L6.3mm_D2.5mm_P10.16mm_Horizontal" V 6080 4850 50  0001 C CNN
F 3 "~" H 6150 4850 50  0001 C CNN
	1    6150 4850
	1    0    0    -1  
$EndComp
$Comp
L Device:R R7
U 1 1 602C5503
P 750 7000
F 0 "R7" H 820 7046 50  0000 L CNN
F 1 "R" H 820 6955 50  0000 L CNN
F 2 "Resistor_SMD:R_0805_2012Metric_Pad1.15x1.40mm_HandSolder" V 680 7000 50  0001 C CNN
F 3 "~" H 750 7000 50  0001 C CNN
	1    750  7000
	1    0    0    -1  
$EndComp
Text GLabel 1125 7175 0    50   Input ~ 0
SCL
$Comp
L power:+3V3 #PWR0119
U 1 1 602C5694
P 750 6850
F 0 "#PWR0119" H 750 6700 50  0001 C CNN
F 1 "+3V3" H 765 7023 50  0000 C CNN
F 2 "" H 750 6850 50  0001 C CNN
F 3 "" H 750 6850 50  0001 C CNN
	1    750  6850
	1    0    0    -1  
$EndComp
$Comp
L Device:R R8
U 1 1 602C569E
P 1125 7025
F 0 "R8" H 1195 7071 50  0000 L CNN
F 1 "R" H 1195 6980 50  0000 L CNN
F 2 "Resistor_SMD:R_0805_2012Metric_Pad1.15x1.40mm_HandSolder" V 1055 7025 50  0001 C CNN
F 3 "~" H 1125 7025 50  0001 C CNN
	1    1125 7025
	1    0    0    -1  
$EndComp
$Comp
L power:+3V3 #PWR0120
U 1 1 602C56A8
P 1125 6875
F 0 "#PWR0120" H 1125 6725 50  0001 C CNN
F 1 "+3V3" H 1140 7048 50  0000 C CNN
F 2 "" H 1125 6875 50  0001 C CNN
F 3 "" H 1125 6875 50  0001 C CNN
	1    1125 6875
	1    0    0    -1  
$EndComp
Text GLabel 750  7150 0    50   Input ~ 0
SDA
$Comp
L Device:R R9
U 1 1 602C56B3
P 1625 7050
F 0 "R9" H 1695 7096 50  0000 L CNN
F 1 "R" H 1695 7005 50  0000 L CNN
F 2 "Resistor_SMD:R_0805_2012Metric_Pad1.15x1.40mm_HandSolder" V 1555 7050 50  0001 C CNN
F 3 "~" H 1625 7050 50  0001 C CNN
	1    1625 7050
	1    0    0    -1  
$EndComp
Text GLabel 2000 7225 0    50   Input ~ 0
16
$Comp
L power:+3V3 #PWR0121
U 1 1 602C56BE
P 1625 6900
F 0 "#PWR0121" H 1625 6750 50  0001 C CNN
F 1 "+3V3" H 1640 7073 50  0000 C CNN
F 2 "" H 1625 6900 50  0001 C CNN
F 3 "" H 1625 6900 50  0001 C CNN
	1    1625 6900
	1    0    0    -1  
$EndComp
$Comp
L Device:R R10
U 1 1 602C56C8
P 2000 7075
F 0 "R10" H 2070 7121 50  0000 L CNN
F 1 "R" H 2070 7030 50  0000 L CNN
F 2 "Resistor_SMD:R_0805_2012Metric_Pad1.15x1.40mm_HandSolder" V 1930 7075 50  0001 C CNN
F 3 "~" H 2000 7075 50  0001 C CNN
	1    2000 7075
	1    0    0    -1  
$EndComp
$Comp
L power:+3V3 #PWR0122
U 1 1 602C56D2
P 2000 6925
F 0 "#PWR0122" H 2000 6775 50  0001 C CNN
F 1 "+3V3" H 2015 7098 50  0000 C CNN
F 2 "" H 2000 6925 50  0001 C CNN
F 3 "" H 2000 6925 50  0001 C CNN
	1    2000 6925
	1    0    0    -1  
$EndComp
Text GLabel 1625 7200 0    50   Input ~ 0
17
$Comp
L Device:R R12
U 1 1 602D018E
P 4350 4700
F 0 "R12" H 4420 4746 50  0000 L CNN
F 1 "4.7K" H 4420 4655 50  0000 L CNN
F 2 "Resistor_SMD:R_0805_2012Metric_Pad1.15x1.40mm_HandSolder" V 4280 4700 50  0001 C CNN
F 3 "~" H 4350 4700 50  0001 C CNN
	1    4350 4700
	1    0    0    -1  
$EndComp
Wire Wire Line
	4200 4850 4350 4850
Wire Wire Line
	4350 4850 4700 4850
Connection ~ 4350 4850
Connection ~ 4700 4850
$Comp
L power:+3V3 #PWR0123
U 1 1 602D6DC1
P 4350 4550
F 0 "#PWR0123" H 4350 4400 50  0001 C CNN
F 1 "+3V3" H 4365 4723 50  0000 C CNN
F 2 "" H 4350 4550 50  0001 C CNN
F 3 "" H 4350 4550 50  0001 C CNN
	1    4350 4550
	1    0    0    -1  
$EndComp
$Comp
L Device:R R11
U 1 1 602D86EA
P 5975 4850
F 0 "R11" H 6045 4896 50  0000 L CNN
F 1 "4.7K" H 6045 4805 50  0000 L CNN
F 2 "Resistor_SMD:R_0805_2012Metric_Pad1.15x1.40mm_HandSolder" V 5905 4850 50  0001 C CNN
F 3 "~" H 5975 4850 50  0001 C CNN
	1    5975 4850
	1    0    0    -1  
$EndComp
Wire Wire Line
	6150 5000 5975 5000
Connection ~ 6150 5000
Wire Wire Line
	5975 5000 5875 5000
Connection ~ 5975 5000
$Comp
L power:+3V3 #PWR0124
U 1 1 602D9FCD
P 5975 4700
F 0 "#PWR0124" H 5975 4550 50  0001 C CNN
F 1 "+3V3" H 5990 4873 50  0000 C CNN
F 2 "" H 5975 4700 50  0001 C CNN
F 3 "" H 5975 4700 50  0001 C CNN
	1    5975 4700
	1    0    0    -1  
$EndComp
Wire Wire Line
	9150 1225 9150 1400
Connection ~ 9150 1400
Wire Wire Line
	9150 1400 9000 1400
$Comp
L power:GND #PWR0125
U 1 1 60320C57
P 9350 1025
F 0 "#PWR0125" H 9350 775 50  0001 C CNN
F 1 "GND" H 9355 852 50  0000 C CNN
F 2 "" H 9350 1025 50  0001 C CNN
F 3 "" H 9350 1025 50  0001 C CNN
	1    9350 1025
	1    0    0    -1  
$EndComp
$Comp
L Connector:Conn_Coaxial J9
U 1 1 60326F28
P 9150 1025
F 0 "J9" V 9387 954 50  0000 C CNN
F 1 "Conn_Coaxial" V 9296 954 50  0000 C CNN
F 2 "Connector_Coaxial:U.FL_Hirose_U.FL-R-SMT-1_Vertical" H 9150 1025 50  0001 C CNN
F 3 " ~" H 9150 1025 50  0001 C CNN
	1    9150 1025
	0    -1   -1   0   
$EndComp
$Comp
L Mechanical:MountingHole H5
U 1 1 6036906D
P 5050 6100
F 0 "H5" H 5150 6146 50  0000 L CNN
F 1 "MountingHole" H 5150 6055 50  0000 L CNN
F 2 "MountingHole:MountingHole_3.5mm" H 5050 6100 50  0001 C CNN
F 3 "~" H 5050 6100 50  0001 C CNN
	1    5050 6100
	1    0    0    -1  
$EndComp
$EndSCHEMATC
