EESchema Schematic File Version 4
EELAYER 30 0
EELAYER END
$Descr A4 11693 8268
encoding utf-8
Sheet 1 1
Title ""
Date ""
Rev ""
Comp ""
Comment1 ""
Comment2 ""
Comment3 ""
Comment4 ""
$EndDescr
$Comp
L Device:R R2
U 1 1 5F989DB1
P 775 6275
F 0 "R2" H 845 6321 50  0000 L CNN
F 1 "R" H 845 6230 50  0000 L CNN
F 2 "Resistor_THT:R_Axial_DIN0207_L6.3mm_D2.5mm_P10.16mm_Horizontal" V 705 6275 50  0001 C CNN
F 3 "~" H 775 6275 50  0001 C CNN
	1    775  6275
	1    0    0    -1  
$EndComp
Text GLabel 1150 6450 0    50   Input ~ 0
SCL
$Comp
L power:+3V3 #PWR04
U 1 1 5F98B87C
P 775 6125
F 0 "#PWR04" H 775 5975 50  0001 C CNN
F 1 "+3V3" H 790 6298 50  0000 C CNN
F 2 "" H 775 6125 50  0001 C CNN
F 3 "" H 775 6125 50  0001 C CNN
	1    775  6125
	1    0    0    -1  
$EndComp
$Comp
L Device:R R4
U 1 1 5F98BC9A
P 1150 6300
F 0 "R4" H 1220 6346 50  0000 L CNN
F 1 "R" H 1220 6255 50  0000 L CNN
F 2 "Resistor_THT:R_Axial_DIN0207_L6.3mm_D2.5mm_P10.16mm_Horizontal" V 1080 6300 50  0001 C CNN
F 3 "~" H 1150 6300 50  0001 C CNN
	1    1150 6300
	1    0    0    -1  
$EndComp
$Comp
L power:+3V3 #PWR06
U 1 1 5F98C06B
P 1150 6150
F 0 "#PWR06" H 1150 6000 50  0001 C CNN
F 1 "+3V3" H 1165 6323 50  0000 C CNN
F 2 "" H 1150 6150 50  0001 C CNN
F 3 "" H 1150 6150 50  0001 C CNN
	1    1150 6150
	1    0    0    -1  
$EndComp
Text GLabel 775  6425 0    50   Input ~ 0
SDA
$Comp
L power:+3V3 #PWR025
U 1 1 5F996AAC
P 6525 1525
F 0 "#PWR025" H 6525 1375 50  0001 C CNN
F 1 "+3V3" V 6540 1653 50  0000 L CNN
F 2 "" H 6525 1525 50  0001 C CNN
F 3 "" H 6525 1525 50  0001 C CNN
	1    6525 1525
	-1   0    0    1   
$EndComp
$Comp
L power:GND #PWR026
U 1 1 5F997480
P 6725 1925
F 0 "#PWR026" H 6725 1675 50  0001 C CNN
F 1 "GND" H 6730 1752 50  0000 C CNN
F 2 "" H 6725 1925 50  0001 C CNN
F 3 "" H 6725 1925 50  0001 C CNN
	1    6725 1925
	0    -1   -1   0   
$EndComp
Text GLabel 6825 1525 3    50   Input ~ 0
SCL
Text GLabel 7025 1525 3    50   Input ~ 0
SDA
Wire Wire Line
	6725 1925 6725 1525
$Comp
L Mechanical:MountingHole H2
U 1 1 5F9CF5FF
P 6600 2875
F 0 "H2" H 6700 2921 50  0000 L CNN
F 1 "MountingHole" H 6700 2830 50  0000 L CNN
F 2 "MountingHole:MountingHole_3.5mm" H 6600 2875 50  0001 C CNN
F 3 "~" H 6600 2875 50  0001 C CNN
	1    6600 2875
	1    0    0    -1  
$EndComp
$Comp
L Mechanical:MountingHole H3
U 1 1 5F9CFBAC
P 6600 3100
F 0 "H3" H 6700 3146 50  0000 L CNN
F 1 "MountingHole" H 6700 3055 50  0000 L CNN
F 2 "MountingHole:MountingHole_3.5mm" H 6600 3100 50  0001 C CNN
F 3 "~" H 6600 3100 50  0001 C CNN
	1    6600 3100
	1    0    0    -1  
$EndComp
$Comp
L Mechanical:MountingHole H4
U 1 1 5F9D006D
P 6600 3325
F 0 "H4" H 6700 3371 50  0000 L CNN
F 1 "MountingHole" H 6700 3280 50  0000 L CNN
F 2 "MountingHole:MountingHole_3.5mm" H 6600 3325 50  0001 C CNN
F 3 "~" H 6600 3325 50  0001 C CNN
	1    6600 3325
	1    0    0    -1  
$EndComp
$Comp
L Connector:Conn_01x08_Female J9
U 1 1 5FADE7E5
P 6825 1325
F 0 "J9" V 6990 1255 50  0000 C CNN
F 1 "BME390" V 6899 1255 50  0000 C CNN
F 2 "Connector_PinSocket_2.54mm:PinSocket_1x08_P2.54mm_Vertical" H 6825 1325 50  0001 C CNN
F 3 "~" H 6825 1325 50  0001 C CNN
	1    6825 1325
	0    -1   -1   0   
$EndComp
$Comp
L Connector:Conn_01x07_Female J8
U 1 1 5FB57B67
P 5825 1575
F 0 "J8" H 5853 1601 50  0000 L CNN
F 1 "SCD30" H 5853 1510 50  0000 L CNN
F 2 "Connector_PinSocket_2.54mm:PinSocket_1x07_P2.54mm_Vertical" H 5825 1575 50  0001 C CNN
F 3 "~" H 5825 1575 50  0001 C CNN
	1    5825 1575
	1    0    0    -1  
$EndComp
$Comp
L power:+3V3 #PWR023
U 1 1 5FBA156B
P 5625 1275
F 0 "#PWR023" H 5625 1125 50  0001 C CNN
F 1 "+3V3" H 5640 1448 50  0000 C CNN
F 2 "" H 5625 1275 50  0001 C CNN
F 3 "" H 5625 1275 50  0001 C CNN
	1    5625 1275
	1    0    0    -1  
$EndComp
$Comp
L power:GND #PWR020
U 1 1 5FBA258D
P 5275 1375
F 0 "#PWR020" H 5275 1125 50  0001 C CNN
F 1 "GND" H 5280 1202 50  0000 C CNN
F 2 "" H 5275 1375 50  0001 C CNN
F 3 "" H 5275 1375 50  0001 C CNN
	1    5275 1375
	1    0    0    -1  
$EndComp
Wire Wire Line
	5625 1375 5275 1375
Text GLabel 5625 1475 0    50   Input ~ 0
SCL
Text GLabel 5625 1575 0    50   Input ~ 0
SDA
Text Notes 1175 5650 0    79   ~ 0
i2c pullups
Text Notes 5450 1000 0    79   ~ 0
SCD30
Text Notes 6650 1000 0    79   ~ 0
BME388/90
$Comp
L Mechanical:MountingHole H1
U 1 1 5FDF5FDF
P 6600 2650
F 0 "H1" H 6700 2696 50  0000 L CNN
F 1 "MountingHole" H 6700 2605 50  0000 L CNN
F 2 "MountingHole:MountingHole_3.7mm" H 6600 2650 50  0001 C CNN
F 3 "~" H 6600 2650 50  0001 C CNN
	1    6600 2650
	1    0    0    -1  
$EndComp
$Comp
L Connector:Conn_01x04_Female J10
U 1 1 60000D99
P 8325 6025
F 0 "J10" H 8353 6001 50  0000 L CNN
F 1 "ssd1306" H 8353 5910 50  0000 L CNN
F 2 "Connector_PinSocket_2.54mm:PinSocket_1x04_P2.54mm_Vertical" H 8325 6025 50  0001 C CNN
F 3 "~" H 8325 6025 50  0001 C CNN
	1    8325 6025
	1    0    0    -1  
$EndComp
$Comp
L power:GND #PWR027
U 1 1 60000DA1
P 7750 5925
F 0 "#PWR027" H 7750 5675 50  0001 C CNN
F 1 "GND" H 7755 5752 50  0000 C CNN
F 2 "" H 7750 5925 50  0001 C CNN
F 3 "" H 7750 5925 50  0001 C CNN
	1    7750 5925
	1    0    0    -1  
$EndComp
$Comp
L power:+3V3 #PWR028
U 1 1 60000DA7
P 8000 5850
F 0 "#PWR028" H 8000 5700 50  0001 C CNN
F 1 "+3V3" V 8015 5978 50  0000 L CNN
F 2 "" H 8000 5850 50  0001 C CNN
F 3 "" H 8000 5850 50  0001 C CNN
	1    8000 5850
	1    0    0    -1  
$EndComp
Wire Wire Line
	8125 6025 8000 6025
Wire Wire Line
	8000 6025 8000 5850
Wire Wire Line
	8125 5925 7750 5925
$Comp
L Connector:Conn_01x12_Female J1
U 1 1 6018A4D9
P 1650 2400
F 0 "J1" H 1678 2376 50  0000 L CNN
F 1 "Conn_01x12_Female" V 1800 2100 50  0000 L CNN
F 2 "Connector_PinSocket_2.54mm:PinSocket_1x12_P2.54mm_Vertical" H 1650 2400 50  0001 C CNN
F 3 "~" H 1650 2400 50  0001 C CNN
	1    1650 2400
	-1   0    0    1   
$EndComp
$Comp
L Connector:Conn_01x16_Female J3
U 1 1 6018BB4F
P 2550 2500
F 0 "J3" H 2500 3350 50  0000 C CNN
F 1 "Conn_01x16_Female" V 2650 2400 50  0000 C CNN
F 2 "Connector_PinSocket_2.54mm:PinSocket_1x16_P2.54mm_Vertical" H 2550 2500 50  0001 C CNN
F 3 "~" H 2550 2500 50  0001 C CNN
	1    2550 2500
	-1   0    0    -1  
$EndComp
Text GLabel 1850 2900 2    50   Input ~ 0
VBAT
Text GLabel 1850 2700 2    50   Input ~ 0
VBUS
$Comp
L power:+3V3 #PWR09
U 1 1 601B9ECE
P 2750 3200
F 0 "#PWR09" H 2750 3050 50  0001 C CNN
F 1 "+3V3" H 2765 3373 50  0000 C CNN
F 2 "" H 2750 3200 50  0001 C CNN
F 3 "" H 2750 3200 50  0001 C CNN
	1    2750 3200
	0    1    1    0   
$EndComp
$Comp
L power:GND #PWR08
U 1 1 601BDD3D
P 2750 3000
F 0 "#PWR08" H 2750 2750 50  0001 C CNN
F 1 "GND" H 2755 2827 50  0000 C CNN
F 2 "" H 2750 3000 50  0001 C CNN
F 3 "" H 2750 3000 50  0001 C CNN
	1    2750 3000
	0    -1   -1   0   
$EndComp
Text GLabel 1850 2300 2    50   Input ~ 0
10
Text GLabel 2750 2300 2    50   Input ~ 0
SCK
Text GLabel 2750 2200 2    50   Input ~ 0
MOSI
Text GLabel 2750 2100 2    50   Input ~ 0
MISO
Text Notes 7700 5500 0    79   ~ 0
SSD1306
Text GLabel 1850 1900 2    50   Input ~ 0
SCL
Text GLabel 1850 1800 2    50   Input ~ 0
SDA
Text Notes 2650 1500 2    79   ~ 0
Adafruit Feather
$Comp
L Switch:SW_Push_Dual SW1
U 1 1 6028B8CB
P 5150 4850
F 0 "SW1" H 5150 5135 50  0000 C CNN
F 1 "SW_Push_Dual" H 5150 5044 50  0000 C CNN
F 2 "Button_Switch_THT:SW_TH_Tactile_Omron_B3F-10xx" H 5150 5050 50  0001 C CNN
F 3 "~" H 5150 5050 50  0001 C CNN
	1    5150 4850
	1    0    0    -1  
$EndComp
Wire Wire Line
	5350 4850 5350 4650
Wire Wire Line
	5350 4650 4950 4650
Wire Wire Line
	4950 4650 4950 4850
Wire Wire Line
	5350 5050 5350 4900
Wire Wire Line
	5350 4900 4950 4900
Wire Wire Line
	4950 4900 4950 5050
$Comp
L power:GND #PWR019
U 1 1 6028DB07
P 5350 5050
F 0 "#PWR019" H 5350 4800 50  0001 C CNN
F 1 "GND" H 5355 4877 50  0000 C CNN
F 2 "" H 5350 5050 50  0001 C CNN
F 3 "" H 5350 5050 50  0001 C CNN
	1    5350 5050
	1    0    0    -1  
$EndComp
Connection ~ 5350 5050
$Comp
L Device:R R6
U 1 1 6028DEF2
P 4700 4700
F 0 "R6" H 4770 4746 50  0000 L CNN
F 1 "4.7K" H 4770 4655 50  0000 L CNN
F 2 "Resistor_THT:R_Axial_DIN0207_L6.3mm_D2.5mm_P10.16mm_Horizontal" V 4630 4700 50  0001 C CNN
F 3 "~" H 4700 4700 50  0001 C CNN
	1    4700 4700
	1    0    0    -1  
$EndComp
$Comp
L power:+3V3 #PWR018
U 1 1 6028E7B5
P 4700 4550
F 0 "#PWR018" H 4700 4400 50  0001 C CNN
F 1 "+3V3" H 4715 4723 50  0000 C CNN
F 2 "" H 4700 4550 50  0001 C CNN
F 3 "" H 4700 4550 50  0001 C CNN
	1    4700 4550
	1    0    0    -1  
$EndComp
Wire Wire Line
	4950 4850 4700 4850
Connection ~ 4950 4850
Text Notes 4800 4300 0    79   ~ 0
BUTTON A
Text Notes 3800 700  0    79   ~ 0
Breakouts
$Comp
L Switch:SW_Push_Dual SW2
U 1 1 6025455B
P 6600 5000
F 0 "SW2" H 6600 5285 50  0000 C CNN
F 1 "SW_Push_Dual" H 6600 5194 50  0000 C CNN
F 2 "Button_Switch_THT:SW_TH_Tactile_Omron_B3F-10xx" H 6600 5200 50  0001 C CNN
F 3 "~" H 6600 5200 50  0001 C CNN
	1    6600 5000
	1    0    0    -1  
$EndComp
Wire Wire Line
	6800 5000 6800 4800
Wire Wire Line
	6800 4800 6400 4800
Wire Wire Line
	6400 4800 6400 5000
Wire Wire Line
	6800 5200 6800 5050
Wire Wire Line
	6800 5050 6400 5050
Wire Wire Line
	6400 5050 6400 5200
$Comp
L power:GND #PWR024
U 1 1 602547D7
P 6800 5200
F 0 "#PWR024" H 6800 4950 50  0001 C CNN
F 1 "GND" H 6805 5027 50  0000 C CNN
F 2 "" H 6800 5200 50  0001 C CNN
F 3 "" H 6800 5200 50  0001 C CNN
	1    6800 5200
	1    0    0    -1  
$EndComp
Connection ~ 6800 5200
$Comp
L power:+3V3 #PWR022
U 1 1 602547EC
P 6150 4700
F 0 "#PWR022" H 6150 4550 50  0001 C CNN
F 1 "+3V3" H 6165 4873 50  0000 C CNN
F 2 "" H 6150 4700 50  0001 C CNN
F 3 "" H 6150 4700 50  0001 C CNN
	1    6150 4700
	1    0    0    -1  
$EndComp
Wire Wire Line
	6400 5000 6150 5000
Connection ~ 6400 5000
Text Notes 6250 4450 0    79   ~ 0
BUTTON B
Text GLabel 1850 2000 2    50   Input ~ 0
5
Text GLabel 1850 2100 2    50   Input ~ 0
6
Text GLabel 1850 2200 2    50   Input ~ 0
9
Text GLabel 1850 2500 2    50   Input ~ 0
12
Text GLabel 1850 2600 2    50   Input ~ 0
13
Text GLabel 2750 1900 2    50   Input ~ 0
TX1
Text GLabel 2750 2000 2    50   Input ~ 0
RX0
Text GLabel 2500 6750 0    50   Input ~ 0
VBUS
$Comp
L power:GND #PWR07
U 1 1 601B48F9
P 2500 6550
F 0 "#PWR07" H 2500 6300 50  0001 C CNN
F 1 "GND" H 2505 6377 50  0000 C CNN
F 2 "" H 2500 6550 50  0001 C CNN
F 3 "" H 2500 6550 50  0001 C CNN
	1    2500 6550
	0    1    1    0   
$EndComp
Text Notes 2975 6375 0    79   ~ 0
POWER
Text GLabel 4100 1200 0    50   Input ~ 0
A1
Text GLabel 4100 1100 0    50   Input ~ 0
SCL
Text GLabel 4100 1600 0    50   Input ~ 0
VBUS
Text GLabel 4100 1000 0    50   Input ~ 0
SDA
$Comp
L power:+3V3 #PWR014
U 1 1 601BD700
P 3650 1700
F 0 "#PWR014" H 3650 1550 50  0001 C CNN
F 1 "+3V3" H 3665 1873 50  0000 C CNN
F 2 "" H 3650 1700 50  0001 C CNN
F 3 "" H 3650 1700 50  0001 C CNN
	1    3650 1700
	1    0    0    -1  
$EndComp
$Comp
L power:GND #PWR015
U 1 1 601BEB98
P 3800 1800
F 0 "#PWR015" H 3800 1550 50  0001 C CNN
F 1 "GND" H 3805 1627 50  0000 C CNN
F 2 "" H 3800 1800 50  0001 C CNN
F 3 "" H 3800 1800 50  0001 C CNN
	1    3800 1800
	1    0    0    -1  
$EndComp
$Comp
L Connector:Conn_01x04_Female J6
U 1 1 601C5921
P 4475 2800
F 0 "J6" H 4503 2776 50  0000 L CNN
F 1 "Conn_01x04_Female" V 4650 2350 50  0000 L CNN
F 2 "Connector_JST:JST_SH_SM04B-SRSS-TB_1x04-1MP_P1.00mm_Horizontal" H 4475 2800 50  0001 C CNN
F 3 "~" H 4475 2800 50  0001 C CNN
	1    4475 2800
	1    0    0    -1  
$EndComp
$Comp
L power:GND #PWR013
U 1 1 601C98BE
P 3875 2700
F 0 "#PWR013" H 3875 2450 50  0001 C CNN
F 1 "GND" H 3880 2527 50  0000 C CNN
F 2 "" H 3875 2700 50  0001 C CNN
F 3 "" H 3875 2700 50  0001 C CNN
	1    3875 2700
	1    0    0    -1  
$EndComp
$Comp
L power:+3V3 #PWR016
U 1 1 601CA8AD
P 4100 2800
F 0 "#PWR016" H 4100 2650 50  0001 C CNN
F 1 "+3V3" H 4115 2973 50  0000 C CNN
F 2 "" H 4100 2800 50  0001 C CNN
F 3 "" H 4100 2800 50  0001 C CNN
	1    4100 2800
	1    0    0    -1  
$EndComp
Text GLabel 4275 2900 0    50   Input ~ 0
SDA
Text GLabel 4275 3000 0    50   Input ~ 0
SCL
Wire Wire Line
	4275 2700 3875 2700
Wire Wire Line
	4275 2800 4100 2800
$Comp
L Device:R R8
U 1 1 602547E2
P 6150 4850
F 0 "R8" H 6220 4896 50  0000 L CNN
F 1 "4.7K" H 6220 4805 50  0000 L CNN
F 2 "Resistor_THT:R_Axial_DIN0207_L6.3mm_D2.5mm_P10.16mm_Horizontal" V 6080 4850 50  0001 C CNN
F 3 "~" H 6150 4850 50  0001 C CNN
	1    6150 4850
	1    0    0    -1  
$EndComp
$Comp
L Device:R R5
U 1 1 602D018E
P 4350 4700
F 0 "R5" H 4420 4746 50  0000 L CNN
F 1 "4.7K" H 4420 4655 50  0000 L CNN
F 2 "Resistor_SMD:R_0805_2012Metric_Pad1.15x1.40mm_HandSolder" V 4280 4700 50  0001 C CNN
F 3 "~" H 4350 4700 50  0001 C CNN
	1    4350 4700
	1    0    0    -1  
$EndComp
Wire Wire Line
	4200 4850 4350 4850
Wire Wire Line
	4350 4850 4700 4850
Connection ~ 4350 4850
Connection ~ 4700 4850
$Comp
L power:+3V3 #PWR017
U 1 1 602D6DC1
P 4350 4550
F 0 "#PWR017" H 4350 4400 50  0001 C CNN
F 1 "+3V3" H 4365 4723 50  0000 C CNN
F 2 "" H 4350 4550 50  0001 C CNN
F 3 "" H 4350 4550 50  0001 C CNN
	1    4350 4550
	1    0    0    -1  
$EndComp
$Comp
L Device:R R7
U 1 1 602D86EA
P 5975 4850
F 0 "R7" H 6045 4896 50  0000 L CNN
F 1 "4.7K" H 6045 4805 50  0000 L CNN
F 2 "Resistor_SMD:R_0805_2012Metric_Pad1.15x1.40mm_HandSolder" V 5905 4850 50  0001 C CNN
F 3 "~" H 5975 4850 50  0001 C CNN
	1    5975 4850
	1    0    0    -1  
$EndComp
Wire Wire Line
	6150 5000 5975 5000
Connection ~ 6150 5000
Wire Wire Line
	5975 5000 5875 5000
Connection ~ 5975 5000
$Comp
L power:+3V3 #PWR021
U 1 1 602D9FCD
P 5975 4700
F 0 "#PWR021" H 5975 4550 50  0001 C CNN
F 1 "+3V3" H 5990 4873 50  0000 C CNN
F 2 "" H 5975 4700 50  0001 C CNN
F 3 "" H 5975 4700 50  0001 C CNN
	1    5975 4700
	1    0    0    -1  
$EndComp
Text GLabel 8125 6125 0    50   Input ~ 0
SCL
Text GLabel 8125 6225 0    50   Input ~ 0
SDA
Text GLabel 5875 5000 0    50   Input ~ 0
6
$Comp
L Connector:Barrel_Jack_MountingPin J4
U 1 1 607F42DF
P 2800 6650
F 0 "J4" H 2570 6522 50  0000 R CNN
F 1 "Barrel_Jack_MountingPin" H 2570 6613 50  0000 R CNN
F 2 "Connector_BarrelJack:BarrelJack_Horizontal" H 2850 6610 50  0001 C CNN
F 3 "~" H 2850 6610 50  0001 C CNN
	1    2800 6650
	-1   0    0    1   
$EndComp
Wire Wire Line
	2500 6350 2500 6550
Wire Wire Line
	2500 6350 2800 6350
Connection ~ 2500 6550
$Comp
L Switch:SW_Coded_SH-7010 SW3
U 1 1 6083DFB0
P 7950 4550
F 0 "SW3" H 8007 5017 50  0000 C CNN
F 1 "SW_Coded_SH-7010" H 8007 4926 50  0000 C CNN
F 2 "footprints:sd2010_dip" H 7650 4100 50  0001 L CNN
F 3 "https://www.nidec-copal-electronics.com/e/catalog/switch/sh-7000.pdf" H 7950 4550 50  0001 C CNN
	1    7950 4550
	1    0    0    -1  
$EndComp
$Comp
L Mechanical:MountingHole H7
U 1 1 6086C61D
P 5050 6600
F 0 "H7" H 5150 6646 50  0000 L CNN
F 1 "MountingHole" H 5150 6555 50  0000 L CNN
F 2 "MountingHole:MountingHole_2.2mm_M2" H 5050 6600 50  0001 C CNN
F 3 "~" H 5050 6600 50  0001 C CNN
	1    5050 6600
	1    0    0    -1  
$EndComp
$Comp
L Mechanical:MountingHole H6
U 1 1 6086C0E9
P 5050 6350
F 0 "H6" H 5150 6396 50  0000 L CNN
F 1 "MountingHole" H 5150 6305 50  0000 L CNN
F 2 "MountingHole:MountingHole_2.2mm_M2" H 5050 6350 50  0001 C CNN
F 3 "~" H 5050 6350 50  0001 C CNN
	1    5050 6350
	1    0    0    -1  
$EndComp
$Comp
L Mechanical:MountingHole H5
U 1 1 6036906D
P 5050 6100
F 0 "H5" H 5150 6146 50  0000 L CNN
F 1 "MountingHole" H 5150 6055 50  0000 L CNN
F 2 "MountingHole:MountingHole_2.2mm_M2" H 5050 6100 50  0001 C CNN
F 3 "~" H 5050 6100 50  0001 C CNN
	1    5050 6100
	1    0    0    -1  
$EndComp
$Comp
L Mechanical:MountingHole H8
U 1 1 6087972C
P 5050 6875
F 0 "H8" H 5150 6921 50  0000 L CNN
F 1 "MountingHole" H 5150 6830 50  0000 L CNN
F 2 "MountingHole:MountingHole_2.2mm_M2" H 5050 6875 50  0001 C CNN
F 3 "~" H 5050 6875 50  0001 C CNN
	1    5050 6875
	1    0    0    -1  
$EndComp
$Comp
L power:+3V3 #PWR029
U 1 1 60663FBD
P 8500 4350
F 0 "#PWR029" H 8500 4200 50  0001 C CNN
F 1 "+3V3" V 8515 4478 50  0000 L CNN
F 2 "" H 8500 4350 50  0001 C CNN
F 3 "" H 8500 4350 50  0001 C CNN
	1    8500 4350
	1    0    0    -1  
$EndComp
Wire Wire Line
	8500 4350 8350 4350
Text GLabel 1850 2400 2    50   Input ~ 0
11
Text GLabel 750  7150 0    50   Input ~ 0
SDA
$Comp
L power:+3V3 #PWR05
U 1 1 602C56A8
P 1125 6875
F 0 "#PWR05" H 1125 6725 50  0001 C CNN
F 1 "+3V3" H 1140 7048 50  0000 C CNN
F 2 "" H 1125 6875 50  0001 C CNN
F 3 "" H 1125 6875 50  0001 C CNN
	1    1125 6875
	1    0    0    -1  
$EndComp
$Comp
L Device:R R3
U 1 1 602C569E
P 1125 7025
F 0 "R3" H 1195 7071 50  0000 L CNN
F 1 "R" H 1195 6980 50  0000 L CNN
F 2 "Resistor_SMD:R_0805_2012Metric_Pad1.15x1.40mm_HandSolder" V 1055 7025 50  0001 C CNN
F 3 "~" H 1125 7025 50  0001 C CNN
	1    1125 7025
	1    0    0    -1  
$EndComp
$Comp
L power:+3V3 #PWR03
U 1 1 602C5694
P 750 6850
F 0 "#PWR03" H 750 6700 50  0001 C CNN
F 1 "+3V3" H 765 7023 50  0000 C CNN
F 2 "" H 750 6850 50  0001 C CNN
F 3 "" H 750 6850 50  0001 C CNN
	1    750  6850
	1    0    0    -1  
$EndComp
Text GLabel 1125 7175 0    50   Input ~ 0
SCL
$Comp
L Device:R R1
U 1 1 602C5503
P 750 7000
F 0 "R1" H 820 7046 50  0000 L CNN
F 1 "R" H 820 6955 50  0000 L CNN
F 2 "Resistor_SMD:R_0805_2012Metric_Pad1.15x1.40mm_HandSolder" V 680 7000 50  0001 C CNN
F 3 "~" H 750 7000 50  0001 C CNN
	1    750  7000
	1    0    0    -1  
$EndComp
$Comp
L device:R R16
U 1 1 606C19B0
P 10700 4600
F 0 "R16" H 10770 4646 50  0000 L CNN
F 1 "R" H 10770 4555 50  0000 L CNN
F 2 "Resistor_SMD:R_0805_2012Metric_Pad1.15x1.40mm_HandSolder" V 10630 4600 50  0001 C CNN
F 3 "" H 10700 4600 50  0001 C CNN
	1    10700 4600
	1    0    0    -1  
$EndComp
$Comp
L device:R R15
U 1 1 606C2AE8
P 10450 4600
F 0 "R15" H 10520 4646 50  0000 L CNN
F 1 "R" H 10520 4555 50  0000 L CNN
F 2 "Resistor_THT:R_Axial_DIN0207_L6.3mm_D2.5mm_P10.16mm_Horizontal" V 10380 4600 50  0001 C CNN
F 3 "" H 10450 4600 50  0001 C CNN
	1    10450 4600
	1    0    0    -1  
$EndComp
$Comp
L device:R R14
U 1 1 606C347F
P 10200 4700
F 0 "R14" H 10270 4746 50  0000 L CNN
F 1 "R" H 10270 4655 50  0000 L CNN
F 2 "Resistor_SMD:R_0805_2012Metric_Pad1.15x1.40mm_HandSolder" V 10130 4700 50  0001 C CNN
F 3 "" H 10200 4700 50  0001 C CNN
	1    10200 4700
	1    0    0    -1  
$EndComp
$Comp
L device:R R13
U 1 1 606C39E6
P 9950 4700
F 0 "R13" H 10020 4746 50  0000 L CNN
F 1 "R" H 10020 4655 50  0000 L CNN
F 2 "Resistor_THT:R_Axial_DIN0207_L6.3mm_D2.5mm_P10.16mm_Horizontal" V 9880 4700 50  0001 C CNN
F 3 "" H 9950 4700 50  0001 C CNN
	1    9950 4700
	1    0    0    -1  
$EndComp
$Comp
L device:R R12
U 1 1 606D883A
P 9700 4800
F 0 "R12" H 9770 4846 50  0000 L CNN
F 1 "R" H 9770 4755 50  0000 L CNN
F 2 "Resistor_SMD:R_0805_2012Metric_Pad1.15x1.40mm_HandSolder" V 9630 4800 50  0001 C CNN
F 3 "" H 9700 4800 50  0001 C CNN
	1    9700 4800
	1    0    0    -1  
$EndComp
$Comp
L device:R R11
U 1 1 606D9004
P 9450 4800
F 0 "R11" H 9520 4846 50  0000 L CNN
F 1 "R" H 9520 4755 50  0000 L CNN
F 2 "Resistor_THT:R_Axial_DIN0207_L6.3mm_D2.5mm_P10.16mm_Horizontal" V 9380 4800 50  0001 C CNN
F 3 "" H 9450 4800 50  0001 C CNN
	1    9450 4800
	1    0    0    -1  
$EndComp
$Comp
L device:R R10
U 1 1 606D96CA
P 9200 4900
F 0 "R10" H 9270 4946 50  0000 L CNN
F 1 "R" H 9270 4855 50  0000 L CNN
F 2 "Resistor_SMD:R_0805_2012Metric_Pad1.15x1.40mm_HandSolder" V 9130 4900 50  0001 C CNN
F 3 "" H 9200 4900 50  0001 C CNN
	1    9200 4900
	1    0    0    -1  
$EndComp
$Comp
L device:R R9
U 1 1 606D9CC7
P 8950 4900
F 0 "R9" H 9020 4946 50  0000 L CNN
F 1 "R" H 9020 4855 50  0000 L CNN
F 2 "Resistor_THT:R_Axial_DIN0207_L6.3mm_D2.5mm_P10.16mm_Horizontal" V 8880 4900 50  0001 C CNN
F 3 "" H 8950 4900 50  0001 C CNN
	1    8950 4900
	1    0    0    -1  
$EndComp
Wire Wire Line
	8350 4450 10450 4450
Wire Wire Line
	10450 4450 10700 4450
Connection ~ 10450 4450
Wire Wire Line
	10200 4550 9950 4550
Wire Wire Line
	8350 4550 9950 4550
Connection ~ 9950 4550
Wire Wire Line
	9700 4650 9450 4650
Wire Wire Line
	8350 4650 9450 4650
Connection ~ 9450 4650
Wire Wire Line
	9200 4750 8950 4750
Wire Wire Line
	8350 4750 8950 4750
Connection ~ 8950 4750
$Comp
L power:GND #PWR030
U 1 1 606E1128
P 8950 5050
F 0 "#PWR030" H 8950 4800 50  0001 C CNN
F 1 "GND" H 8955 4877 50  0000 C CNN
F 2 "" H 8950 5050 50  0001 C CNN
F 3 "" H 8950 5050 50  0001 C CNN
	1    8950 5050
	1    0    0    -1  
$EndComp
$Comp
L power:GND #PWR031
U 1 1 606E1808
P 9200 5050
F 0 "#PWR031" H 9200 4800 50  0001 C CNN
F 1 "GND" H 9205 4877 50  0000 C CNN
F 2 "" H 9200 5050 50  0001 C CNN
F 3 "" H 9200 5050 50  0001 C CNN
	1    9200 5050
	1    0    0    -1  
$EndComp
$Comp
L power:GND #PWR032
U 1 1 606E1D62
P 9450 4950
F 0 "#PWR032" H 9450 4700 50  0001 C CNN
F 1 "GND" H 9455 4777 50  0000 C CNN
F 2 "" H 9450 4950 50  0001 C CNN
F 3 "" H 9450 4950 50  0001 C CNN
	1    9450 4950
	1    0    0    -1  
$EndComp
$Comp
L power:GND #PWR033
U 1 1 606E22F7
P 9700 4950
F 0 "#PWR033" H 9700 4700 50  0001 C CNN
F 1 "GND" H 9705 4777 50  0000 C CNN
F 2 "" H 9700 4950 50  0001 C CNN
F 3 "" H 9700 4950 50  0001 C CNN
	1    9700 4950
	1    0    0    -1  
$EndComp
$Comp
L power:GND #PWR034
U 1 1 606E2881
P 9950 4850
F 0 "#PWR034" H 9950 4600 50  0001 C CNN
F 1 "GND" H 9955 4677 50  0000 C CNN
F 2 "" H 9950 4850 50  0001 C CNN
F 3 "" H 9950 4850 50  0001 C CNN
	1    9950 4850
	1    0    0    -1  
$EndComp
$Comp
L power:GND #PWR035
U 1 1 606E2DB0
P 10200 4850
F 0 "#PWR035" H 10200 4600 50  0001 C CNN
F 1 "GND" H 10205 4677 50  0000 C CNN
F 2 "" H 10200 4850 50  0001 C CNN
F 3 "" H 10200 4850 50  0001 C CNN
	1    10200 4850
	1    0    0    -1  
$EndComp
$Comp
L power:GND #PWR036
U 1 1 606E3368
P 10450 4750
F 0 "#PWR036" H 10450 4500 50  0001 C CNN
F 1 "GND" H 10455 4577 50  0000 C CNN
F 2 "" H 10450 4750 50  0001 C CNN
F 3 "" H 10450 4750 50  0001 C CNN
	1    10450 4750
	1    0    0    -1  
$EndComp
$Comp
L power:GND #PWR037
U 1 1 606E480E
P 10700 4750
F 0 "#PWR037" H 10700 4500 50  0001 C CNN
F 1 "GND" H 10705 4577 50  0000 C CNN
F 2 "" H 10700 4750 50  0001 C CNN
F 3 "" H 10700 4750 50  0001 C CNN
	1    10700 4750
	1    0    0    -1  
$EndComp
Wire Wire Line
	10450 4450 10450 4250
Wire Wire Line
	9950 4550 9950 4250
Wire Wire Line
	9450 4650 9450 4250
Wire Wire Line
	8950 4750 8950 4250
Wire Wire Line
	4100 1800 3800 1800
Wire Wire Line
	4100 1700 3650 1700
Text GLabel 4100 1300 0    50   Input ~ 0
A0
$Comp
L power:GND #PWR0101
U 1 1 60798E1F
P 5025 2700
F 0 "#PWR0101" H 5025 2450 50  0001 C CNN
F 1 "GND" H 5030 2527 50  0000 C CNN
F 2 "" H 5025 2700 50  0001 C CNN
F 3 "" H 5025 2700 50  0001 C CNN
	1    5025 2700
	1    0    0    -1  
$EndComp
$Comp
L power:+3V3 #PWR0102
U 1 1 60798E29
P 5250 2800
F 0 "#PWR0102" H 5250 2650 50  0001 C CNN
F 1 "+3V3" H 5265 2973 50  0000 C CNN
F 2 "" H 5250 2800 50  0001 C CNN
F 3 "" H 5250 2800 50  0001 C CNN
	1    5250 2800
	1    0    0    -1  
$EndComp
Text GLabel 5425 2900 0    50   Input ~ 0
SDA
Text GLabel 5425 3000 0    50   Input ~ 0
SCL
Wire Wire Line
	5425 2700 5025 2700
Wire Wire Line
	5425 2800 5250 2800
Text GLabel 8950 4250 2    50   Input ~ 0
5
$Comp
L Connector:Conn_01x04_Female J11
U 1 1 6079898D
P 5625 2800
F 0 "J11" H 5653 2776 50  0000 L CNN
F 1 "Conn_01x04_Female" V 5800 2350 50  0000 L CNN
F 2 "Connector_JST:JST_SH_SM04B-SRSS-TB_1x04-1MP_P1.00mm_Horizontal" H 5625 2800 50  0001 C CNN
F 3 "~" H 5625 2800 50  0001 C CNN
	1    5625 2800
	1    0    0    -1  
$EndComp
Text Notes 4800 2450 0    79   ~ 0
QWIIC
$Comp
L mysensors_radios:RFM95HW U1
U 1 1 608564B2
P 9200 2300
F 0 "U1" H 9200 2914 40  0000 C CNN
F 1 "RFM95HW" H 9200 2838 40  0000 C CNN
F 2 "footprints:RFM95" H 9200 2300 30  0001 C CIN
F 3 "https://cdn-learn.adafruit.com/assets/assets/000/031/659/original/RFM95_96_97_98W.pdf?1460518717" H 10000 1150 60  0000 C CNN
	1    9200 2300
	1    0    0    -1  
$EndComp
Text GLabel 8650 2450 0    50   Input ~ 0
MOSI
Text GLabel 8650 2550 0    50   Input ~ 0
MISO
Text GLabel 8650 2650 0    50   Input ~ 0
SCK
$Comp
L power:GND #PWR0103
U 1 1 6086F1E9
P 9100 3150
F 0 "#PWR0103" H 9100 2900 50  0001 C CNN
F 1 "GND" H 9105 2977 50  0000 C CNN
F 2 "" H 9100 3150 50  0001 C CNN
F 3 "" H 9100 3150 50  0001 C CNN
	1    9100 3150
	1    0    0    -1  
$EndComp
Wire Wire Line
	9300 3150 9200 3150
Wire Wire Line
	9200 3150 9100 3150
Connection ~ 9200 3150
Connection ~ 9100 3150
Text GLabel 9750 2400 2    50   Input ~ 0
LORA_DIO1
Text GLabel 8650 2850 0    50   Input ~ 0
A3
Text GLabel 2750 2700 2    50   Input ~ 0
A2
Text GLabel 2750 2500 2    50   Input ~ 0
A4
Text GLabel 10450 4250 0    50   Input ~ 0
12
Text GLabel 9950 4250 0    50   Input ~ 0
9
Text GLabel 4200 4850 0    50   Input ~ 0
11
Text Notes 8950 1200 0    79   ~ 0
avoid D10, CS for adalogger;\navoid D6, input only for Feather S2
$Comp
L device:Jumper_NO_Small JP1
U 1 1 608EF379
P 10450 1750
F 0 "JP1" H 10450 1935 50  0000 C CNN
F 1 "Jumper_NO_Small" H 10450 1844 50  0000 C CNN
F 2 "Jumper:SolderJumper-2_P1.3mm_Open_TrianglePad1.0x1.5mm" H 10450 1750 50  0001 C CNN
F 3 "" H 10450 1750 50  0001 C CNN
	1    10450 1750
	1    0    0    -1  
$EndComp
Text GLabel 10350 1750 0    50   Input ~ 0
A1
Text GLabel 2750 2900 2    50   Input ~ 0
A0
Text GLabel 4100 1400 0    50   Input ~ 0
TX1
Text GLabel 4100 1500 0    50   Input ~ 0
RX0
$Comp
L Connector:Conn_01x01_Female J5
U 1 1 609682ED
P 8350 1800
F 0 "J5" V 8288 1712 50  0000 R CNN
F 1 "Conn_01x01_Female" V 8197 1712 50  0000 R CNN
F 2 "Connector_PinSocket_2.54mm:PinSocket_1x01_P2.54mm_Vertical" H 8350 1800 50  0001 C CNN
F 3 "~" H 8350 1800 50  0001 C CNN
	1    8350 1800
	0    -1   -1   0   
$EndComp
Wire Wire Line
	8650 2150 8350 2150
Wire Wire Line
	8350 2150 8350 2000
Text GLabel 10550 1750 2    50   Input ~ 0
LORA_DIO1
$Comp
L power:+3V3 #PWR0104
U 1 1 60954B2C
P 9200 1950
F 0 "#PWR0104" H 9200 1800 50  0001 C CNN
F 1 "+3V3" V 9215 2078 50  0000 L CNN
F 2 "" H 9200 1950 50  0001 C CNN
F 3 "" H 9200 1950 50  0001 C CNN
	1    9200 1950
	1    0    0    -1  
$EndComp
Text GLabel 2750 2800 2    50   Input ~ 0
A1
Text GLabel 2750 2400 2    50   Input ~ 0
A5
Text GLabel 9450 4250 2    50   Input ~ 0
A5
Text GLabel 8650 2350 0    50   Input ~ 0
A4
Text GLabel 2750 2600 2    50   Input ~ 0
A3
Text GLabel 9750 2300 2    50   Input ~ 0
A2
$Comp
L Connector:Conn_01x09_Female J2
U 1 1 60A72842
P 4300 1400
F 0 "J2" H 4328 1426 50  0000 L CNN
F 1 "Conn_01x09_Female" H 4328 1335 50  0000 L CNN
F 2 "Connector_PinSocket_2.54mm:PinSocket_1x09_P2.54mm_Vertical" H 4300 1400 50  0001 C CNN
F 3 "~" H 4300 1400 50  0001 C CNN
	1    4300 1400
	1    0    0    -1  
$EndComp
$EndSCHEMATC
