%TF.GenerationSoftware,KiCad,Pcbnew,5.1.9-73d0e3b20d~88~ubuntu18.04.1*%
%TF.CreationDate,2021-04-01T20:13:12-04:00*%
%TF.ProjectId,remote,72656d6f-7465-42e6-9b69-6361645f7063,rev?*%
%TF.SameCoordinates,Original*%
%TF.FileFunction,Legend,Bot*%
%TF.FilePolarity,Positive*%
%FSLAX46Y46*%
G04 Gerber Fmt 4.6, Leading zero omitted, Abs format (unit mm)*
G04 Created by KiCad (PCBNEW 5.1.9-73d0e3b20d~88~ubuntu18.04.1) date 2021-04-01 20:13:12*
%MOMM*%
%LPD*%
G01*
G04 APERTURE LIST*
%ADD10C,0.150000*%
%ADD11C,0.300000*%
%ADD12C,0.120000*%
G04 APERTURE END LIST*
D10*
X3373285Y-82716714D02*
X3373285Y-83716714D01*
X3373285Y-83335761D02*
X3468523Y-83383380D01*
X3659000Y-83383380D01*
X3754238Y-83335761D01*
X3801857Y-83288142D01*
X3849476Y-83192904D01*
X3849476Y-82907190D01*
X3801857Y-82811952D01*
X3754238Y-82764333D01*
X3659000Y-82716714D01*
X3468523Y-82716714D01*
X3373285Y-82764333D01*
X2992333Y-82716714D02*
X2801857Y-83383380D01*
X2611380Y-82907190D01*
X2420904Y-83383380D01*
X2230428Y-82716714D01*
X1849476Y-83383380D02*
X1849476Y-82716714D01*
X1849476Y-82383380D02*
X1897095Y-82431000D01*
X1849476Y-82478619D01*
X1801857Y-82431000D01*
X1849476Y-82383380D01*
X1849476Y-82478619D01*
X1373285Y-83383380D02*
X1373285Y-82716714D01*
X1373285Y-82383380D02*
X1420904Y-82431000D01*
X1373285Y-82478619D01*
X1325666Y-82431000D01*
X1373285Y-82383380D01*
X1373285Y-82478619D01*
X468523Y-83335761D02*
X563761Y-83383380D01*
X754238Y-83383380D01*
X849476Y-83335761D01*
X897095Y-83288142D01*
X944714Y-83192904D01*
X944714Y-82907190D01*
X897095Y-82811952D01*
X849476Y-82764333D01*
X754238Y-82716714D01*
X563761Y-82716714D01*
X468523Y-82764333D01*
X33557071Y-32919142D02*
X33557071Y-32019142D01*
X33042785Y-32919142D01*
X33042785Y-32019142D01*
X32442785Y-32019142D02*
X32271357Y-32019142D01*
X32185642Y-32062000D01*
X32099928Y-32147714D01*
X32057071Y-32319142D01*
X32057071Y-32619142D01*
X32099928Y-32790571D01*
X32185642Y-32876285D01*
X32271357Y-32919142D01*
X32442785Y-32919142D01*
X32528500Y-32876285D01*
X32614214Y-32790571D01*
X32657071Y-32619142D01*
X32657071Y-32319142D01*
X32614214Y-32147714D01*
X32528500Y-32062000D01*
X32442785Y-32019142D01*
X31671357Y-32919142D02*
X31671357Y-32019142D01*
X31457071Y-32019142D01*
X31328500Y-32062000D01*
X31242785Y-32147714D01*
X31199928Y-32233428D01*
X31157071Y-32404857D01*
X31157071Y-32533428D01*
X31199928Y-32704857D01*
X31242785Y-32790571D01*
X31328500Y-32876285D01*
X31457071Y-32919142D01*
X31671357Y-32919142D01*
X30771357Y-32447714D02*
X30471357Y-32447714D01*
X30342785Y-32919142D02*
X30771357Y-32919142D01*
X30771357Y-32019142D01*
X30342785Y-32019142D01*
X29314214Y-32319142D02*
X28671357Y-32319142D01*
X29057071Y-31933428D02*
X29314214Y-33090571D01*
X28757071Y-32704857D02*
X29399928Y-32704857D01*
X29014214Y-33090571D02*
X28757071Y-31933428D01*
X30140357Y-92853285D02*
X30140357Y-92281857D01*
X30711785Y-92224714D01*
X30654642Y-92281857D01*
X30597500Y-92396142D01*
X30597500Y-92681857D01*
X30654642Y-92796142D01*
X30711785Y-92853285D01*
X30826071Y-92910428D01*
X31111785Y-92910428D01*
X31226071Y-92853285D01*
X31283214Y-92796142D01*
X31340357Y-92681857D01*
X31340357Y-92396142D01*
X31283214Y-92281857D01*
X31226071Y-92224714D01*
X30140357Y-93253285D02*
X31340357Y-93653285D01*
X30140357Y-94053285D01*
X31340357Y-95367571D02*
X30140357Y-95367571D01*
X31340357Y-95939000D02*
X30140357Y-95939000D01*
X31340357Y-96624714D01*
X30140357Y-96624714D01*
X31340357Y-97196142D02*
X30140357Y-97196142D01*
X30140357Y-97653285D01*
X30197500Y-97767571D01*
X30254642Y-97824714D01*
X30368928Y-97881857D01*
X30540357Y-97881857D01*
X30654642Y-97824714D01*
X30711785Y-97767571D01*
X30768928Y-97653285D01*
X30768928Y-97196142D01*
X30140357Y-98396142D02*
X31111785Y-98396142D01*
X31226071Y-98453285D01*
X31283214Y-98510428D01*
X31340357Y-98624714D01*
X31340357Y-98853285D01*
X31283214Y-98967571D01*
X31226071Y-99024714D01*
X31111785Y-99081857D01*
X30140357Y-99081857D01*
X30140357Y-99481857D02*
X30140357Y-100167571D01*
X31340357Y-99824714D02*
X30140357Y-99824714D01*
X14160166Y-34932880D02*
X14636357Y-34932880D01*
X14636357Y-33932880D01*
X13636357Y-33932880D02*
X13445880Y-33932880D01*
X13350642Y-33980500D01*
X13255404Y-34075738D01*
X13207785Y-34266214D01*
X13207785Y-34599547D01*
X13255404Y-34790023D01*
X13350642Y-34885261D01*
X13445880Y-34932880D01*
X13636357Y-34932880D01*
X13731595Y-34885261D01*
X13826833Y-34790023D01*
X13874452Y-34599547D01*
X13874452Y-34266214D01*
X13826833Y-34075738D01*
X13731595Y-33980500D01*
X13636357Y-33932880D01*
X12207785Y-34932880D02*
X12541119Y-34456690D01*
X12779214Y-34932880D02*
X12779214Y-33932880D01*
X12398261Y-33932880D01*
X12303023Y-33980500D01*
X12255404Y-34028119D01*
X12207785Y-34123357D01*
X12207785Y-34266214D01*
X12255404Y-34361452D01*
X12303023Y-34409071D01*
X12398261Y-34456690D01*
X12779214Y-34456690D01*
X11826833Y-34647166D02*
X11350642Y-34647166D01*
X11922071Y-34932880D02*
X11588738Y-33932880D01*
X11255404Y-34932880D01*
X11017309Y-33932880D02*
X10779214Y-34932880D01*
X10588738Y-34218595D01*
X10398261Y-34932880D01*
X10160166Y-33932880D01*
X9826833Y-34647166D02*
X9350642Y-34647166D01*
X9922071Y-34932880D02*
X9588738Y-33932880D01*
X9255404Y-34932880D01*
X8922071Y-34932880D02*
X8922071Y-33932880D01*
X8350642Y-34932880D01*
X8350642Y-33932880D01*
X-2841714Y-15660666D02*
X-3317904Y-15660666D01*
X-2746476Y-15946380D02*
X-3079809Y-14946380D01*
X-3413142Y-15946380D01*
X-4270285Y-15946380D02*
X-3698857Y-15946380D01*
X-3984571Y-15946380D02*
X-3984571Y-14946380D01*
X-3889333Y-15089238D01*
X-3794095Y-15184476D01*
X-3698857Y-15232095D01*
X-2841714Y-13120666D02*
X-3317904Y-13120666D01*
X-2746476Y-13406380D02*
X-3079809Y-12406380D01*
X-3413142Y-13406380D01*
X-3936952Y-12406380D02*
X-4032190Y-12406380D01*
X-4127428Y-12454000D01*
X-4175047Y-12501619D01*
X-4222666Y-12596857D01*
X-4270285Y-12787333D01*
X-4270285Y-13025428D01*
X-4222666Y-13215904D01*
X-4175047Y-13311142D01*
X-4127428Y-13358761D01*
X-4032190Y-13406380D01*
X-3936952Y-13406380D01*
X-3841714Y-13358761D01*
X-3794095Y-13311142D01*
X-3746476Y-13215904D01*
X-3698857Y-13025428D01*
X-3698857Y-12787333D01*
X-3746476Y-12596857D01*
X-3794095Y-12501619D01*
X-3841714Y-12454000D01*
X-3936952Y-12406380D01*
X-2841714Y-18200666D02*
X-3317904Y-18200666D01*
X-2746476Y-18486380D02*
X-3079809Y-17486380D01*
X-3413142Y-18486380D01*
X-3698857Y-17581619D02*
X-3746476Y-17534000D01*
X-3841714Y-17486380D01*
X-4079809Y-17486380D01*
X-4175047Y-17534000D01*
X-4222666Y-17581619D01*
X-4270285Y-17676857D01*
X-4270285Y-17772095D01*
X-4222666Y-17914952D01*
X-3651238Y-18486380D01*
X-4270285Y-18486380D01*
D11*
X31366470Y4404801D02*
X31366470Y6604801D01*
X30633137Y5033373D01*
X29899803Y6604801D01*
X29899803Y4404801D01*
X28537899Y4404801D02*
X28747422Y4509563D01*
X28852184Y4614325D01*
X28956946Y4823849D01*
X28956946Y5452420D01*
X28852184Y5661944D01*
X28747422Y5766706D01*
X28537899Y5871468D01*
X28223613Y5871468D01*
X28014089Y5766706D01*
X27909327Y5661944D01*
X27804565Y5452420D01*
X27804565Y4823849D01*
X27909327Y4614325D01*
X28014089Y4509563D01*
X28223613Y4404801D01*
X28537899Y4404801D01*
X26861708Y5871468D02*
X26861708Y4404801D01*
X26861708Y5661944D02*
X26756946Y5766706D01*
X26547422Y5871468D01*
X26233137Y5871468D01*
X26023613Y5766706D01*
X25918851Y5557182D01*
X25918851Y4404801D01*
X24871232Y4404801D02*
X24871232Y5871468D01*
X24871232Y6604801D02*
X24975994Y6500040D01*
X24871232Y6395278D01*
X24766470Y6500040D01*
X24871232Y6604801D01*
X24871232Y6395278D01*
X24137899Y5871468D02*
X23299803Y5871468D01*
X23823613Y6604801D02*
X23823613Y4719087D01*
X23718851Y4509563D01*
X23509327Y4404801D01*
X23299803Y4404801D01*
X22252184Y4404801D02*
X22461708Y4509563D01*
X22566470Y4614325D01*
X22671232Y4823849D01*
X22671232Y5452420D01*
X22566470Y5661944D01*
X22461708Y5766706D01*
X22252184Y5871468D01*
X21937899Y5871468D01*
X21728375Y5766706D01*
X21623613Y5661944D01*
X21518851Y5452420D01*
X21518851Y4823849D01*
X21623613Y4614325D01*
X21728375Y4509563D01*
X21937899Y4404801D01*
X22252184Y4404801D01*
X20575994Y4404801D02*
X20575994Y5871468D01*
X20575994Y5452420D02*
X20471232Y5661944D01*
X20366470Y5766706D01*
X20156946Y5871468D01*
X19947422Y5871468D01*
D10*
X17269928Y5901428D02*
X17269928Y5615714D01*
X16698500Y5901428D02*
X16698500Y5615714D01*
X15198500Y4401428D02*
X15698500Y5115714D01*
X16055642Y4401428D02*
X16055642Y5901428D01*
X15484214Y5901428D01*
X15341357Y5830000D01*
X15269928Y5758571D01*
X15198500Y5615714D01*
X15198500Y5401428D01*
X15269928Y5258571D01*
X15341357Y5187142D01*
X15484214Y5115714D01*
X16055642Y5115714D01*
X14555642Y5187142D02*
X14055642Y5187142D01*
X13841357Y4401428D02*
X14555642Y4401428D01*
X14555642Y5901428D01*
X13841357Y5901428D01*
X13412785Y5901428D02*
X12912785Y4401428D01*
X12412785Y5901428D01*
X10341357Y5901428D02*
X10341357Y4830000D01*
X10412785Y4615714D01*
X10555642Y4472857D01*
X10769928Y4401428D01*
X10912785Y4401428D01*
X9698500Y5901428D02*
X9698500Y5615714D01*
X9127071Y5901428D02*
X9127071Y5615714D01*
D11*
X37648047Y4614325D02*
X37752809Y4509563D01*
X38067095Y4404801D01*
X38276619Y4404801D01*
X38590904Y4509563D01*
X38800428Y4719087D01*
X38905190Y4928611D01*
X39009952Y5347659D01*
X39009952Y5661944D01*
X38905190Y6080992D01*
X38800428Y6290516D01*
X38590904Y6500040D01*
X38276619Y6604801D01*
X38067095Y6604801D01*
X37752809Y6500040D01*
X37648047Y6395278D01*
X36286142Y6604801D02*
X35867095Y6604801D01*
X35657571Y6500040D01*
X35448047Y6290516D01*
X35343285Y5871468D01*
X35343285Y5138135D01*
X35448047Y4719087D01*
X35657571Y4509563D01*
X35867095Y4404801D01*
X36286142Y4404801D01*
X36495666Y4509563D01*
X36705190Y4719087D01*
X36809952Y5138135D01*
X36809952Y5871468D01*
X36705190Y6290516D01*
X36495666Y6500040D01*
X36286142Y6604801D01*
X34505190Y6395278D02*
X34400428Y6500040D01*
X34190904Y6604801D01*
X33667095Y6604801D01*
X33457571Y6500040D01*
X33352809Y6395278D01*
X33248047Y6185754D01*
X33248047Y5976230D01*
X33352809Y5661944D01*
X34609952Y4404801D01*
X33248047Y4404801D01*
D10*
X-3048095Y-25281000D02*
X-2952857Y-25233380D01*
X-2810000Y-25233380D01*
X-2667142Y-25281000D01*
X-2571904Y-25376238D01*
X-2524285Y-25471476D01*
X-2476666Y-25661952D01*
X-2476666Y-25804809D01*
X-2524285Y-25995285D01*
X-2571904Y-26090523D01*
X-2667142Y-26185761D01*
X-2810000Y-26233380D01*
X-2905238Y-26233380D01*
X-3048095Y-26185761D01*
X-3095714Y-26138142D01*
X-3095714Y-25804809D01*
X-2905238Y-25804809D01*
X-3524285Y-26233380D02*
X-3524285Y-25233380D01*
X-4095714Y-26233380D01*
X-4095714Y-25233380D01*
X-4571904Y-26233380D02*
X-4571904Y-25233380D01*
X-4810000Y-25233380D01*
X-4952857Y-25281000D01*
X-5048095Y-25376238D01*
X-5095714Y-25471476D01*
X-5143333Y-25661952D01*
X-5143333Y-25804809D01*
X-5095714Y-25995285D01*
X-5048095Y-26090523D01*
X-4952857Y-26185761D01*
X-4810000Y-26233380D01*
X-4571904Y-26233380D01*
X46359714Y-38455428D02*
X45159714Y-38455428D01*
X46359714Y-39226857D02*
X45416857Y-39226857D01*
X45245428Y-39141142D01*
X45159714Y-38969714D01*
X45159714Y-38712571D01*
X45245428Y-38541142D01*
X45331142Y-38455428D01*
X45245428Y-37684000D02*
X45159714Y-37426857D01*
X45159714Y-36998285D01*
X45245428Y-36826857D01*
X45331142Y-36741142D01*
X45502571Y-36655428D01*
X45674000Y-36655428D01*
X45845428Y-36741142D01*
X45931142Y-36826857D01*
X46016857Y-36998285D01*
X46102571Y-37341142D01*
X46188285Y-37512571D01*
X46274000Y-37598285D01*
X46445428Y-37684000D01*
X46616857Y-37684000D01*
X46788285Y-37598285D01*
X46874000Y-37512571D01*
X46959714Y-37341142D01*
X46959714Y-36912571D01*
X46874000Y-36655428D01*
X45159714Y-35884000D02*
X46959714Y-35884000D01*
X46959714Y-35455428D01*
X46874000Y-35198285D01*
X46702571Y-35026857D01*
X46531142Y-34941142D01*
X46188285Y-34855428D01*
X45931142Y-34855428D01*
X45588285Y-34941142D01*
X45416857Y-35026857D01*
X45245428Y-35198285D01*
X45159714Y-35455428D01*
X45159714Y-35884000D01*
D12*
X10495280Y-3360680D02*
X37825680Y-3360680D01*
X10495280Y-3360680D02*
X10495280Y1849120D01*
X10495280Y1849120D02*
X10673080Y1849120D01*
X37800280Y-3357880D02*
X37800280Y1849120D01*
D10*
X36894237Y-2366251D02*
X36894237Y-866251D01*
X36251380Y-2366251D02*
X36251380Y-1580537D01*
X36322808Y-1437680D01*
X36465665Y-1366251D01*
X36679951Y-1366251D01*
X36822808Y-1437680D01*
X36894237Y-1509108D01*
X35751380Y-1366251D02*
X35179951Y-1366251D01*
X35537094Y-866251D02*
X35537094Y-2151965D01*
X35465665Y-2294822D01*
X35322808Y-2366251D01*
X35179951Y-2366251D01*
X34894237Y-1366251D02*
X34322808Y-1366251D01*
X34679951Y-866251D02*
X34679951Y-2151965D01*
X34608522Y-2294822D01*
X34465665Y-2366251D01*
X34322808Y-2366251D01*
X33822808Y-1366251D02*
X33822808Y-2866251D01*
X33822808Y-1437680D02*
X33679951Y-1366251D01*
X33394237Y-1366251D01*
X33251379Y-1437680D01*
X33179951Y-1509108D01*
X33108522Y-1651965D01*
X33108522Y-2080537D01*
X33179951Y-2223394D01*
X33251379Y-2294822D01*
X33394237Y-2366251D01*
X33679951Y-2366251D01*
X33822808Y-2294822D01*
X32465665Y-2223394D02*
X32394237Y-2294822D01*
X32465665Y-2366251D01*
X32537094Y-2294822D01*
X32465665Y-2223394D01*
X32465665Y-2366251D01*
X32465665Y-1437680D02*
X32394237Y-1509108D01*
X32465665Y-1580537D01*
X32537094Y-1509108D01*
X32465665Y-1437680D01*
X32465665Y-1580537D01*
X30679951Y-794822D02*
X31965665Y-2723394D01*
X29108522Y-794822D02*
X30394237Y-2723394D01*
X28608522Y-1366251D02*
X28608522Y-2866251D01*
X28608522Y-1437680D02*
X28465665Y-1366251D01*
X28179951Y-1366251D01*
X28037094Y-1437680D01*
X27965665Y-1509108D01*
X27894237Y-1651965D01*
X27894237Y-2080537D01*
X27965665Y-2223394D01*
X28037094Y-2294822D01*
X28179951Y-2366251D01*
X28465665Y-2366251D01*
X28608522Y-2294822D01*
X27394237Y-1366251D02*
X27037094Y-2366251D01*
X26679951Y-1366251D01*
X25894237Y-2366251D02*
X26037094Y-2294822D01*
X26108522Y-2223394D01*
X26179951Y-2080537D01*
X26179951Y-1651965D01*
X26108522Y-1509108D01*
X26037094Y-1437680D01*
X25894237Y-1366251D01*
X25679951Y-1366251D01*
X25537094Y-1437680D01*
X25465665Y-1509108D01*
X25394237Y-1651965D01*
X25394237Y-2080537D01*
X25465665Y-2223394D01*
X25537094Y-2294822D01*
X25679951Y-2366251D01*
X25894237Y-2366251D01*
X24822808Y-2294822D02*
X24679951Y-2366251D01*
X24394237Y-2366251D01*
X24251380Y-2294822D01*
X24179951Y-2151965D01*
X24179951Y-2080537D01*
X24251380Y-1937680D01*
X24394237Y-1866251D01*
X24608522Y-1866251D01*
X24751380Y-1794822D01*
X24822808Y-1651965D01*
X24822808Y-1580537D01*
X24751380Y-1437680D01*
X24608522Y-1366251D01*
X24394237Y-1366251D01*
X24251380Y-1437680D01*
X23537094Y-2223394D02*
X23465665Y-2294822D01*
X23537094Y-2366251D01*
X23608522Y-2294822D01*
X23537094Y-2223394D01*
X23537094Y-2366251D01*
X22608522Y-2366251D02*
X22751380Y-2294822D01*
X22822808Y-2223394D01*
X22894237Y-2080537D01*
X22894237Y-1651965D01*
X22822808Y-1509108D01*
X22751380Y-1437680D01*
X22608522Y-1366251D01*
X22394237Y-1366251D01*
X22251380Y-1437680D01*
X22179951Y-1509108D01*
X22108522Y-1651965D01*
X22108522Y-2080537D01*
X22179951Y-2223394D01*
X22251380Y-2294822D01*
X22394237Y-2366251D01*
X22608522Y-2366251D01*
X21465665Y-2366251D02*
X21465665Y-1366251D01*
X21465665Y-1651965D02*
X21394237Y-1509108D01*
X21322808Y-1437680D01*
X21179951Y-1366251D01*
X21037094Y-1366251D01*
X19894237Y-1366251D02*
X19894237Y-2580537D01*
X19965665Y-2723394D01*
X20037094Y-2794822D01*
X20179951Y-2866251D01*
X20394237Y-2866251D01*
X20537094Y-2794822D01*
X19894237Y-2294822D02*
X20037094Y-2366251D01*
X20322808Y-2366251D01*
X20465665Y-2294822D01*
X20537094Y-2223394D01*
X20608522Y-2080537D01*
X20608522Y-1651965D01*
X20537094Y-1509108D01*
X20465665Y-1437680D01*
X20322808Y-1366251D01*
X20037094Y-1366251D01*
X19894237Y-1437680D01*
X18108522Y-794822D02*
X19394237Y-2723394D01*
X16965665Y-2294822D02*
X17108522Y-2366251D01*
X17394237Y-2366251D01*
X17537094Y-2294822D01*
X17608522Y-2223394D01*
X17679951Y-2080537D01*
X17679951Y-1651965D01*
X17608522Y-1509108D01*
X17537094Y-1437680D01*
X17394237Y-1366251D01*
X17108522Y-1366251D01*
X16965665Y-1437680D01*
X16108522Y-2366251D02*
X16251380Y-2294822D01*
X16322808Y-2223394D01*
X16394237Y-2080537D01*
X16394237Y-1651965D01*
X16322808Y-1509108D01*
X16251380Y-1437680D01*
X16108522Y-1366251D01*
X15894237Y-1366251D01*
X15751380Y-1437680D01*
X15679951Y-1509108D01*
X15608522Y-1651965D01*
X15608522Y-2080537D01*
X15679951Y-2223394D01*
X15751380Y-2294822D01*
X15894237Y-2366251D01*
X16108522Y-2366251D01*
X15037094Y-1009108D02*
X14965665Y-937680D01*
X14822808Y-866251D01*
X14465665Y-866251D01*
X14322808Y-937680D01*
X14251380Y-1009108D01*
X14179951Y-1151965D01*
X14179951Y-1294822D01*
X14251380Y-1509108D01*
X15108522Y-2366251D01*
X14179951Y-2366251D01*
X12465665Y-794822D02*
X13751380Y-2723394D01*
X11965665Y-1366251D02*
X11965665Y-2651965D01*
X12037094Y-2794822D01*
X12179951Y-2866251D01*
X12251380Y-2866251D01*
X11965665Y-866251D02*
X12037094Y-937680D01*
X11965665Y-1009108D01*
X11894237Y-937680D01*
X11965665Y-866251D01*
X11965665Y-1009108D01*
X35454595Y1110380D02*
X35454595Y219904D01*
X35402214Y115142D01*
X35349833Y62761D01*
X35245071Y10380D01*
X35035547Y10380D01*
X34930785Y62761D01*
X34878404Y115142D01*
X34826023Y219904D01*
X34826023Y1110380D01*
X34354595Y62761D02*
X34249833Y10380D01*
X34040309Y10380D01*
X33935547Y62761D01*
X33883166Y167523D01*
X33883166Y219904D01*
X33935547Y324666D01*
X34040309Y377047D01*
X34197452Y377047D01*
X34302214Y429428D01*
X34354595Y534190D01*
X34354595Y586571D01*
X34302214Y691333D01*
X34197452Y743714D01*
X34040309Y743714D01*
X33935547Y691333D01*
X32940309Y10380D02*
X32940309Y586571D01*
X32992690Y691333D01*
X33097452Y743714D01*
X33306976Y743714D01*
X33411738Y691333D01*
X32940309Y62761D02*
X33045071Y10380D01*
X33306976Y10380D01*
X33411738Y62761D01*
X33464119Y167523D01*
X33464119Y272285D01*
X33411738Y377047D01*
X33306976Y429428D01*
X33045071Y429428D01*
X32940309Y481809D01*
X31945071Y743714D02*
X31945071Y-146761D01*
X31997452Y-251523D01*
X32049833Y-303904D01*
X32154595Y-356285D01*
X32311738Y-356285D01*
X32416500Y-303904D01*
X31945071Y62761D02*
X32049833Y10380D01*
X32259357Y10380D01*
X32364119Y62761D01*
X32416500Y115142D01*
X32468880Y219904D01*
X32468880Y534190D01*
X32416500Y638952D01*
X32364119Y691333D01*
X32259357Y743714D01*
X32049833Y743714D01*
X31945071Y691333D01*
X31002214Y62761D02*
X31106976Y10380D01*
X31316500Y10380D01*
X31421261Y62761D01*
X31473642Y167523D01*
X31473642Y586571D01*
X31421261Y691333D01*
X31316500Y743714D01*
X31106976Y743714D01*
X31002214Y691333D01*
X30949833Y586571D01*
X30949833Y481809D01*
X31473642Y377047D01*
X28749833Y10380D02*
X28802214Y10380D01*
X28906976Y62761D01*
X29064119Y219904D01*
X29326023Y534190D01*
X29430785Y691333D01*
X29483166Y848476D01*
X29483166Y953238D01*
X29430785Y1058000D01*
X29326023Y1110380D01*
X29273642Y1110380D01*
X29168880Y1058000D01*
X29116500Y953238D01*
X29116500Y900857D01*
X29168880Y796095D01*
X29221261Y743714D01*
X29535547Y534190D01*
X29587928Y481809D01*
X29640309Y377047D01*
X29640309Y219904D01*
X29587928Y115142D01*
X29535547Y62761D01*
X29430785Y10380D01*
X29273642Y10380D01*
X29168880Y62761D01*
X29116500Y115142D01*
X28959357Y324666D01*
X28906976Y481809D01*
X28906976Y586571D01*
X27492690Y324666D02*
X26968880Y324666D01*
X27597452Y10380D02*
X27230785Y1110380D01*
X26864119Y10380D01*
X26549833Y62761D02*
X26445071Y10380D01*
X26235547Y10380D01*
X26130785Y62761D01*
X26078404Y167523D01*
X26078404Y219904D01*
X26130785Y324666D01*
X26235547Y377047D01*
X26392690Y377047D01*
X26497452Y429428D01*
X26549833Y534190D01*
X26549833Y586571D01*
X26497452Y691333D01*
X26392690Y743714D01*
X26235547Y743714D01*
X26130785Y691333D01*
X25659357Y62761D02*
X25554595Y10380D01*
X25345071Y10380D01*
X25240309Y62761D01*
X25187928Y167523D01*
X25187928Y219904D01*
X25240309Y324666D01*
X25345071Y377047D01*
X25502214Y377047D01*
X25606976Y429428D01*
X25659357Y534190D01*
X25659357Y586571D01*
X25606976Y691333D01*
X25502214Y743714D01*
X25345071Y743714D01*
X25240309Y691333D01*
X24297452Y62761D02*
X24402214Y10380D01*
X24611738Y10380D01*
X24716500Y62761D01*
X24768880Y167523D01*
X24768880Y586571D01*
X24716500Y691333D01*
X24611738Y743714D01*
X24402214Y743714D01*
X24297452Y691333D01*
X24245071Y586571D01*
X24245071Y481809D01*
X24768880Y377047D01*
X23773642Y10380D02*
X23773642Y743714D01*
X23773642Y638952D02*
X23721261Y691333D01*
X23616500Y743714D01*
X23459357Y743714D01*
X23354595Y691333D01*
X23302214Y586571D01*
X23302214Y10380D01*
X23302214Y586571D02*
X23249833Y691333D01*
X23145071Y743714D01*
X22987928Y743714D01*
X22883166Y691333D01*
X22830785Y586571D01*
X22830785Y10380D01*
X22306976Y10380D02*
X22306976Y1110380D01*
X22306976Y691333D02*
X22202214Y743714D01*
X21992690Y743714D01*
X21887928Y691333D01*
X21835547Y638952D01*
X21783166Y534190D01*
X21783166Y219904D01*
X21835547Y115142D01*
X21887928Y62761D01*
X21992690Y10380D01*
X22202214Y10380D01*
X22306976Y62761D01*
X21154595Y10380D02*
X21259357Y62761D01*
X21311738Y167523D01*
X21311738Y1110380D01*
X20840309Y743714D02*
X20578404Y10380D01*
X20316500Y743714D02*
X20578404Y10380D01*
X20683166Y-251523D01*
X20735547Y-303904D01*
X20840309Y-356285D01*
X18483166Y1058000D02*
X18587928Y1110380D01*
X18745071Y1110380D01*
X18902214Y1058000D01*
X19006976Y953238D01*
X19059357Y848476D01*
X19111738Y638952D01*
X19111738Y481809D01*
X19059357Y272285D01*
X19006976Y167523D01*
X18902214Y62761D01*
X18745071Y10380D01*
X18640309Y10380D01*
X18483166Y62761D01*
X18430785Y115142D01*
X18430785Y481809D01*
X18640309Y481809D01*
X17487928Y743714D02*
X17487928Y10380D01*
X17959357Y743714D02*
X17959357Y167523D01*
X17906976Y62761D01*
X17802214Y10380D01*
X17645071Y10380D01*
X17540309Y62761D01*
X17487928Y115142D01*
X16964119Y10380D02*
X16964119Y743714D01*
X16964119Y1110380D02*
X17016500Y1058000D01*
X16964119Y1005619D01*
X16911738Y1058000D01*
X16964119Y1110380D01*
X16964119Y1005619D01*
X15968880Y10380D02*
X15968880Y1110380D01*
X15968880Y62761D02*
X16073642Y10380D01*
X16283166Y10380D01*
X16387928Y62761D01*
X16440309Y115142D01*
X16492690Y219904D01*
X16492690Y534190D01*
X16440309Y638952D01*
X16387928Y691333D01*
X16283166Y743714D01*
X16073642Y743714D01*
X15968880Y691333D01*
X15026023Y62761D02*
X15130785Y10380D01*
X15340309Y10380D01*
X15445071Y62761D01*
X15497452Y167523D01*
X15497452Y586571D01*
X15445071Y691333D01*
X15340309Y743714D01*
X15130785Y743714D01*
X15026023Y691333D01*
X14973642Y586571D01*
X14973642Y481809D01*
X15497452Y377047D01*
X14554595Y62761D02*
X14449833Y10380D01*
X14240309Y10380D01*
X14135547Y62761D01*
X14083166Y167523D01*
X14083166Y219904D01*
X14135547Y324666D01*
X14240309Y377047D01*
X14397452Y377047D01*
X14502214Y429428D01*
X14554595Y534190D01*
X14554595Y586571D01*
X14502214Y691333D01*
X14397452Y743714D01*
X14240309Y743714D01*
X14135547Y691333D01*
X13611738Y115142D02*
X13559357Y62761D01*
X13611738Y10380D01*
X13664119Y62761D01*
X13611738Y115142D01*
X13611738Y10380D01*
X13611738Y691333D02*
X13559357Y638952D01*
X13611738Y586571D01*
X13664119Y638952D01*
X13611738Y691333D01*
X13611738Y586571D01*
D12*
X37825680Y1839320D02*
X10520680Y1839320D01*
D10*
X34414785Y15763942D02*
X34414785Y16963942D01*
X33900500Y15763942D02*
X33900500Y16392514D01*
X33957642Y16506800D01*
X34071928Y16563942D01*
X34243357Y16563942D01*
X34357642Y16506800D01*
X34414785Y16449657D01*
X33500500Y16563942D02*
X33043357Y16563942D01*
X33329071Y16963942D02*
X33329071Y15935371D01*
X33271928Y15821085D01*
X33157642Y15763942D01*
X33043357Y15763942D01*
X32814785Y16563942D02*
X32357642Y16563942D01*
X32643357Y16963942D02*
X32643357Y15935371D01*
X32586214Y15821085D01*
X32471928Y15763942D01*
X32357642Y15763942D01*
X31957642Y16563942D02*
X31957642Y15363942D01*
X31957642Y16506800D02*
X31843357Y16563942D01*
X31614785Y16563942D01*
X31500499Y16506800D01*
X31443357Y16449657D01*
X31386214Y16335371D01*
X31386214Y15992514D01*
X31443357Y15878228D01*
X31500499Y15821085D01*
X31614785Y15763942D01*
X31843357Y15763942D01*
X31957642Y15821085D01*
X30871928Y15878228D02*
X30814785Y15821085D01*
X30871928Y15763942D01*
X30929071Y15821085D01*
X30871928Y15878228D01*
X30871928Y15763942D01*
X30871928Y16506800D02*
X30814785Y16449657D01*
X30871928Y16392514D01*
X30929071Y16449657D01*
X30871928Y16506800D01*
X30871928Y16392514D01*
X29443357Y17021085D02*
X30471928Y15478228D01*
X28186214Y17021085D02*
X29214785Y15478228D01*
X27786214Y16563942D02*
X27786214Y15363942D01*
X27786214Y16506800D02*
X27671928Y16563942D01*
X27443357Y16563942D01*
X27329071Y16506800D01*
X27271928Y16449657D01*
X27214785Y16335371D01*
X27214785Y15992514D01*
X27271928Y15878228D01*
X27329071Y15821085D01*
X27443357Y15763942D01*
X27671928Y15763942D01*
X27786214Y15821085D01*
X26814785Y16563942D02*
X26529071Y15763942D01*
X26243357Y16563942D01*
X25614785Y15763942D02*
X25729071Y15821085D01*
X25786214Y15878228D01*
X25843357Y15992514D01*
X25843357Y16335371D01*
X25786214Y16449657D01*
X25729071Y16506800D01*
X25614785Y16563942D01*
X25443357Y16563942D01*
X25329071Y16506800D01*
X25271928Y16449657D01*
X25214785Y16335371D01*
X25214785Y15992514D01*
X25271928Y15878228D01*
X25329071Y15821085D01*
X25443357Y15763942D01*
X25614785Y15763942D01*
X24757642Y15821085D02*
X24643357Y15763942D01*
X24414785Y15763942D01*
X24300499Y15821085D01*
X24243357Y15935371D01*
X24243357Y15992514D01*
X24300499Y16106800D01*
X24414785Y16163942D01*
X24586214Y16163942D01*
X24700499Y16221085D01*
X24757642Y16335371D01*
X24757642Y16392514D01*
X24700499Y16506800D01*
X24586214Y16563942D01*
X24414785Y16563942D01*
X24300499Y16506800D01*
X23729071Y15878228D02*
X23671928Y15821085D01*
X23729071Y15763942D01*
X23786214Y15821085D01*
X23729071Y15878228D01*
X23729071Y15763942D01*
X22986214Y15763942D02*
X23100499Y15821085D01*
X23157642Y15878228D01*
X23214785Y15992514D01*
X23214785Y16335371D01*
X23157642Y16449657D01*
X23100499Y16506800D01*
X22986214Y16563942D01*
X22814785Y16563942D01*
X22700499Y16506800D01*
X22643357Y16449657D01*
X22586214Y16335371D01*
X22586214Y15992514D01*
X22643357Y15878228D01*
X22700499Y15821085D01*
X22814785Y15763942D01*
X22986214Y15763942D01*
X22071928Y15763942D02*
X22071928Y16563942D01*
X22071928Y16335371D02*
X22014785Y16449657D01*
X21957642Y16506800D01*
X21843357Y16563942D01*
X21729071Y16563942D01*
X20814785Y16563942D02*
X20814785Y15592514D01*
X20871928Y15478228D01*
X20929071Y15421085D01*
X21043357Y15363942D01*
X21214785Y15363942D01*
X21329071Y15421085D01*
X20814785Y15821085D02*
X20929071Y15763942D01*
X21157642Y15763942D01*
X21271928Y15821085D01*
X21329071Y15878228D01*
X21386214Y15992514D01*
X21386214Y16335371D01*
X21329071Y16449657D01*
X21271928Y16506800D01*
X21157642Y16563942D01*
X20929071Y16563942D01*
X20814785Y16506800D01*
X19386214Y17021085D02*
X20414785Y15478228D01*
X18471928Y15821085D02*
X18586214Y15763942D01*
X18814785Y15763942D01*
X18929071Y15821085D01*
X18986214Y15878228D01*
X19043357Y15992514D01*
X19043357Y16335371D01*
X18986214Y16449657D01*
X18929071Y16506800D01*
X18814785Y16563942D01*
X18586214Y16563942D01*
X18471928Y16506800D01*
X17786214Y15763942D02*
X17900499Y15821085D01*
X17957642Y15878228D01*
X18014785Y15992514D01*
X18014785Y16335371D01*
X17957642Y16449657D01*
X17900499Y16506800D01*
X17786214Y16563942D01*
X17614785Y16563942D01*
X17500499Y16506800D01*
X17443357Y16449657D01*
X17386214Y16335371D01*
X17386214Y15992514D01*
X17443357Y15878228D01*
X17500499Y15821085D01*
X17614785Y15763942D01*
X17786214Y15763942D01*
X16929071Y16849657D02*
X16871928Y16906800D01*
X16757642Y16963942D01*
X16471928Y16963942D01*
X16357642Y16906800D01*
X16300499Y16849657D01*
X16243357Y16735371D01*
X16243357Y16621085D01*
X16300499Y16449657D01*
X16986214Y15763942D01*
X16243357Y15763942D01*
X14871928Y17021085D02*
X15900500Y15478228D01*
X14471928Y16563942D02*
X14471928Y15535371D01*
X14529071Y15421085D01*
X14643357Y15363942D01*
X14700500Y15363942D01*
X14471928Y16963942D02*
X14529071Y16906800D01*
X14471928Y16849657D01*
X14414785Y16906800D01*
X14471928Y16963942D01*
X14471928Y16849657D01*
X50149142Y-23098142D02*
X49863428Y-23193380D01*
X49768190Y-23288619D01*
X49672952Y-23479095D01*
X49672952Y-23764809D01*
X49768190Y-23955285D01*
X49863428Y-24050523D01*
X50053904Y-24145761D01*
X50815809Y-24145761D01*
X50815809Y-22145761D01*
X50149142Y-22145761D01*
X49958666Y-22241000D01*
X49863428Y-22336238D01*
X49768190Y-22526714D01*
X49768190Y-22717190D01*
X49863428Y-22907666D01*
X49958666Y-23002904D01*
X50149142Y-23098142D01*
X50815809Y-23098142D01*
X50768190Y-15573333D02*
X49815809Y-15573333D01*
X50958666Y-16144761D02*
X50292000Y-14144761D01*
X49625333Y-16144761D01*
X39425619Y-41430857D02*
X40425619Y-41430857D01*
X39949428Y-41430857D02*
X39949428Y-40916571D01*
X39425619Y-40916571D02*
X40425619Y-40916571D01*
X39425619Y-40488000D02*
X40092285Y-40488000D01*
X40425619Y-40488000D02*
X40378000Y-40530857D01*
X40330380Y-40488000D01*
X40378000Y-40445142D01*
X40425619Y-40488000D01*
X40330380Y-40488000D01*
X39425619Y-40059428D02*
X40092285Y-40059428D01*
X39901809Y-40059428D02*
X39997047Y-40016571D01*
X40044666Y-39973714D01*
X40092285Y-39888000D01*
X40092285Y-39802285D01*
X39425619Y-39373714D02*
X39473238Y-39459428D01*
X39520857Y-39502285D01*
X39616095Y-39545142D01*
X39901809Y-39545142D01*
X39997047Y-39502285D01*
X40044666Y-39459428D01*
X40092285Y-39373714D01*
X40092285Y-39245142D01*
X40044666Y-39159428D01*
X39997047Y-39116571D01*
X39901809Y-39073714D01*
X39616095Y-39073714D01*
X39520857Y-39116571D01*
X39473238Y-39159428D01*
X39425619Y-39245142D01*
X39425619Y-39373714D01*
X39473238Y-38730857D02*
X39425619Y-38645142D01*
X39425619Y-38473714D01*
X39473238Y-38388000D01*
X39568476Y-38345142D01*
X39616095Y-38345142D01*
X39711333Y-38388000D01*
X39758952Y-38473714D01*
X39758952Y-38602285D01*
X39806571Y-38688000D01*
X39901809Y-38730857D01*
X39949428Y-38730857D01*
X40044666Y-38688000D01*
X40092285Y-38602285D01*
X40092285Y-38473714D01*
X40044666Y-38388000D01*
X39473238Y-37616571D02*
X39425619Y-37702285D01*
X39425619Y-37873714D01*
X39473238Y-37959428D01*
X39568476Y-38002285D01*
X39949428Y-38002285D01*
X40044666Y-37959428D01*
X40092285Y-37873714D01*
X40092285Y-37702285D01*
X40044666Y-37616571D01*
X39949428Y-37573714D01*
X39854190Y-37573714D01*
X39758952Y-38002285D01*
X39425619Y-36502285D02*
X40425619Y-36502285D01*
X40425619Y-36288000D01*
X40378000Y-36159428D01*
X40282761Y-36073714D01*
X40187523Y-36030857D01*
X39997047Y-35988000D01*
X39854190Y-35988000D01*
X39663714Y-36030857D01*
X39568476Y-36073714D01*
X39473238Y-36159428D01*
X39425619Y-36288000D01*
X39425619Y-36502285D01*
X39425619Y-35602285D02*
X40425619Y-35602285D01*
X39711333Y-35302285D01*
X40425619Y-35002285D01*
X39425619Y-35002285D01*
X40425619Y-34659428D02*
X40425619Y-34102285D01*
X40044666Y-34402285D01*
X40044666Y-34273714D01*
X39997047Y-34188000D01*
X39949428Y-34145142D01*
X39854190Y-34102285D01*
X39616095Y-34102285D01*
X39520857Y-34145142D01*
X39473238Y-34188000D01*
X39425619Y-34273714D01*
X39425619Y-34530857D01*
X39473238Y-34616571D01*
X39520857Y-34659428D01*
X39425619Y-33716571D02*
X40425619Y-33716571D01*
X40425619Y-33502285D01*
X40378000Y-33373714D01*
X40282761Y-33288000D01*
X40187523Y-33245142D01*
X39997047Y-33202285D01*
X39854190Y-33202285D01*
X39663714Y-33245142D01*
X39568476Y-33288000D01*
X39473238Y-33373714D01*
X39425619Y-33502285D01*
X39425619Y-33716571D01*
X-2532214Y-8088261D02*
X-2675071Y-8135880D01*
X-2913166Y-8135880D01*
X-3008404Y-8088261D01*
X-3056023Y-8040642D01*
X-3103642Y-7945404D01*
X-3103642Y-7850166D01*
X-3056023Y-7754928D01*
X-3008404Y-7707309D01*
X-2913166Y-7659690D01*
X-2722690Y-7612071D01*
X-2627452Y-7564452D01*
X-2579833Y-7516833D01*
X-2532214Y-7421595D01*
X-2532214Y-7326357D01*
X-2579833Y-7231119D01*
X-2627452Y-7183500D01*
X-2722690Y-7135880D01*
X-2960785Y-7135880D01*
X-3103642Y-7183500D01*
X-3532214Y-8135880D02*
X-3532214Y-7135880D01*
X-3770309Y-7135880D01*
X-3913166Y-7183500D01*
X-4008404Y-7278738D01*
X-4056023Y-7373976D01*
X-4103642Y-7564452D01*
X-4103642Y-7707309D01*
X-4056023Y-7897785D01*
X-4008404Y-7993023D01*
X-3913166Y-8088261D01*
X-3770309Y-8135880D01*
X-3532214Y-8135880D01*
X-4484595Y-7850166D02*
X-4960785Y-7850166D01*
X-4389357Y-8135880D02*
X-4722690Y-7135880D01*
X-5056023Y-8135880D01*
X-2619523Y-10691761D02*
X-2762380Y-10739380D01*
X-3000476Y-10739380D01*
X-3095714Y-10691761D01*
X-3143333Y-10644142D01*
X-3190952Y-10548904D01*
X-3190952Y-10453666D01*
X-3143333Y-10358428D01*
X-3095714Y-10310809D01*
X-3000476Y-10263190D01*
X-2810000Y-10215571D01*
X-2714761Y-10167952D01*
X-2667142Y-10120333D01*
X-2619523Y-10025095D01*
X-2619523Y-9929857D01*
X-2667142Y-9834619D01*
X-2714761Y-9787000D01*
X-2810000Y-9739380D01*
X-3048095Y-9739380D01*
X-3190952Y-9787000D01*
X-4190952Y-10644142D02*
X-4143333Y-10691761D01*
X-4000476Y-10739380D01*
X-3905238Y-10739380D01*
X-3762380Y-10691761D01*
X-3667142Y-10596523D01*
X-3619523Y-10501285D01*
X-3571904Y-10310809D01*
X-3571904Y-10167952D01*
X-3619523Y-9977476D01*
X-3667142Y-9882238D01*
X-3762380Y-9787000D01*
X-3905238Y-9739380D01*
X-4000476Y-9739380D01*
X-4143333Y-9787000D01*
X-4190952Y-9834619D01*
X-5095714Y-10739380D02*
X-4619523Y-10739380D01*
X-4619523Y-9739380D01*
X-3365523Y-20089880D02*
X-2889333Y-20089880D01*
X-2841714Y-20566071D01*
X-2889333Y-20518452D01*
X-2984571Y-20470833D01*
X-3222666Y-20470833D01*
X-3317904Y-20518452D01*
X-3365523Y-20566071D01*
X-3413142Y-20661309D01*
X-3413142Y-20899404D01*
X-3365523Y-20994642D01*
X-3317904Y-21042261D01*
X-3222666Y-21089880D01*
X-2984571Y-21089880D01*
X-2889333Y-21042261D01*
X-2841714Y-20994642D01*
X-3698857Y-20089880D02*
X-4032190Y-21089880D01*
X-4365523Y-20089880D01*
X-2794095Y-22693380D02*
X-3413142Y-22693380D01*
X-3079809Y-23074333D01*
X-3222666Y-23074333D01*
X-3317904Y-23121952D01*
X-3365523Y-23169571D01*
X-3413142Y-23264809D01*
X-3413142Y-23502904D01*
X-3365523Y-23598142D01*
X-3317904Y-23645761D01*
X-3222666Y-23693380D01*
X-2936952Y-23693380D01*
X-2841714Y-23645761D01*
X-2794095Y-23598142D01*
X-3698857Y-22693380D02*
X-4032190Y-23693380D01*
X-4365523Y-22693380D01*
D12*
%TO.C,J11*%
X-3509000Y-90740000D02*
X-1009000Y-90740000D01*
X-1009000Y-90740000D02*
X-1009000Y-89690000D01*
X-1009000Y-89690000D02*
X-19000Y-89690000D01*
X-3509000Y-84520000D02*
X-1009000Y-84520000D01*
X-1009000Y-84520000D02*
X-1009000Y-85570000D01*
X-5479000Y-89570000D02*
X-5479000Y-85690000D01*
%TO.C,J7*%
X1330000Y-8890000D02*
X-1330000Y-8890000D01*
X1330000Y-8890000D02*
X1330000Y-26730000D01*
X1330000Y-26730000D02*
X-1330000Y-26730000D01*
X-1330000Y-8890000D02*
X-1330000Y-26730000D01*
X-1330000Y-6290000D02*
X-1330000Y-7620000D01*
X0Y-6290000D02*
X-1330000Y-6290000D01*
%TO.C,R16*%
X10865752Y-59234000D02*
X10343248Y-59234000D01*
X10865752Y-60654000D02*
X10343248Y-60654000D01*
%TO.C,R14*%
X10929252Y-70283000D02*
X10406748Y-70283000D01*
X10929252Y-71703000D02*
X10406748Y-71703000D01*
%TO.C,R12*%
X10865752Y-62917000D02*
X10343248Y-62917000D01*
X10865752Y-64337000D02*
X10343248Y-64337000D01*
%TO.C,R10*%
X10406748Y-53288000D02*
X10929252Y-53288000D01*
X10406748Y-51868000D02*
X10929252Y-51868000D01*
%TO.C,SW3*%
X28338000Y-23308000D02*
X29988000Y-23308000D01*
X28338000Y-31048000D02*
X28338000Y-23308000D01*
X33638000Y-31048000D02*
X28338000Y-31048000D01*
X33638000Y-23308000D02*
X33638000Y-31048000D01*
X31988000Y-23308000D02*
X33638000Y-23308000D01*
X29988000Y-23308000D02*
G75*
G03*
X31988000Y-23308000I1000000J0D01*
G01*
%TO.C,JP1*%
X12257000Y-35830000D02*
X10857000Y-35830000D01*
X10157000Y-36530000D02*
X10157000Y-37130000D01*
X10857000Y-37830000D02*
X12257000Y-37830000D01*
X12957000Y-37130000D02*
X12957000Y-36530000D01*
X12957000Y-36530000D02*
G75*
G03*
X12257000Y-35830000I-700000J0D01*
G01*
X12257000Y-37830000D02*
G75*
G03*
X12957000Y-37130000I0J700000D01*
G01*
X10157000Y-37130000D02*
G75*
G03*
X10857000Y-37830000I700000J0D01*
G01*
X10857000Y-35830000D02*
G75*
G03*
X10157000Y-36530000I0J-700000D01*
G01*
%TO.C,J5*%
X8957000Y-39056000D02*
X8957000Y-40386000D01*
X10287000Y-39056000D02*
X8957000Y-39056000D01*
X11557000Y-39056000D02*
X11557000Y-41716000D01*
X11557000Y-41716000D02*
X14157000Y-41716000D01*
X11557000Y-39056000D02*
X14157000Y-39056000D01*
X14157000Y-39056000D02*
X14157000Y-41716000D01*
%TO.C,J4*%
X28793500Y-89016000D02*
X26193500Y-89016000D01*
X28793500Y-103716000D02*
X28793500Y-89016000D01*
X19593500Y-89016000D02*
X19593500Y-90916000D01*
X22293500Y-89016000D02*
X19593500Y-89016000D01*
X19593500Y-103716000D02*
X28793500Y-103716000D01*
X19593500Y-94916000D02*
X19593500Y-103716000D01*
X28993500Y-89866000D02*
X28993500Y-88816000D01*
X27943500Y-88816000D02*
X28993500Y-88816000D01*
%TO.C,R5*%
X10929252Y-55551000D02*
X10406748Y-55551000D01*
X10929252Y-56971000D02*
X10406748Y-56971000D01*
%TO.C,R7*%
X10929252Y-66600000D02*
X10406748Y-66600000D01*
X10929252Y-68020000D02*
X10406748Y-68020000D01*
%TO.C,R3*%
X10802252Y-48312000D02*
X10279748Y-48312000D01*
X10802252Y-49732000D02*
X10279748Y-49732000D01*
%TO.C,R1*%
X10802252Y-44756000D02*
X10279748Y-44756000D01*
X10802252Y-46176000D02*
X10279748Y-46176000D01*
%TO.C,SW1*%
X47772000Y-16362000D02*
X47772000Y-13682000D01*
X41532000Y-13682000D02*
X41532000Y-16362000D01*
X41682000Y-18142000D02*
X47622000Y-18142000D01*
X41682000Y-11902000D02*
X47622000Y-11902000D01*
X46066214Y-15022000D02*
G75*
G03*
X46066214Y-15022000I-1414214J0D01*
G01*
%TO.C,SW2*%
X47772000Y-24744000D02*
X47772000Y-22064000D01*
X41532000Y-22064000D02*
X41532000Y-24744000D01*
X41682000Y-26524000D02*
X47622000Y-26524000D01*
X41682000Y-20284000D02*
X47622000Y-20284000D01*
X46066214Y-23404000D02*
G75*
G03*
X46066214Y-23404000I-1414214J0D01*
G01*
%TO.C,C1*%
X37413000Y-37726252D02*
X37413000Y-37203748D01*
X35993000Y-37726252D02*
X35993000Y-37203748D01*
%TO.C,J6*%
X-5479000Y-80680000D02*
X-5479000Y-76800000D01*
X-1009000Y-75630000D02*
X-1009000Y-76680000D01*
X-3509000Y-75630000D02*
X-1009000Y-75630000D01*
X-1009000Y-80800000D02*
X-19000Y-80800000D01*
X-1009000Y-81850000D02*
X-1009000Y-80800000D01*
X-3509000Y-81850000D02*
X-1009000Y-81850000D01*
%TO.C,J11*%
D10*
X-2746476Y-87082380D02*
X-2746476Y-87796666D01*
X-2698857Y-87939523D01*
X-2603619Y-88034761D01*
X-2460761Y-88082380D01*
X-2365523Y-88082380D01*
X-3746476Y-88082380D02*
X-3175047Y-88082380D01*
X-3460761Y-88082380D02*
X-3460761Y-87082380D01*
X-3365523Y-87225238D01*
X-3270285Y-87320476D01*
X-3175047Y-87368095D01*
X-4698857Y-88082380D02*
X-4127428Y-88082380D01*
X-4413142Y-88082380D02*
X-4413142Y-87082380D01*
X-4317904Y-87225238D01*
X-4222666Y-87320476D01*
X-4127428Y-87368095D01*
%TO.C,J7*%
X333333Y-4302380D02*
X333333Y-5016666D01*
X380952Y-5159523D01*
X476190Y-5254761D01*
X619047Y-5302380D01*
X714285Y-5302380D01*
X-47619Y-4302380D02*
X-714285Y-4302380D01*
X-285714Y-5302380D01*
%TO.C,R16*%
X14358880Y-59555142D02*
X13882690Y-59221809D01*
X14358880Y-58983714D02*
X13358880Y-58983714D01*
X13358880Y-59364666D01*
X13406500Y-59459904D01*
X13454119Y-59507523D01*
X13549357Y-59555142D01*
X13692214Y-59555142D01*
X13787452Y-59507523D01*
X13835071Y-59459904D01*
X13882690Y-59364666D01*
X13882690Y-58983714D01*
X14358880Y-60507523D02*
X14358880Y-59936095D01*
X14358880Y-60221809D02*
X13358880Y-60221809D01*
X13501738Y-60126571D01*
X13596976Y-60031333D01*
X13644595Y-59936095D01*
X13358880Y-61364666D02*
X13358880Y-61174190D01*
X13406500Y-61078952D01*
X13454119Y-61031333D01*
X13596976Y-60936095D01*
X13787452Y-60888476D01*
X14168404Y-60888476D01*
X14263642Y-60936095D01*
X14311261Y-60983714D01*
X14358880Y-61078952D01*
X14358880Y-61269428D01*
X14311261Y-61364666D01*
X14263642Y-61412285D01*
X14168404Y-61459904D01*
X13930309Y-61459904D01*
X13835071Y-61412285D01*
X13787452Y-61364666D01*
X13739833Y-61269428D01*
X13739833Y-61078952D01*
X13787452Y-60983714D01*
X13835071Y-60936095D01*
X13930309Y-60888476D01*
%TO.C,R14*%
X14549380Y-70350142D02*
X14073190Y-70016809D01*
X14549380Y-69778714D02*
X13549380Y-69778714D01*
X13549380Y-70159666D01*
X13597000Y-70254904D01*
X13644619Y-70302523D01*
X13739857Y-70350142D01*
X13882714Y-70350142D01*
X13977952Y-70302523D01*
X14025571Y-70254904D01*
X14073190Y-70159666D01*
X14073190Y-69778714D01*
X14549380Y-71302523D02*
X14549380Y-70731095D01*
X14549380Y-71016809D02*
X13549380Y-71016809D01*
X13692238Y-70921571D01*
X13787476Y-70826333D01*
X13835095Y-70731095D01*
X13882714Y-72159666D02*
X14549380Y-72159666D01*
X13501761Y-71921571D02*
X14216047Y-71683476D01*
X14216047Y-72302523D01*
%TO.C,R12*%
X14231880Y-63111142D02*
X13755690Y-62777809D01*
X14231880Y-62539714D02*
X13231880Y-62539714D01*
X13231880Y-62920666D01*
X13279500Y-63015904D01*
X13327119Y-63063523D01*
X13422357Y-63111142D01*
X13565214Y-63111142D01*
X13660452Y-63063523D01*
X13708071Y-63015904D01*
X13755690Y-62920666D01*
X13755690Y-62539714D01*
X14231880Y-64063523D02*
X14231880Y-63492095D01*
X14231880Y-63777809D02*
X13231880Y-63777809D01*
X13374738Y-63682571D01*
X13469976Y-63587333D01*
X13517595Y-63492095D01*
X13327119Y-64444476D02*
X13279500Y-64492095D01*
X13231880Y-64587333D01*
X13231880Y-64825428D01*
X13279500Y-64920666D01*
X13327119Y-64968285D01*
X13422357Y-65015904D01*
X13517595Y-65015904D01*
X13660452Y-64968285D01*
X14231880Y-64396857D01*
X14231880Y-65015904D01*
%TO.C,R10*%
X14295380Y-52062142D02*
X13819190Y-51728809D01*
X14295380Y-51490714D02*
X13295380Y-51490714D01*
X13295380Y-51871666D01*
X13343000Y-51966904D01*
X13390619Y-52014523D01*
X13485857Y-52062142D01*
X13628714Y-52062142D01*
X13723952Y-52014523D01*
X13771571Y-51966904D01*
X13819190Y-51871666D01*
X13819190Y-51490714D01*
X14295380Y-53014523D02*
X14295380Y-52443095D01*
X14295380Y-52728809D02*
X13295380Y-52728809D01*
X13438238Y-52633571D01*
X13533476Y-52538333D01*
X13581095Y-52443095D01*
X13295380Y-53633571D02*
X13295380Y-53728809D01*
X13343000Y-53824047D01*
X13390619Y-53871666D01*
X13485857Y-53919285D01*
X13676333Y-53966904D01*
X13914428Y-53966904D01*
X14104904Y-53919285D01*
X14200142Y-53871666D01*
X14247761Y-53824047D01*
X14295380Y-53728809D01*
X14295380Y-53633571D01*
X14247761Y-53538333D01*
X14200142Y-53490714D01*
X14104904Y-53443095D01*
X13914428Y-53395476D01*
X13676333Y-53395476D01*
X13485857Y-53443095D01*
X13390619Y-53490714D01*
X13343000Y-53538333D01*
X13295380Y-53633571D01*
%TO.C,SW3*%
X32321333Y-22712761D02*
X32178476Y-22760380D01*
X31940380Y-22760380D01*
X31845142Y-22712761D01*
X31797523Y-22665142D01*
X31749904Y-22569904D01*
X31749904Y-22474666D01*
X31797523Y-22379428D01*
X31845142Y-22331809D01*
X31940380Y-22284190D01*
X32130857Y-22236571D01*
X32226095Y-22188952D01*
X32273714Y-22141333D01*
X32321333Y-22046095D01*
X32321333Y-21950857D01*
X32273714Y-21855619D01*
X32226095Y-21808000D01*
X32130857Y-21760380D01*
X31892761Y-21760380D01*
X31749904Y-21808000D01*
X31416571Y-21760380D02*
X31178476Y-22760380D01*
X30988000Y-22046095D01*
X30797523Y-22760380D01*
X30559428Y-21760380D01*
X30273714Y-21760380D02*
X29654666Y-21760380D01*
X29988000Y-22141333D01*
X29845142Y-22141333D01*
X29749904Y-22188952D01*
X29702285Y-22236571D01*
X29654666Y-22331809D01*
X29654666Y-22569904D01*
X29702285Y-22665142D01*
X29749904Y-22712761D01*
X29845142Y-22760380D01*
X30130857Y-22760380D01*
X30226095Y-22712761D01*
X30273714Y-22665142D01*
%TO.C,JP1*%
X9088333Y-36282380D02*
X9088333Y-36996666D01*
X9135952Y-37139523D01*
X9231190Y-37234761D01*
X9374047Y-37282380D01*
X9469285Y-37282380D01*
X8612142Y-37282380D02*
X8612142Y-36282380D01*
X8231190Y-36282380D01*
X8135952Y-36330000D01*
X8088333Y-36377619D01*
X8040714Y-36472857D01*
X8040714Y-36615714D01*
X8088333Y-36710952D01*
X8135952Y-36758571D01*
X8231190Y-36806190D01*
X8612142Y-36806190D01*
X7088333Y-37282380D02*
X7659761Y-37282380D01*
X7374047Y-37282380D02*
X7374047Y-36282380D01*
X7469285Y-36425238D01*
X7564523Y-36520476D01*
X7659761Y-36568095D01*
%TO.C,J5*%
X7572333Y-39838380D02*
X7572333Y-40552666D01*
X7619952Y-40695523D01*
X7715190Y-40790761D01*
X7858047Y-40838380D01*
X7953285Y-40838380D01*
X6619952Y-39838380D02*
X7096142Y-39838380D01*
X7143761Y-40314571D01*
X7096142Y-40266952D01*
X7000904Y-40219333D01*
X6762809Y-40219333D01*
X6667571Y-40266952D01*
X6619952Y-40314571D01*
X6572333Y-40409809D01*
X6572333Y-40647904D01*
X6619952Y-40743142D01*
X6667571Y-40790761D01*
X6762809Y-40838380D01*
X7000904Y-40838380D01*
X7096142Y-40790761D01*
X7143761Y-40743142D01*
%TO.C,J4*%
X17895880Y-98032666D02*
X18610166Y-98032666D01*
X18753023Y-97985047D01*
X18848261Y-97889809D01*
X18895880Y-97746952D01*
X18895880Y-97651714D01*
X18229214Y-98937428D02*
X18895880Y-98937428D01*
X17848261Y-98699333D02*
X18562547Y-98461238D01*
X18562547Y-99080285D01*
%TO.C,R5*%
X14295380Y-56094333D02*
X13819190Y-55761000D01*
X14295380Y-55522904D02*
X13295380Y-55522904D01*
X13295380Y-55903857D01*
X13343000Y-55999095D01*
X13390619Y-56046714D01*
X13485857Y-56094333D01*
X13628714Y-56094333D01*
X13723952Y-56046714D01*
X13771571Y-55999095D01*
X13819190Y-55903857D01*
X13819190Y-55522904D01*
X13295380Y-56999095D02*
X13295380Y-56522904D01*
X13771571Y-56475285D01*
X13723952Y-56522904D01*
X13676333Y-56618142D01*
X13676333Y-56856238D01*
X13723952Y-56951476D01*
X13771571Y-56999095D01*
X13866809Y-57046714D01*
X14104904Y-57046714D01*
X14200142Y-56999095D01*
X14247761Y-56951476D01*
X14295380Y-56856238D01*
X14295380Y-56618142D01*
X14247761Y-56522904D01*
X14200142Y-56475285D01*
%TO.C,R7*%
X14422380Y-67143333D02*
X13946190Y-66810000D01*
X14422380Y-66571904D02*
X13422380Y-66571904D01*
X13422380Y-66952857D01*
X13470000Y-67048095D01*
X13517619Y-67095714D01*
X13612857Y-67143333D01*
X13755714Y-67143333D01*
X13850952Y-67095714D01*
X13898571Y-67048095D01*
X13946190Y-66952857D01*
X13946190Y-66571904D01*
X13422380Y-67476666D02*
X13422380Y-68143333D01*
X14422380Y-67714761D01*
%TO.C,R3*%
X14295380Y-48855333D02*
X13819190Y-48522000D01*
X14295380Y-48283904D02*
X13295380Y-48283904D01*
X13295380Y-48664857D01*
X13343000Y-48760095D01*
X13390619Y-48807714D01*
X13485857Y-48855333D01*
X13628714Y-48855333D01*
X13723952Y-48807714D01*
X13771571Y-48760095D01*
X13819190Y-48664857D01*
X13819190Y-48283904D01*
X13295380Y-49188666D02*
X13295380Y-49807714D01*
X13676333Y-49474380D01*
X13676333Y-49617238D01*
X13723952Y-49712476D01*
X13771571Y-49760095D01*
X13866809Y-49807714D01*
X14104904Y-49807714D01*
X14200142Y-49760095D01*
X14247761Y-49712476D01*
X14295380Y-49617238D01*
X14295380Y-49331523D01*
X14247761Y-49236285D01*
X14200142Y-49188666D01*
%TO.C,R1*%
X14231880Y-45299333D02*
X13755690Y-44966000D01*
X14231880Y-44727904D02*
X13231880Y-44727904D01*
X13231880Y-45108857D01*
X13279500Y-45204095D01*
X13327119Y-45251714D01*
X13422357Y-45299333D01*
X13565214Y-45299333D01*
X13660452Y-45251714D01*
X13708071Y-45204095D01*
X13755690Y-45108857D01*
X13755690Y-44727904D01*
X14231880Y-46251714D02*
X14231880Y-45680285D01*
X14231880Y-45966000D02*
X13231880Y-45966000D01*
X13374738Y-45870761D01*
X13469976Y-45775523D01*
X13517595Y-45680285D01*
%TO.C,SW1*%
X40677933Y-15492361D02*
X40535076Y-15539980D01*
X40296980Y-15539980D01*
X40201742Y-15492361D01*
X40154123Y-15444742D01*
X40106504Y-15349504D01*
X40106504Y-15254266D01*
X40154123Y-15159028D01*
X40201742Y-15111409D01*
X40296980Y-15063790D01*
X40487457Y-15016171D01*
X40582695Y-14968552D01*
X40630314Y-14920933D01*
X40677933Y-14825695D01*
X40677933Y-14730457D01*
X40630314Y-14635219D01*
X40582695Y-14587600D01*
X40487457Y-14539980D01*
X40249361Y-14539980D01*
X40106504Y-14587600D01*
X39773171Y-14539980D02*
X39535076Y-15539980D01*
X39344600Y-14825695D01*
X39154123Y-15539980D01*
X38916028Y-14539980D01*
X38011266Y-15539980D02*
X38582695Y-15539980D01*
X38296980Y-15539980D02*
X38296980Y-14539980D01*
X38392219Y-14682838D01*
X38487457Y-14778076D01*
X38582695Y-14825695D01*
%TO.C,SW2*%
X40550933Y-23848961D02*
X40408076Y-23896580D01*
X40169980Y-23896580D01*
X40074742Y-23848961D01*
X40027123Y-23801342D01*
X39979504Y-23706104D01*
X39979504Y-23610866D01*
X40027123Y-23515628D01*
X40074742Y-23468009D01*
X40169980Y-23420390D01*
X40360457Y-23372771D01*
X40455695Y-23325152D01*
X40503314Y-23277533D01*
X40550933Y-23182295D01*
X40550933Y-23087057D01*
X40503314Y-22991819D01*
X40455695Y-22944200D01*
X40360457Y-22896580D01*
X40122361Y-22896580D01*
X39979504Y-22944200D01*
X39646171Y-22896580D02*
X39408076Y-23896580D01*
X39217600Y-23182295D01*
X39027123Y-23896580D01*
X38789028Y-22896580D01*
X38455695Y-22991819D02*
X38408076Y-22944200D01*
X38312838Y-22896580D01*
X38074742Y-22896580D01*
X37979504Y-22944200D01*
X37931885Y-22991819D01*
X37884266Y-23087057D01*
X37884266Y-23182295D01*
X37931885Y-23325152D01*
X38503314Y-23896580D01*
X37884266Y-23896580D01*
%TO.C,C1*%
X37060142Y-40473333D02*
X37107761Y-40425714D01*
X37155380Y-40282857D01*
X37155380Y-40187619D01*
X37107761Y-40044761D01*
X37012523Y-39949523D01*
X36917285Y-39901904D01*
X36726809Y-39854285D01*
X36583952Y-39854285D01*
X36393476Y-39901904D01*
X36298238Y-39949523D01*
X36203000Y-40044761D01*
X36155380Y-40187619D01*
X36155380Y-40282857D01*
X36203000Y-40425714D01*
X36250619Y-40473333D01*
X37155380Y-41425714D02*
X37155380Y-40854285D01*
X37155380Y-41140000D02*
X36155380Y-41140000D01*
X36298238Y-41044761D01*
X36393476Y-40949523D01*
X36441095Y-40854285D01*
%TO.C,J6*%
X-2689266Y-78090780D02*
X-2689266Y-78805066D01*
X-2641647Y-78947923D01*
X-2546409Y-79043161D01*
X-2403552Y-79090780D01*
X-2308314Y-79090780D01*
X-3594028Y-78090780D02*
X-3403552Y-78090780D01*
X-3308314Y-78138400D01*
X-3260695Y-78186019D01*
X-3165457Y-78328876D01*
X-3117838Y-78519352D01*
X-3117838Y-78900304D01*
X-3165457Y-78995542D01*
X-3213076Y-79043161D01*
X-3308314Y-79090780D01*
X-3498790Y-79090780D01*
X-3594028Y-79043161D01*
X-3641647Y-78995542D01*
X-3689266Y-78900304D01*
X-3689266Y-78662209D01*
X-3641647Y-78566971D01*
X-3594028Y-78519352D01*
X-3498790Y-78471733D01*
X-3308314Y-78471733D01*
X-3213076Y-78519352D01*
X-3165457Y-78566971D01*
X-3117838Y-78662209D01*
%TO.C,J2*%
X52792380Y-37258666D02*
X53506666Y-37258666D01*
X53649523Y-37211047D01*
X53744761Y-37115809D01*
X53792380Y-36972952D01*
X53792380Y-36877714D01*
X52887619Y-37687238D02*
X52840000Y-37734857D01*
X52792380Y-37830095D01*
X52792380Y-38068190D01*
X52840000Y-38163428D01*
X52887619Y-38211047D01*
X52982857Y-38258666D01*
X53078095Y-38258666D01*
X53220952Y-38211047D01*
X53792380Y-37639619D01*
X53792380Y-38258666D01*
%TD*%
M02*
