M48
; DRILL file {KiCad 5.1.6-c6e7f7d~87~ubuntu18.04.1} date Mon Aug 30 08:39:16 2021
; FORMAT={-:-/ absolute / inch / decimal}
; #@! TF.CreationDate,2021-08-30T08:39:16-04:00
; #@! TF.GenerationSoftware,Kicad,Pcbnew,5.1.6-c6e7f7d~87~ubuntu18.04.1
; #@! TF.FileFunction,NonPlated,1,2,NPTH
FMAT,2
INCH
T1C0.1378
T2C0.1457
%
G90
G05
T1
X9.4595Y3.343
X9.4595Y-0.5271
X7.554Y-0.5271
T2
X7.554Y3.343
X7.4104Y-0.9291
X9.5974Y-0.9232
T0
M30
