M48
; DRILL file {KiCad 5.1.6-c6e7f7d~87~ubuntu18.04.1} date Wed Nov 17 17:31:38 2021
; FORMAT={-:-/ absolute / inch / decimal}
; #@! TF.CreationDate,2021-11-17T17:31:38-05:00
; #@! TF.GenerationSoftware,Kicad,Pcbnew,5.1.6-c6e7f7d~87~ubuntu18.04.1
; #@! TF.FileFunction,Plated,1,2,PTH
FMAT,2
INCH
T1C0.1063
%
G90
G05
T1
X1.1775Y-5.5139
X1.1775Y-4.2486
X2.9098Y-4.2486
X2.9121Y-3.0083
X1.1775Y-3.0075
X2.9098Y-5.5139
T0
M30
