%TF.GenerationSoftware,KiCad,Pcbnew,5.1.6-c6e7f7d~87~ubuntu18.04.1*%
%TF.CreationDate,2021-07-21T15:50:48-04:00*%
%TF.ProjectId,remote,72656d6f-7465-42e6-9b69-6361645f7063,rev?*%
%TF.SameCoordinates,Original*%
%TF.FileFunction,Legend,Bot*%
%TF.FilePolarity,Positive*%
%FSLAX46Y46*%
G04 Gerber Fmt 4.6, Leading zero omitted, Abs format (unit mm)*
G04 Created by KiCad (PCBNEW 5.1.6-c6e7f7d~87~ubuntu18.04.1) date 2021-07-21 15:50:48*
%MOMM*%
%LPD*%
G01*
G04 APERTURE LIST*
%ADD10C,0.150000*%
%ADD11C,0.120000*%
%ADD12C,0.200000*%
G04 APERTURE END LIST*
D10*
X224952380Y51464285D02*
X224952380Y52035714D01*
X224952380Y51750000D02*
X223952380Y51750000D01*
X224095238Y51845238D01*
X224190476Y51940476D01*
X224238095Y52035714D01*
X224952380Y51035714D02*
X223952380Y51035714D01*
X224952380Y50464285D02*
X224380952Y50892857D01*
X223952380Y50464285D02*
X224523809Y51035714D01*
X213473200Y80497142D02*
X213558914Y80411428D01*
X213816057Y80325714D01*
X213987485Y80325714D01*
X214244628Y80411428D01*
X214416057Y80582857D01*
X214501771Y80754285D01*
X214587485Y81097142D01*
X214587485Y81354285D01*
X214501771Y81697142D01*
X214416057Y81868571D01*
X214244628Y82040000D01*
X213987485Y82125714D01*
X213816057Y82125714D01*
X213558914Y82040000D01*
X213473200Y81954285D01*
X212358914Y82125714D02*
X212016057Y82125714D01*
X211844628Y82040000D01*
X211673200Y81868571D01*
X211587485Y81525714D01*
X211587485Y80925714D01*
X211673200Y80582857D01*
X211844628Y80411428D01*
X212016057Y80325714D01*
X212358914Y80325714D01*
X212530342Y80411428D01*
X212701771Y80582857D01*
X212787485Y80925714D01*
X212787485Y81525714D01*
X212701771Y81868571D01*
X212530342Y82040000D01*
X212358914Y82125714D01*
X210901771Y81954285D02*
X210816057Y82040000D01*
X210644628Y82125714D01*
X210216057Y82125714D01*
X210044628Y82040000D01*
X209958914Y81954285D01*
X209873200Y81782857D01*
X209873200Y81611428D01*
X209958914Y81354285D01*
X210987485Y80325714D01*
X209873200Y80325714D01*
X207730342Y80325714D02*
X207730342Y82125714D01*
X207130342Y80840000D01*
X206530342Y82125714D01*
X206530342Y80325714D01*
X205416057Y80325714D02*
X205587485Y80411428D01*
X205673200Y80497142D01*
X205758914Y80668571D01*
X205758914Y81182857D01*
X205673200Y81354285D01*
X205587485Y81440000D01*
X205416057Y81525714D01*
X205158914Y81525714D01*
X204987485Y81440000D01*
X204901771Y81354285D01*
X204816057Y81182857D01*
X204816057Y80668571D01*
X204901771Y80497142D01*
X204987485Y80411428D01*
X205158914Y80325714D01*
X205416057Y80325714D01*
X204044628Y81525714D02*
X204044628Y80325714D01*
X204044628Y81354285D02*
X203958914Y81440000D01*
X203787485Y81525714D01*
X203530342Y81525714D01*
X203358914Y81440000D01*
X203273200Y81268571D01*
X203273200Y80325714D01*
X202416057Y80325714D02*
X202416057Y81525714D01*
X202416057Y82125714D02*
X202501771Y82040000D01*
X202416057Y81954285D01*
X202330342Y82040000D01*
X202416057Y82125714D01*
X202416057Y81954285D01*
X201816057Y81525714D02*
X201130342Y81525714D01*
X201558914Y82125714D02*
X201558914Y80582857D01*
X201473200Y80411428D01*
X201301771Y80325714D01*
X201130342Y80325714D01*
X200273200Y80325714D02*
X200444628Y80411428D01*
X200530342Y80497142D01*
X200616057Y80668571D01*
X200616057Y81182857D01*
X200530342Y81354285D01*
X200444628Y81440000D01*
X200273200Y81525714D01*
X200016057Y81525714D01*
X199844628Y81440000D01*
X199758914Y81354285D01*
X199673200Y81182857D01*
X199673200Y80668571D01*
X199758914Y80497142D01*
X199844628Y80411428D01*
X200016057Y80325714D01*
X200273200Y80325714D01*
X198901771Y80325714D02*
X198901771Y81525714D01*
X198901771Y81182857D02*
X198816057Y81354285D01*
X198730342Y81440000D01*
X198558914Y81525714D01*
X198387485Y81525714D01*
X230157142Y-18452380D02*
X230157142Y-17452380D01*
X229823809Y-18166666D01*
X229490476Y-17452380D01*
X229490476Y-18452380D01*
X229061904Y-18166666D02*
X228585714Y-18166666D01*
X229157142Y-18452380D02*
X228823809Y-17452380D01*
X228490476Y-18452380D01*
X228252380Y-17452380D02*
X227585714Y-18452380D01*
X227585714Y-17452380D02*
X228252380Y-18452380D01*
X226538095Y-17452380D02*
X225919047Y-17452380D01*
X226252380Y-17833333D01*
X226109523Y-17833333D01*
X226014285Y-17880952D01*
X225966666Y-17928571D01*
X225919047Y-18023809D01*
X225919047Y-18261904D01*
X225966666Y-18357142D01*
X226014285Y-18404761D01*
X226109523Y-18452380D01*
X226395238Y-18452380D01*
X226490476Y-18404761D01*
X226538095Y-18357142D01*
X225061904Y-17452380D02*
X225252380Y-17452380D01*
X225347619Y-17500000D01*
X225395238Y-17547619D01*
X225490476Y-17690476D01*
X225538095Y-17880952D01*
X225538095Y-18261904D01*
X225490476Y-18357142D01*
X225442857Y-18404761D01*
X225347619Y-18452380D01*
X225157142Y-18452380D01*
X225061904Y-18404761D01*
X225014285Y-18357142D01*
X224966666Y-18261904D01*
X224966666Y-18023809D01*
X225014285Y-17928571D01*
X225061904Y-17880952D01*
X225157142Y-17833333D01*
X225347619Y-17833333D01*
X225442857Y-17880952D01*
X225490476Y-17928571D01*
X225538095Y-18023809D01*
X224680952Y-17452380D02*
X224347619Y-18452380D01*
X224014285Y-17452380D01*
X223680952Y-18071428D02*
X222919047Y-18071428D01*
X222442857Y-18071428D02*
X221680952Y-18071428D01*
X221204761Y-17785714D02*
X220442857Y-18071428D01*
X221204761Y-18357142D01*
D11*
X221716600Y-7493000D02*
X227516600Y-7493000D01*
X221716600Y-15043000D02*
X233316600Y-15043000D01*
X221716600Y-7493000D02*
X233316600Y-7493000D01*
X233316600Y-7493000D02*
X233316600Y-15043000D01*
X221716600Y-7493000D02*
X221716600Y-15043000D01*
D10*
X191107142Y53642857D02*
X190821428Y53547619D01*
X190726190Y53452380D01*
X190630952Y53261904D01*
X190630952Y52976190D01*
X190726190Y52785714D01*
X190821428Y52690476D01*
X191011904Y52595238D01*
X191773809Y52595238D01*
X191773809Y54595238D01*
X191107142Y54595238D01*
X190916666Y54500000D01*
X190821428Y54404761D01*
X190726190Y54214285D01*
X190726190Y54023809D01*
X190821428Y53833333D01*
X190916666Y53738095D01*
X191107142Y53642857D01*
X191773809Y53642857D01*
X211616785Y79021428D02*
X211616785Y78735714D01*
X211045357Y79021428D02*
X211045357Y78735714D01*
X209545357Y77521428D02*
X210045357Y78235714D01*
X210402500Y77521428D02*
X210402500Y79021428D01*
X209831071Y79021428D01*
X209688214Y78950000D01*
X209616785Y78878571D01*
X209545357Y78735714D01*
X209545357Y78521428D01*
X209616785Y78378571D01*
X209688214Y78307142D01*
X209831071Y78235714D01*
X210402500Y78235714D01*
X208902500Y78307142D02*
X208402500Y78307142D01*
X208188214Y77521428D02*
X208902500Y77521428D01*
X208902500Y79021428D01*
X208188214Y79021428D01*
X207759642Y79021428D02*
X207259642Y77521428D01*
X206759642Y79021428D01*
X205116785Y77521428D02*
X205116785Y79021428D01*
X204616785Y77950000D01*
X204116785Y79021428D01*
X204116785Y77521428D01*
X203473928Y79021428D02*
X203473928Y78735714D01*
X202902500Y79021428D02*
X202902500Y78735714D01*
X236580419Y46200038D02*
X237580419Y46200038D01*
X237104228Y46200038D02*
X237104228Y46771466D01*
X236580419Y46771466D02*
X237580419Y46771466D01*
X236580419Y47247657D02*
X237580419Y47247657D01*
X236580419Y48295276D02*
X237056609Y47961942D01*
X236580419Y47723847D02*
X237580419Y47723847D01*
X237580419Y48104800D01*
X237532800Y48200038D01*
X237485180Y48247657D01*
X237389942Y48295276D01*
X237247085Y48295276D01*
X237151847Y48247657D01*
X237104228Y48200038D01*
X237056609Y48104800D01*
X237056609Y47723847D01*
X237580419Y48914323D02*
X237580419Y49104800D01*
X237532800Y49200038D01*
X237437561Y49295276D01*
X237247085Y49342895D01*
X236913752Y49342895D01*
X236723276Y49295276D01*
X236628038Y49200038D01*
X236580419Y49104800D01*
X236580419Y48914323D01*
X236628038Y48819085D01*
X236723276Y48723847D01*
X236913752Y48676228D01*
X237247085Y48676228D01*
X237437561Y48723847D01*
X237532800Y48819085D01*
X237580419Y48914323D01*
X236628038Y49723847D02*
X236580419Y49866704D01*
X236580419Y50104800D01*
X236628038Y50200038D01*
X236675657Y50247657D01*
X236770895Y50295276D01*
X236866133Y50295276D01*
X236961371Y50247657D01*
X237008990Y50200038D01*
X237056609Y50104800D01*
X237104228Y49914323D01*
X237151847Y49819085D01*
X237199466Y49771466D01*
X237294704Y49723847D01*
X237389942Y49723847D01*
X237485180Y49771466D01*
X237532800Y49819085D01*
X237580419Y49914323D01*
X237580419Y50152419D01*
X237532800Y50295276D01*
X237104228Y50723847D02*
X237104228Y51057180D01*
X236580419Y51200038D02*
X236580419Y50723847D01*
X237580419Y50723847D01*
X237580419Y51200038D01*
X236580419Y52390514D02*
X237580419Y52390514D01*
X237580419Y52628609D01*
X237532800Y52771466D01*
X237437561Y52866704D01*
X237342323Y52914323D01*
X237151847Y52961942D01*
X237008990Y52961942D01*
X236818514Y52914323D01*
X236723276Y52866704D01*
X236628038Y52771466D01*
X236580419Y52628609D01*
X236580419Y52390514D01*
X236580419Y53390514D02*
X237580419Y53390514D01*
X236866133Y53723847D01*
X237580419Y54057180D01*
X236580419Y54057180D01*
X237580419Y54438133D02*
X237580419Y55057180D01*
X237199466Y54723847D01*
X237199466Y54866704D01*
X237151847Y54961942D01*
X237104228Y55009561D01*
X237008990Y55057180D01*
X236770895Y55057180D01*
X236675657Y55009561D01*
X236628038Y54961942D01*
X236580419Y54866704D01*
X236580419Y54580990D01*
X236628038Y54485752D01*
X236675657Y54438133D01*
X236580419Y55485752D02*
X237580419Y55485752D01*
X237580419Y55723847D01*
X237532800Y55866704D01*
X237437561Y55961942D01*
X237342323Y56009561D01*
X237151847Y56057180D01*
X237008990Y56057180D01*
X236818514Y56009561D01*
X236723276Y55961942D01*
X236628038Y55866704D01*
X236580419Y55723847D01*
X236580419Y55485752D01*
X237785714Y31114285D02*
X238785714Y31114285D01*
X238404761Y31114285D02*
X238452380Y31209523D01*
X238452380Y31400000D01*
X238404761Y31495238D01*
X238357142Y31542857D01*
X238261904Y31590476D01*
X237976190Y31590476D01*
X237880952Y31542857D01*
X237833333Y31495238D01*
X237785714Y31400000D01*
X237785714Y31209523D01*
X237833333Y31114285D01*
X237785714Y30733333D02*
X238452380Y30542857D01*
X237976190Y30352380D01*
X238452380Y30161904D01*
X237785714Y29971428D01*
X238452380Y29590476D02*
X237785714Y29590476D01*
X237452380Y29590476D02*
X237500000Y29638095D01*
X237547619Y29590476D01*
X237500000Y29542857D01*
X237452380Y29590476D01*
X237547619Y29590476D01*
X238452380Y29114285D02*
X237785714Y29114285D01*
X237452380Y29114285D02*
X237500000Y29161904D01*
X237547619Y29114285D01*
X237500000Y29066666D01*
X237452380Y29114285D01*
X237547619Y29114285D01*
X238404761Y28209523D02*
X238452380Y28304761D01*
X238452380Y28495238D01*
X238404761Y28590476D01*
X238357142Y28638095D01*
X238261904Y28685714D01*
X237976190Y28685714D01*
X237880952Y28638095D01*
X237833333Y28590476D01*
X237785714Y28495238D01*
X237785714Y28304761D01*
X237833333Y28209523D01*
X245233676Y6046838D02*
X245090819Y5999219D01*
X244852723Y5999219D01*
X244757485Y6046838D01*
X244709866Y6094457D01*
X244662247Y6189695D01*
X244662247Y6284933D01*
X244709866Y6380171D01*
X244757485Y6427790D01*
X244852723Y6475409D01*
X245043200Y6523028D01*
X245138438Y6570647D01*
X245186057Y6618266D01*
X245233676Y6713504D01*
X245233676Y6808742D01*
X245186057Y6903980D01*
X245138438Y6951600D01*
X245043200Y6999219D01*
X244805104Y6999219D01*
X244662247Y6951600D01*
X243662247Y6094457D02*
X243709866Y6046838D01*
X243852723Y5999219D01*
X243947961Y5999219D01*
X244090819Y6046838D01*
X244186057Y6142076D01*
X244233676Y6237314D01*
X244281295Y6427790D01*
X244281295Y6570647D01*
X244233676Y6761123D01*
X244186057Y6856361D01*
X244090819Y6951600D01*
X243947961Y6999219D01*
X243852723Y6999219D01*
X243709866Y6951600D01*
X243662247Y6903980D01*
X242757485Y5999219D02*
X243233676Y5999219D01*
X243233676Y6999219D01*
X238663219Y48931866D02*
X239329885Y48931866D01*
X239234647Y48931866D02*
X239282266Y48979485D01*
X239329885Y49074723D01*
X239329885Y49217580D01*
X239282266Y49312819D01*
X239187028Y49360438D01*
X238663219Y49360438D01*
X239187028Y49360438D02*
X239282266Y49408057D01*
X239329885Y49503295D01*
X239329885Y49646152D01*
X239282266Y49741390D01*
X239187028Y49789009D01*
X238663219Y49789009D01*
X238663219Y50265200D02*
X239329885Y50265200D01*
X239663219Y50265200D02*
X239615600Y50217580D01*
X239567980Y50265200D01*
X239615600Y50312819D01*
X239663219Y50265200D01*
X239567980Y50265200D01*
X238710838Y51169961D02*
X238663219Y51074723D01*
X238663219Y50884247D01*
X238710838Y50789009D01*
X238758457Y50741390D01*
X238853695Y50693771D01*
X239139409Y50693771D01*
X239234647Y50741390D01*
X239282266Y50789009D01*
X239329885Y50884247D01*
X239329885Y51074723D01*
X239282266Y51169961D01*
X238663219Y51598533D02*
X239329885Y51598533D01*
X239139409Y51598533D02*
X239234647Y51646152D01*
X239282266Y51693771D01*
X239329885Y51789009D01*
X239329885Y51884247D01*
X238663219Y52360438D02*
X238710838Y52265200D01*
X238758457Y52217580D01*
X238853695Y52169961D01*
X239139409Y52169961D01*
X239234647Y52217580D01*
X239282266Y52265200D01*
X239329885Y52360438D01*
X239329885Y52503295D01*
X239282266Y52598533D01*
X239234647Y52646152D01*
X239139409Y52693771D01*
X238853695Y52693771D01*
X238758457Y52646152D01*
X238710838Y52598533D01*
X238663219Y52503295D01*
X238663219Y52360438D01*
X238710838Y53074723D02*
X238663219Y53217580D01*
X238663219Y53455676D01*
X238710838Y53550914D01*
X238758457Y53598533D01*
X238853695Y53646152D01*
X238948933Y53646152D01*
X239044171Y53598533D01*
X239091790Y53550914D01*
X239139409Y53455676D01*
X239187028Y53265200D01*
X239234647Y53169961D01*
X239282266Y53122342D01*
X239377504Y53074723D01*
X239472742Y53074723D01*
X239567980Y53122342D01*
X239615600Y53169961D01*
X239663219Y53265200D01*
X239663219Y53503295D01*
X239615600Y53646152D01*
X238663219Y54074723D02*
X239663219Y54074723D01*
X239663219Y54312819D01*
X239615600Y54455676D01*
X239520361Y54550914D01*
X239425123Y54598533D01*
X239234647Y54646152D01*
X239091790Y54646152D01*
X238901314Y54598533D01*
X238806076Y54550914D01*
X238710838Y54455676D01*
X238663219Y54312819D01*
X238663219Y54074723D01*
X215216785Y90157142D02*
X215216785Y91357142D01*
X214702500Y90157142D02*
X214702500Y90785714D01*
X214759642Y90900000D01*
X214873928Y90957142D01*
X215045357Y90957142D01*
X215159642Y90900000D01*
X215216785Y90842857D01*
X214302500Y90957142D02*
X213845357Y90957142D01*
X214131071Y91357142D02*
X214131071Y90328571D01*
X214073928Y90214285D01*
X213959642Y90157142D01*
X213845357Y90157142D01*
X213616785Y90957142D02*
X213159642Y90957142D01*
X213445357Y91357142D02*
X213445357Y90328571D01*
X213388214Y90214285D01*
X213273928Y90157142D01*
X213159642Y90157142D01*
X212759642Y90957142D02*
X212759642Y89757142D01*
X212759642Y90900000D02*
X212645357Y90957142D01*
X212416785Y90957142D01*
X212302500Y90900000D01*
X212245357Y90842857D01*
X212188214Y90728571D01*
X212188214Y90385714D01*
X212245357Y90271428D01*
X212302500Y90214285D01*
X212416785Y90157142D01*
X212645357Y90157142D01*
X212759642Y90214285D01*
X211673928Y90271428D02*
X211616785Y90214285D01*
X211673928Y90157142D01*
X211731071Y90214285D01*
X211673928Y90271428D01*
X211673928Y90157142D01*
X211673928Y90900000D02*
X211616785Y90842857D01*
X211673928Y90785714D01*
X211731071Y90842857D01*
X211673928Y90900000D01*
X211673928Y90785714D01*
X210245357Y91414285D02*
X211273928Y89871428D01*
X208988214Y91414285D02*
X210016785Y89871428D01*
X208588214Y90957142D02*
X208588214Y89757142D01*
X208588214Y90900000D02*
X208473928Y90957142D01*
X208245357Y90957142D01*
X208131071Y90900000D01*
X208073928Y90842857D01*
X208016785Y90728571D01*
X208016785Y90385714D01*
X208073928Y90271428D01*
X208131071Y90214285D01*
X208245357Y90157142D01*
X208473928Y90157142D01*
X208588214Y90214285D01*
X207616785Y90957142D02*
X207331071Y90157142D01*
X207045357Y90957142D01*
X206416785Y90157142D02*
X206531071Y90214285D01*
X206588214Y90271428D01*
X206645357Y90385714D01*
X206645357Y90728571D01*
X206588214Y90842857D01*
X206531071Y90900000D01*
X206416785Y90957142D01*
X206245357Y90957142D01*
X206131071Y90900000D01*
X206073928Y90842857D01*
X206016785Y90728571D01*
X206016785Y90385714D01*
X206073928Y90271428D01*
X206131071Y90214285D01*
X206245357Y90157142D01*
X206416785Y90157142D01*
X205559642Y90214285D02*
X205445357Y90157142D01*
X205216785Y90157142D01*
X205102500Y90214285D01*
X205045357Y90328571D01*
X205045357Y90385714D01*
X205102500Y90500000D01*
X205216785Y90557142D01*
X205388214Y90557142D01*
X205502500Y90614285D01*
X205559642Y90728571D01*
X205559642Y90785714D01*
X205502500Y90900000D01*
X205388214Y90957142D01*
X205216785Y90957142D01*
X205102500Y90900000D01*
X204531071Y90271428D02*
X204473928Y90214285D01*
X204531071Y90157142D01*
X204588214Y90214285D01*
X204531071Y90271428D01*
X204531071Y90157142D01*
X203788214Y90157142D02*
X203902500Y90214285D01*
X203959642Y90271428D01*
X204016785Y90385714D01*
X204016785Y90728571D01*
X203959642Y90842857D01*
X203902500Y90900000D01*
X203788214Y90957142D01*
X203616785Y90957142D01*
X203502500Y90900000D01*
X203445357Y90842857D01*
X203388214Y90728571D01*
X203388214Y90385714D01*
X203445357Y90271428D01*
X203502500Y90214285D01*
X203616785Y90157142D01*
X203788214Y90157142D01*
X202873928Y90157142D02*
X202873928Y90957142D01*
X202873928Y90728571D02*
X202816785Y90842857D01*
X202759642Y90900000D01*
X202645357Y90957142D01*
X202531071Y90957142D01*
X201616785Y90957142D02*
X201616785Y89985714D01*
X201673928Y89871428D01*
X201731071Y89814285D01*
X201845357Y89757142D01*
X202016785Y89757142D01*
X202131071Y89814285D01*
X201616785Y90214285D02*
X201731071Y90157142D01*
X201959642Y90157142D01*
X202073928Y90214285D01*
X202131071Y90271428D01*
X202188214Y90385714D01*
X202188214Y90728571D01*
X202131071Y90842857D01*
X202073928Y90900000D01*
X201959642Y90957142D01*
X201731071Y90957142D01*
X201616785Y90900000D01*
X200188214Y91414285D02*
X201216785Y89871428D01*
X199273928Y90214285D02*
X199388214Y90157142D01*
X199616785Y90157142D01*
X199731071Y90214285D01*
X199788214Y90271428D01*
X199845357Y90385714D01*
X199845357Y90728571D01*
X199788214Y90842857D01*
X199731071Y90900000D01*
X199616785Y90957142D01*
X199388214Y90957142D01*
X199273928Y90900000D01*
X198588214Y90157142D02*
X198702500Y90214285D01*
X198759642Y90271428D01*
X198816785Y90385714D01*
X198816785Y90728571D01*
X198759642Y90842857D01*
X198702500Y90900000D01*
X198588214Y90957142D01*
X198416785Y90957142D01*
X198302500Y90900000D01*
X198245357Y90842857D01*
X198188214Y90728571D01*
X198188214Y90385714D01*
X198245357Y90271428D01*
X198302500Y90214285D01*
X198416785Y90157142D01*
X198588214Y90157142D01*
X197731071Y91242857D02*
X197673928Y91300000D01*
X197559642Y91357142D01*
X197273928Y91357142D01*
X197159642Y91300000D01*
X197102500Y91242857D01*
X197045357Y91128571D01*
X197045357Y91014285D01*
X197102500Y90842857D01*
X197788214Y90157142D01*
X197045357Y90157142D01*
X195673928Y91414285D02*
X196702500Y89871428D01*
X195273928Y90157142D02*
X195273928Y90957142D01*
X195273928Y90842857D02*
X195216785Y90900000D01*
X195102500Y90957142D01*
X194931071Y90957142D01*
X194816785Y90900000D01*
X194759642Y90785714D01*
X194759642Y90157142D01*
X194759642Y90785714D02*
X194702500Y90900000D01*
X194588214Y90957142D01*
X194416785Y90957142D01*
X194302500Y90900000D01*
X194245357Y90785714D01*
X194245357Y90157142D01*
X196167000Y-18581714D02*
X196928904Y-18867428D01*
X196167000Y-19153142D01*
X195690809Y-18867428D02*
X194928904Y-18867428D01*
X194452714Y-19248380D02*
X194452714Y-18248380D01*
X194119380Y-18962666D01*
X193786047Y-18248380D01*
X193786047Y-19248380D01*
X193357476Y-18962666D02*
X192881285Y-18962666D01*
X193452714Y-19248380D02*
X193119380Y-18248380D01*
X192786047Y-19248380D01*
X192547952Y-18248380D02*
X191881285Y-19248380D01*
X191881285Y-18248380D02*
X192547952Y-19248380D01*
X190309857Y-18248380D02*
X190500333Y-18248380D01*
X190595571Y-18296000D01*
X190643190Y-18343619D01*
X190738428Y-18486476D01*
X190786047Y-18676952D01*
X190786047Y-19057904D01*
X190738428Y-19153142D01*
X190690809Y-19200761D01*
X190595571Y-19248380D01*
X190405095Y-19248380D01*
X190309857Y-19200761D01*
X190262238Y-19153142D01*
X190214619Y-19057904D01*
X190214619Y-18819809D01*
X190262238Y-18724571D01*
X190309857Y-18676952D01*
X190405095Y-18629333D01*
X190595571Y-18629333D01*
X190690809Y-18676952D01*
X190738428Y-18724571D01*
X190786047Y-18819809D01*
X189928904Y-18248380D02*
X189595571Y-19248380D01*
X189262238Y-18248380D01*
X205689085Y-18196000D02*
X205803371Y-18138857D01*
X205974800Y-18138857D01*
X206146228Y-18196000D01*
X206260514Y-18310285D01*
X206317657Y-18424571D01*
X206374800Y-18653142D01*
X206374800Y-18824571D01*
X206317657Y-19053142D01*
X206260514Y-19167428D01*
X206146228Y-19281714D01*
X205974800Y-19338857D01*
X205860514Y-19338857D01*
X205689085Y-19281714D01*
X205631942Y-19224571D01*
X205631942Y-18824571D01*
X205860514Y-18824571D01*
X205117657Y-19338857D02*
X205117657Y-18138857D01*
X204431942Y-19338857D01*
X204431942Y-18138857D01*
X203860514Y-19338857D02*
X203860514Y-18138857D01*
X203574800Y-18138857D01*
X203403371Y-18196000D01*
X203289085Y-18310285D01*
X203231942Y-18424571D01*
X203174800Y-18653142D01*
X203174800Y-18824571D01*
X203231942Y-19053142D01*
X203289085Y-19167428D01*
X203403371Y-19281714D01*
X203574800Y-19338857D01*
X203860514Y-19338857D01*
X200958285Y-18138857D02*
X200558285Y-19338857D01*
X200158285Y-18138857D01*
X199758285Y-19338857D02*
X199758285Y-18138857D01*
X199186857Y-19338857D02*
X199186857Y-18138857D01*
X198501142Y-19338857D01*
X198501142Y-18138857D01*
X243542857Y21542857D02*
X242971428Y21942857D01*
X243542857Y22228571D02*
X242342857Y22228571D01*
X242342857Y21771428D01*
X242400000Y21657142D01*
X242457142Y21600000D01*
X242571428Y21542857D01*
X242742857Y21542857D01*
X242857142Y21600000D01*
X242914285Y21657142D01*
X242971428Y21771428D01*
X242971428Y22228571D01*
X242914285Y21028571D02*
X242914285Y20628571D01*
X243542857Y20457142D02*
X243542857Y21028571D01*
X242342857Y21028571D01*
X242342857Y20457142D01*
X243485714Y20000000D02*
X243542857Y19828571D01*
X243542857Y19542857D01*
X243485714Y19428571D01*
X243428571Y19371428D01*
X243314285Y19314285D01*
X243200000Y19314285D01*
X243085714Y19371428D01*
X243028571Y19428571D01*
X242971428Y19542857D01*
X242914285Y19771428D01*
X242857142Y19885714D01*
X242800000Y19942857D01*
X242685714Y20000000D01*
X242571428Y20000000D01*
X242457142Y19942857D01*
X242400000Y19885714D01*
X242342857Y19771428D01*
X242342857Y19485714D01*
X242400000Y19314285D01*
X242914285Y18800000D02*
X242914285Y18400000D01*
X243542857Y18228571D02*
X243542857Y18800000D01*
X242342857Y18800000D01*
X242342857Y18228571D01*
X242342857Y17885714D02*
X242342857Y17200000D01*
X243542857Y17542857D02*
X242342857Y17542857D01*
X232689285Y95685000D02*
X232117857Y95685000D01*
X232803571Y95342142D02*
X232403571Y96542142D01*
X232003571Y95342142D01*
X231603571Y95342142D02*
X231603571Y96542142D01*
X230917857Y95342142D01*
X230917857Y96542142D01*
X232579800Y67033819D02*
X232579800Y68033819D01*
X232341704Y68033819D01*
X232198847Y67986200D01*
X232103609Y67890961D01*
X232055990Y67795723D01*
X232008371Y67605247D01*
X232008371Y67462390D01*
X232055990Y67271914D01*
X232103609Y67176676D01*
X232198847Y67081438D01*
X232341704Y67033819D01*
X232579800Y67033819D01*
X231579800Y67033819D02*
X231579800Y68033819D01*
X230913133Y68033819D02*
X230722657Y68033819D01*
X230627419Y67986200D01*
X230532180Y67890961D01*
X230484561Y67700485D01*
X230484561Y67367152D01*
X230532180Y67176676D01*
X230627419Y67081438D01*
X230722657Y67033819D01*
X230913133Y67033819D01*
X231008371Y67081438D01*
X231103609Y67176676D01*
X231151228Y67367152D01*
X231151228Y67700485D01*
X231103609Y67890961D01*
X231008371Y67986200D01*
X230913133Y68033819D01*
X229532180Y67033819D02*
X230103609Y67033819D01*
X229817895Y67033819D02*
X229817895Y68033819D01*
X229913133Y67890961D01*
X230008371Y67795723D01*
X230103609Y67748104D01*
X225596485Y67370333D02*
X225120295Y67370333D01*
X225691723Y67084619D02*
X225358390Y68084619D01*
X225025057Y67084619D01*
X224501247Y68084619D02*
X224406009Y68084619D01*
X224310771Y68037000D01*
X224263152Y67989380D01*
X224215533Y67894142D01*
X224167914Y67703666D01*
X224167914Y67465571D01*
X224215533Y67275095D01*
X224263152Y67179857D01*
X224310771Y67132238D01*
X224406009Y67084619D01*
X224501247Y67084619D01*
X224596485Y67132238D01*
X224644104Y67179857D01*
X224691723Y67275095D01*
X224739342Y67465571D01*
X224739342Y67703666D01*
X224691723Y67894142D01*
X224644104Y67989380D01*
X224596485Y68037000D01*
X224501247Y68084619D01*
X236943876Y92791019D02*
X236753400Y92791019D01*
X236658161Y92838638D01*
X236610542Y92886257D01*
X236515304Y93029114D01*
X236467685Y93219590D01*
X236467685Y93600542D01*
X236515304Y93695780D01*
X236562923Y93743400D01*
X236658161Y93791019D01*
X236848638Y93791019D01*
X236943876Y93743400D01*
X236991495Y93695780D01*
X237039114Y93600542D01*
X237039114Y93362447D01*
X236991495Y93267209D01*
X236943876Y93219590D01*
X236848638Y93171971D01*
X236658161Y93171971D01*
X236562923Y93219590D01*
X236515304Y93267209D01*
X236467685Y93362447D01*
X232940076Y93178333D02*
X232463885Y93178333D01*
X233035314Y92892619D02*
X232701980Y93892619D01*
X232368647Y92892619D01*
X232035314Y92892619D02*
X232035314Y93892619D01*
X231463885Y92892619D01*
X231463885Y93892619D01*
X231035314Y93178333D02*
X230559123Y93178333D01*
X231130552Y92892619D02*
X230797219Y93892619D01*
X230463885Y92892619D01*
X245233676Y4419533D02*
X244662247Y4419533D01*
X244947961Y3419533D02*
X244947961Y4419533D01*
X244424152Y4419533D02*
X243757485Y3419533D01*
X243757485Y4419533D02*
X244424152Y3419533D01*
X242852723Y3419533D02*
X243424152Y3419533D01*
X243138438Y3419533D02*
X243138438Y4419533D01*
X243233676Y4276675D01*
X243328914Y4181437D01*
X243424152Y4133818D01*
X244757486Y887471D02*
X245090819Y1363661D01*
X245328914Y887471D02*
X245328914Y1887471D01*
X244947962Y1887471D01*
X244852724Y1839852D01*
X244805105Y1792232D01*
X244757486Y1696994D01*
X244757486Y1554137D01*
X244805105Y1458899D01*
X244852724Y1411280D01*
X244947962Y1363661D01*
X245328914Y1363661D01*
X244424152Y1887471D02*
X243757486Y887471D01*
X243757486Y1887471D02*
X244424152Y887471D01*
X243186057Y1887471D02*
X243090819Y1887471D01*
X242995581Y1839852D01*
X242947962Y1792232D01*
X242900343Y1696994D01*
X242852724Y1506518D01*
X242852724Y1268423D01*
X242900343Y1077947D01*
X242947962Y982709D01*
X242995581Y935090D01*
X243090819Y887471D01*
X243186057Y887471D01*
X243281295Y935090D01*
X243328914Y982709D01*
X243376533Y1077947D01*
X243424152Y1268423D01*
X243424152Y1506518D01*
X243376533Y1696994D01*
X243328914Y1792232D01*
X243281295Y1839852D01*
X243186057Y1887471D01*
X219763423Y101461142D02*
X219815804Y101408761D01*
X219972947Y101356380D01*
X220077709Y101356380D01*
X220234852Y101408761D01*
X220339614Y101513523D01*
X220391995Y101618285D01*
X220444376Y101827809D01*
X220444376Y101984952D01*
X220391995Y102194476D01*
X220339614Y102299238D01*
X220234852Y102404000D01*
X220077709Y102456380D01*
X219972947Y102456380D01*
X219815804Y102404000D01*
X219763423Y102351619D01*
X219082471Y102456380D02*
X218872947Y102456380D01*
X218768185Y102404000D01*
X218663423Y102299238D01*
X218611042Y102089714D01*
X218611042Y101723047D01*
X218663423Y101513523D01*
X218768185Y101408761D01*
X218872947Y101356380D01*
X219082471Y101356380D01*
X219187233Y101408761D01*
X219291995Y101513523D01*
X219344376Y101723047D01*
X219344376Y102089714D01*
X219291995Y102299238D01*
X219187233Y102404000D01*
X219082471Y102456380D01*
X218191995Y102351619D02*
X218139614Y102404000D01*
X218034852Y102456380D01*
X217772947Y102456380D01*
X217668185Y102404000D01*
X217615804Y102351619D01*
X217563423Y102246857D01*
X217563423Y102142095D01*
X217615804Y101984952D01*
X218244376Y101356380D01*
X217563423Y101356380D01*
X215625328Y101356380D02*
X215991995Y101880190D01*
X216253900Y101356380D02*
X216253900Y102456380D01*
X215834852Y102456380D01*
X215730090Y102404000D01*
X215677709Y102351619D01*
X215625328Y102246857D01*
X215625328Y102089714D01*
X215677709Y101984952D01*
X215730090Y101932571D01*
X215834852Y101880190D01*
X216253900Y101880190D01*
X215153900Y101932571D02*
X214787233Y101932571D01*
X214630090Y101356380D02*
X215153900Y101356380D01*
X215153900Y102456380D01*
X214630090Y102456380D01*
X214315804Y102456380D02*
X213949138Y101356380D01*
X213582471Y102456380D01*
X212377709Y101356380D02*
X212377709Y102456380D01*
X212011042Y101670666D01*
X211644376Y102456380D01*
X211644376Y101356380D01*
X229575942Y87222114D02*
X230175942Y88079257D01*
X230604514Y87222114D02*
X230604514Y89022114D01*
X229918800Y89022114D01*
X229747371Y88936400D01*
X229661657Y88850685D01*
X229575942Y88679257D01*
X229575942Y88422114D01*
X229661657Y88250685D01*
X229747371Y88164971D01*
X229918800Y88079257D01*
X230604514Y88079257D01*
X228204514Y88164971D02*
X228804514Y88164971D01*
X228804514Y87222114D02*
X228804514Y89022114D01*
X227947371Y89022114D01*
X227261657Y87222114D02*
X227261657Y89022114D01*
X226661657Y87736400D01*
X226061657Y89022114D01*
X226061657Y87222114D01*
X225118800Y87222114D02*
X224775942Y87222114D01*
X224604514Y87307828D01*
X224518800Y87393542D01*
X224347371Y87650685D01*
X224261657Y87993542D01*
X224261657Y88679257D01*
X224347371Y88850685D01*
X224433085Y88936400D01*
X224604514Y89022114D01*
X224947371Y89022114D01*
X225118800Y88936400D01*
X225204514Y88850685D01*
X225290228Y88679257D01*
X225290228Y88250685D01*
X225204514Y88079257D01*
X225118800Y87993542D01*
X224947371Y87907828D01*
X224604514Y87907828D01*
X224433085Y87993542D01*
X224347371Y88079257D01*
X224261657Y88250685D01*
X223661657Y89022114D02*
X222461657Y87222114D01*
X222461657Y89022114D02*
X223661657Y87222114D01*
X231130200Y69483342D02*
X231701628Y69483342D01*
X231701628Y70683342D01*
X230501628Y70683342D02*
X230273057Y70683342D01*
X230158771Y70626200D01*
X230044485Y70511914D01*
X229987342Y70283342D01*
X229987342Y69883342D01*
X230044485Y69654771D01*
X230158771Y69540485D01*
X230273057Y69483342D01*
X230501628Y69483342D01*
X230615914Y69540485D01*
X230730200Y69654771D01*
X230787342Y69883342D01*
X230787342Y70283342D01*
X230730200Y70511914D01*
X230615914Y70626200D01*
X230501628Y70683342D01*
X228787342Y69483342D02*
X229187342Y70054771D01*
X229473057Y69483342D02*
X229473057Y70683342D01*
X229015914Y70683342D01*
X228901628Y70626200D01*
X228844485Y70569057D01*
X228787342Y70454771D01*
X228787342Y70283342D01*
X228844485Y70169057D01*
X228901628Y70111914D01*
X229015914Y70054771D01*
X229473057Y70054771D01*
X228330200Y69826200D02*
X227758771Y69826200D01*
X228444485Y69483342D02*
X228044485Y70683342D01*
X227644485Y69483342D01*
X227358771Y70683342D02*
X227073057Y69483342D01*
X226844485Y70340485D01*
X226615914Y69483342D01*
X226330200Y70683342D01*
X225930200Y69826200D02*
X225358771Y69826200D01*
X226044485Y69483342D02*
X225644485Y70683342D01*
X225244485Y69483342D01*
X224844485Y69483342D02*
X224844485Y70683342D01*
X224158771Y69483342D01*
X224158771Y70683342D01*
X207785714Y52273809D02*
X208452380Y52273809D01*
X207404761Y52511904D02*
X208119047Y52750000D01*
X208119047Y52130952D01*
X208357142Y51750000D02*
X208404761Y51702380D01*
X208452380Y51750000D01*
X208404761Y51797619D01*
X208357142Y51750000D01*
X208452380Y51750000D01*
X207452380Y51369047D02*
X207452380Y50702380D01*
X208452380Y51130952D01*
X208452380Y50321428D02*
X207452380Y50321428D01*
X208452380Y49750000D02*
X207880952Y50178571D01*
X207452380Y49750000D02*
X208023809Y50321428D01*
X203785714Y52273809D02*
X204452380Y52273809D01*
X203404761Y52511904D02*
X204119047Y52750000D01*
X204119047Y52130952D01*
X204357142Y51750000D02*
X204404761Y51702380D01*
X204452380Y51750000D01*
X204404761Y51797619D01*
X204357142Y51750000D01*
X204452380Y51750000D01*
X203452380Y51369047D02*
X203452380Y50702380D01*
X204452380Y51130952D01*
X204452380Y50321428D02*
X203452380Y50321428D01*
X204452380Y49750000D02*
X203880952Y50178571D01*
X203452380Y49750000D02*
X204023809Y50321428D01*
X245281295Y8539214D02*
X245138438Y8491595D01*
X244900343Y8491595D01*
X244805105Y8539214D01*
X244757486Y8586833D01*
X244709867Y8682071D01*
X244709867Y8777309D01*
X244757486Y8872547D01*
X244805105Y8920166D01*
X244900343Y8967785D01*
X245090819Y9015404D01*
X245186057Y9063023D01*
X245233676Y9110642D01*
X245281295Y9205880D01*
X245281295Y9301118D01*
X245233676Y9396356D01*
X245186057Y9443976D01*
X245090819Y9491595D01*
X244852724Y9491595D01*
X244709867Y9443976D01*
X244281295Y8491595D02*
X244281295Y9491595D01*
X244043200Y9491595D01*
X243900343Y9443976D01*
X243805105Y9348737D01*
X243757486Y9253499D01*
X243709867Y9063023D01*
X243709867Y8920166D01*
X243757486Y8729690D01*
X243805105Y8634452D01*
X243900343Y8539214D01*
X244043200Y8491595D01*
X244281295Y8491595D01*
X243328914Y8777309D02*
X242852724Y8777309D01*
X243424152Y8491595D02*
X243090819Y9491595D01*
X242757486Y8491595D01*
X244947961Y-5799200D02*
X245043199Y-5751580D01*
X245186057Y-5751580D01*
X245328914Y-5799200D01*
X245424152Y-5894438D01*
X245471771Y-5989676D01*
X245519390Y-6180152D01*
X245519390Y-6323009D01*
X245471771Y-6513485D01*
X245424152Y-6608723D01*
X245328914Y-6703961D01*
X245186057Y-6751580D01*
X245090818Y-6751580D01*
X244947961Y-6703961D01*
X244900342Y-6656342D01*
X244900342Y-6323009D01*
X245090818Y-6323009D01*
X244471771Y-6751580D02*
X244471771Y-5751580D01*
X243900342Y-6751580D01*
X243900342Y-5751580D01*
X243424152Y-6751580D02*
X243424152Y-5751580D01*
X243186057Y-5751580D01*
X243043199Y-5799200D01*
X242947961Y-5894438D01*
X242900342Y-5989676D01*
X242852723Y-6180152D01*
X242852723Y-6323009D01*
X242900342Y-6513485D01*
X242947961Y-6608723D01*
X243043199Y-6703961D01*
X243186057Y-6751580D01*
X243424152Y-6751580D01*
X189076190Y70266666D02*
X188123809Y70266666D01*
X189266666Y69695238D02*
X188600000Y71695238D01*
X187933333Y69695238D01*
X244947962Y-773180D02*
X244614628Y-1773180D01*
X244281295Y-773180D01*
X243947962Y-1773180D02*
X243947962Y-773180D01*
X243947962Y-1249371D02*
X243376533Y-1249371D01*
X243376533Y-1773180D02*
X243376533Y-773180D01*
X242900343Y-1773180D02*
X242900343Y-773180D01*
X244328914Y-3168714D02*
X243709867Y-3168714D01*
X244043200Y-3549667D01*
X243900343Y-3549667D01*
X243805105Y-3597286D01*
X243757486Y-3644905D01*
X243709867Y-3740143D01*
X243709867Y-3978238D01*
X243757486Y-4073476D01*
X243805105Y-4121095D01*
X243900343Y-4168714D01*
X244186057Y-4168714D01*
X244281295Y-4121095D01*
X244328914Y-4073476D01*
X243424152Y-3168714D02*
X243090819Y-4168714D01*
X242757486Y-3168714D01*
X212285714Y52273809D02*
X212952380Y52273809D01*
X211904761Y52511904D02*
X212619047Y52750000D01*
X212619047Y52130952D01*
X212857142Y51750000D02*
X212904761Y51702380D01*
X212952380Y51750000D01*
X212904761Y51797619D01*
X212857142Y51750000D01*
X212952380Y51750000D01*
X211952380Y51369047D02*
X211952380Y50702380D01*
X212952380Y51130952D01*
X212952380Y50321428D02*
X211952380Y50321428D01*
X212952380Y49750000D02*
X212380952Y50178571D01*
X211952380Y49750000D02*
X212523809Y50321428D01*
X215785714Y52273809D02*
X216452380Y52273809D01*
X215404761Y52511904D02*
X216119047Y52750000D01*
X216119047Y52130952D01*
X216357142Y51750000D02*
X216404761Y51702380D01*
X216452380Y51750000D01*
X216404761Y51797619D01*
X216357142Y51750000D01*
X216452380Y51750000D01*
X215452380Y51369047D02*
X215452380Y50702380D01*
X216452380Y51130952D01*
X216452380Y50321428D02*
X215452380Y50321428D01*
X216452380Y49750000D02*
X215880952Y50178571D01*
X215452380Y49750000D02*
X216023809Y50321428D01*
D11*
%TO.C,D1*%
X194730000Y-7070000D02*
X194730000Y-3130000D01*
X194730000Y-3130000D02*
X203870000Y-3130000D01*
X203870000Y-3130000D02*
X203870000Y-7070000D01*
X203870000Y-7070000D02*
X194730000Y-7070000D01*
X194590000Y-5100000D02*
X194730000Y-5100000D01*
X204010000Y-5100000D02*
X203870000Y-5100000D01*
X196185000Y-7070000D02*
X196185000Y-3130000D01*
X196305000Y-7070000D02*
X196305000Y-3130000D01*
X196065000Y-7070000D02*
X196065000Y-3130000D01*
%TO.C,C2*%
X235520000Y3350000D02*
G75*
G03*
X235520000Y3350000I-2620000J0D01*
G01*
X235480000Y3350000D02*
X230320000Y3350000D01*
X235480000Y3390000D02*
X230320000Y3390000D01*
X235479000Y3430000D02*
X230321000Y3430000D01*
X235478000Y3470000D02*
X230322000Y3470000D01*
X235476000Y3510000D02*
X230324000Y3510000D01*
X235473000Y3550000D02*
X230327000Y3550000D01*
X235469000Y3590000D02*
X233940000Y3590000D01*
X231860000Y3590000D02*
X230331000Y3590000D01*
X235465000Y3630000D02*
X233940000Y3630000D01*
X231860000Y3630000D02*
X230335000Y3630000D01*
X235461000Y3670000D02*
X233940000Y3670000D01*
X231860000Y3670000D02*
X230339000Y3670000D01*
X235456000Y3710000D02*
X233940000Y3710000D01*
X231860000Y3710000D02*
X230344000Y3710000D01*
X235450000Y3750000D02*
X233940000Y3750000D01*
X231860000Y3750000D02*
X230350000Y3750000D01*
X235443000Y3790000D02*
X233940000Y3790000D01*
X231860000Y3790000D02*
X230357000Y3790000D01*
X235436000Y3830000D02*
X233940000Y3830000D01*
X231860000Y3830000D02*
X230364000Y3830000D01*
X235428000Y3870000D02*
X233940000Y3870000D01*
X231860000Y3870000D02*
X230372000Y3870000D01*
X235420000Y3910000D02*
X233940000Y3910000D01*
X231860000Y3910000D02*
X230380000Y3910000D01*
X235411000Y3950000D02*
X233940000Y3950000D01*
X231860000Y3950000D02*
X230389000Y3950000D01*
X235401000Y3990000D02*
X233940000Y3990000D01*
X231860000Y3990000D02*
X230399000Y3990000D01*
X235391000Y4030000D02*
X233940000Y4030000D01*
X231860000Y4030000D02*
X230409000Y4030000D01*
X235380000Y4071000D02*
X233940000Y4071000D01*
X231860000Y4071000D02*
X230420000Y4071000D01*
X235368000Y4111000D02*
X233940000Y4111000D01*
X231860000Y4111000D02*
X230432000Y4111000D01*
X235355000Y4151000D02*
X233940000Y4151000D01*
X231860000Y4151000D02*
X230445000Y4151000D01*
X235342000Y4191000D02*
X233940000Y4191000D01*
X231860000Y4191000D02*
X230458000Y4191000D01*
X235328000Y4231000D02*
X233940000Y4231000D01*
X231860000Y4231000D02*
X230472000Y4231000D01*
X235314000Y4271000D02*
X233940000Y4271000D01*
X231860000Y4271000D02*
X230486000Y4271000D01*
X235298000Y4311000D02*
X233940000Y4311000D01*
X231860000Y4311000D02*
X230502000Y4311000D01*
X235282000Y4351000D02*
X233940000Y4351000D01*
X231860000Y4351000D02*
X230518000Y4351000D01*
X235265000Y4391000D02*
X233940000Y4391000D01*
X231860000Y4391000D02*
X230535000Y4391000D01*
X235248000Y4431000D02*
X233940000Y4431000D01*
X231860000Y4431000D02*
X230552000Y4431000D01*
X235229000Y4471000D02*
X233940000Y4471000D01*
X231860000Y4471000D02*
X230571000Y4471000D01*
X235210000Y4511000D02*
X233940000Y4511000D01*
X231860000Y4511000D02*
X230590000Y4511000D01*
X235190000Y4551000D02*
X233940000Y4551000D01*
X231860000Y4551000D02*
X230610000Y4551000D01*
X235168000Y4591000D02*
X233940000Y4591000D01*
X231860000Y4591000D02*
X230632000Y4591000D01*
X235147000Y4631000D02*
X233940000Y4631000D01*
X231860000Y4631000D02*
X230653000Y4631000D01*
X235124000Y4671000D02*
X233940000Y4671000D01*
X231860000Y4671000D02*
X230676000Y4671000D01*
X235100000Y4711000D02*
X233940000Y4711000D01*
X231860000Y4711000D02*
X230700000Y4711000D01*
X235075000Y4751000D02*
X233940000Y4751000D01*
X231860000Y4751000D02*
X230725000Y4751000D01*
X235049000Y4791000D02*
X233940000Y4791000D01*
X231860000Y4791000D02*
X230751000Y4791000D01*
X235022000Y4831000D02*
X233940000Y4831000D01*
X231860000Y4831000D02*
X230778000Y4831000D01*
X234995000Y4871000D02*
X233940000Y4871000D01*
X231860000Y4871000D02*
X230805000Y4871000D01*
X234965000Y4911000D02*
X233940000Y4911000D01*
X231860000Y4911000D02*
X230835000Y4911000D01*
X234935000Y4951000D02*
X233940000Y4951000D01*
X231860000Y4951000D02*
X230865000Y4951000D01*
X234904000Y4991000D02*
X233940000Y4991000D01*
X231860000Y4991000D02*
X230896000Y4991000D01*
X234871000Y5031000D02*
X233940000Y5031000D01*
X231860000Y5031000D02*
X230929000Y5031000D01*
X234837000Y5071000D02*
X233940000Y5071000D01*
X231860000Y5071000D02*
X230963000Y5071000D01*
X234801000Y5111000D02*
X233940000Y5111000D01*
X231860000Y5111000D02*
X230999000Y5111000D01*
X234764000Y5151000D02*
X233940000Y5151000D01*
X231860000Y5151000D02*
X231036000Y5151000D01*
X234726000Y5191000D02*
X233940000Y5191000D01*
X231860000Y5191000D02*
X231074000Y5191000D01*
X234685000Y5231000D02*
X233940000Y5231000D01*
X231860000Y5231000D02*
X231115000Y5231000D01*
X234643000Y5271000D02*
X233940000Y5271000D01*
X231860000Y5271000D02*
X231157000Y5271000D01*
X234599000Y5311000D02*
X233940000Y5311000D01*
X231860000Y5311000D02*
X231201000Y5311000D01*
X234553000Y5351000D02*
X233940000Y5351000D01*
X231860000Y5351000D02*
X231247000Y5351000D01*
X234505000Y5391000D02*
X233940000Y5391000D01*
X231860000Y5391000D02*
X231295000Y5391000D01*
X234454000Y5431000D02*
X233940000Y5431000D01*
X231860000Y5431000D02*
X231346000Y5431000D01*
X234400000Y5471000D02*
X233940000Y5471000D01*
X231860000Y5471000D02*
X231400000Y5471000D01*
X234343000Y5511000D02*
X233940000Y5511000D01*
X231860000Y5511000D02*
X231457000Y5511000D01*
X234283000Y5551000D02*
X233940000Y5551000D01*
X231860000Y5551000D02*
X231517000Y5551000D01*
X234219000Y5591000D02*
X233940000Y5591000D01*
X231860000Y5591000D02*
X231581000Y5591000D01*
X234151000Y5631000D02*
X233940000Y5631000D01*
X231860000Y5631000D02*
X231649000Y5631000D01*
X234078000Y5671000D02*
X231722000Y5671000D01*
X233998000Y5711000D02*
X231802000Y5711000D01*
X233911000Y5751000D02*
X231889000Y5751000D01*
X233815000Y5791000D02*
X231985000Y5791000D01*
X233705000Y5831000D02*
X232095000Y5831000D01*
X233577000Y5871000D02*
X232223000Y5871000D01*
X233418000Y5911000D02*
X232382000Y5911000D01*
X233184000Y5951000D02*
X232616000Y5951000D01*
X234375000Y545225D02*
X234375000Y1045225D01*
X234625000Y795225D02*
X234125000Y795225D01*
%TO.C,C1*%
X235420000Y-3400000D02*
G75*
G03*
X235420000Y-3400000I-2620000J0D01*
G01*
X235380000Y-3400000D02*
X230220000Y-3400000D01*
X235380000Y-3360000D02*
X230220000Y-3360000D01*
X235379000Y-3320000D02*
X230221000Y-3320000D01*
X235378000Y-3280000D02*
X230222000Y-3280000D01*
X235376000Y-3240000D02*
X230224000Y-3240000D01*
X235373000Y-3200000D02*
X230227000Y-3200000D01*
X235369000Y-3160000D02*
X233840000Y-3160000D01*
X231760000Y-3160000D02*
X230231000Y-3160000D01*
X235365000Y-3120000D02*
X233840000Y-3120000D01*
X231760000Y-3120000D02*
X230235000Y-3120000D01*
X235361000Y-3080000D02*
X233840000Y-3080000D01*
X231760000Y-3080000D02*
X230239000Y-3080000D01*
X235356000Y-3040000D02*
X233840000Y-3040000D01*
X231760000Y-3040000D02*
X230244000Y-3040000D01*
X235350000Y-3000000D02*
X233840000Y-3000000D01*
X231760000Y-3000000D02*
X230250000Y-3000000D01*
X235343000Y-2960000D02*
X233840000Y-2960000D01*
X231760000Y-2960000D02*
X230257000Y-2960000D01*
X235336000Y-2920000D02*
X233840000Y-2920000D01*
X231760000Y-2920000D02*
X230264000Y-2920000D01*
X235328000Y-2880000D02*
X233840000Y-2880000D01*
X231760000Y-2880000D02*
X230272000Y-2880000D01*
X235320000Y-2840000D02*
X233840000Y-2840000D01*
X231760000Y-2840000D02*
X230280000Y-2840000D01*
X235311000Y-2800000D02*
X233840000Y-2800000D01*
X231760000Y-2800000D02*
X230289000Y-2800000D01*
X235301000Y-2760000D02*
X233840000Y-2760000D01*
X231760000Y-2760000D02*
X230299000Y-2760000D01*
X235291000Y-2720000D02*
X233840000Y-2720000D01*
X231760000Y-2720000D02*
X230309000Y-2720000D01*
X235280000Y-2679000D02*
X233840000Y-2679000D01*
X231760000Y-2679000D02*
X230320000Y-2679000D01*
X235268000Y-2639000D02*
X233840000Y-2639000D01*
X231760000Y-2639000D02*
X230332000Y-2639000D01*
X235255000Y-2599000D02*
X233840000Y-2599000D01*
X231760000Y-2599000D02*
X230345000Y-2599000D01*
X235242000Y-2559000D02*
X233840000Y-2559000D01*
X231760000Y-2559000D02*
X230358000Y-2559000D01*
X235228000Y-2519000D02*
X233840000Y-2519000D01*
X231760000Y-2519000D02*
X230372000Y-2519000D01*
X235214000Y-2479000D02*
X233840000Y-2479000D01*
X231760000Y-2479000D02*
X230386000Y-2479000D01*
X235198000Y-2439000D02*
X233840000Y-2439000D01*
X231760000Y-2439000D02*
X230402000Y-2439000D01*
X235182000Y-2399000D02*
X233840000Y-2399000D01*
X231760000Y-2399000D02*
X230418000Y-2399000D01*
X235165000Y-2359000D02*
X233840000Y-2359000D01*
X231760000Y-2359000D02*
X230435000Y-2359000D01*
X235148000Y-2319000D02*
X233840000Y-2319000D01*
X231760000Y-2319000D02*
X230452000Y-2319000D01*
X235129000Y-2279000D02*
X233840000Y-2279000D01*
X231760000Y-2279000D02*
X230471000Y-2279000D01*
X235110000Y-2239000D02*
X233840000Y-2239000D01*
X231760000Y-2239000D02*
X230490000Y-2239000D01*
X235090000Y-2199000D02*
X233840000Y-2199000D01*
X231760000Y-2199000D02*
X230510000Y-2199000D01*
X235068000Y-2159000D02*
X233840000Y-2159000D01*
X231760000Y-2159000D02*
X230532000Y-2159000D01*
X235047000Y-2119000D02*
X233840000Y-2119000D01*
X231760000Y-2119000D02*
X230553000Y-2119000D01*
X235024000Y-2079000D02*
X233840000Y-2079000D01*
X231760000Y-2079000D02*
X230576000Y-2079000D01*
X235000000Y-2039000D02*
X233840000Y-2039000D01*
X231760000Y-2039000D02*
X230600000Y-2039000D01*
X234975000Y-1999000D02*
X233840000Y-1999000D01*
X231760000Y-1999000D02*
X230625000Y-1999000D01*
X234949000Y-1959000D02*
X233840000Y-1959000D01*
X231760000Y-1959000D02*
X230651000Y-1959000D01*
X234922000Y-1919000D02*
X233840000Y-1919000D01*
X231760000Y-1919000D02*
X230678000Y-1919000D01*
X234895000Y-1879000D02*
X233840000Y-1879000D01*
X231760000Y-1879000D02*
X230705000Y-1879000D01*
X234865000Y-1839000D02*
X233840000Y-1839000D01*
X231760000Y-1839000D02*
X230735000Y-1839000D01*
X234835000Y-1799000D02*
X233840000Y-1799000D01*
X231760000Y-1799000D02*
X230765000Y-1799000D01*
X234804000Y-1759000D02*
X233840000Y-1759000D01*
X231760000Y-1759000D02*
X230796000Y-1759000D01*
X234771000Y-1719000D02*
X233840000Y-1719000D01*
X231760000Y-1719000D02*
X230829000Y-1719000D01*
X234737000Y-1679000D02*
X233840000Y-1679000D01*
X231760000Y-1679000D02*
X230863000Y-1679000D01*
X234701000Y-1639000D02*
X233840000Y-1639000D01*
X231760000Y-1639000D02*
X230899000Y-1639000D01*
X234664000Y-1599000D02*
X233840000Y-1599000D01*
X231760000Y-1599000D02*
X230936000Y-1599000D01*
X234626000Y-1559000D02*
X233840000Y-1559000D01*
X231760000Y-1559000D02*
X230974000Y-1559000D01*
X234585000Y-1519000D02*
X233840000Y-1519000D01*
X231760000Y-1519000D02*
X231015000Y-1519000D01*
X234543000Y-1479000D02*
X233840000Y-1479000D01*
X231760000Y-1479000D02*
X231057000Y-1479000D01*
X234499000Y-1439000D02*
X233840000Y-1439000D01*
X231760000Y-1439000D02*
X231101000Y-1439000D01*
X234453000Y-1399000D02*
X233840000Y-1399000D01*
X231760000Y-1399000D02*
X231147000Y-1399000D01*
X234405000Y-1359000D02*
X233840000Y-1359000D01*
X231760000Y-1359000D02*
X231195000Y-1359000D01*
X234354000Y-1319000D02*
X233840000Y-1319000D01*
X231760000Y-1319000D02*
X231246000Y-1319000D01*
X234300000Y-1279000D02*
X233840000Y-1279000D01*
X231760000Y-1279000D02*
X231300000Y-1279000D01*
X234243000Y-1239000D02*
X233840000Y-1239000D01*
X231760000Y-1239000D02*
X231357000Y-1239000D01*
X234183000Y-1199000D02*
X233840000Y-1199000D01*
X231760000Y-1199000D02*
X231417000Y-1199000D01*
X234119000Y-1159000D02*
X233840000Y-1159000D01*
X231760000Y-1159000D02*
X231481000Y-1159000D01*
X234051000Y-1119000D02*
X233840000Y-1119000D01*
X231760000Y-1119000D02*
X231549000Y-1119000D01*
X233978000Y-1079000D02*
X231622000Y-1079000D01*
X233898000Y-1039000D02*
X231702000Y-1039000D01*
X233811000Y-999000D02*
X231789000Y-999000D01*
X233715000Y-959000D02*
X231885000Y-959000D01*
X233605000Y-919000D02*
X231995000Y-919000D01*
X233477000Y-879000D02*
X232123000Y-879000D01*
X233318000Y-839000D02*
X232282000Y-839000D01*
X233084000Y-799000D02*
X232516000Y-799000D01*
X234275000Y-6204775D02*
X234275000Y-5704775D01*
X234525000Y-5954775D02*
X234025000Y-5954775D01*
%TO.C,J9*%
X226220000Y-8120000D02*
X226220000Y-10780000D01*
X226220000Y-8120000D02*
X231360000Y-8120000D01*
X231360000Y-8120000D02*
X231360000Y-10780000D01*
X226220000Y-10780000D02*
X231360000Y-10780000D01*
X223620000Y-10780000D02*
X224950000Y-10780000D01*
X223620000Y-9450000D02*
X223620000Y-10780000D01*
%TO.C,SW2*%
X197414214Y54000000D02*
G75*
G03*
X197414214Y54000000I-1414214J0D01*
G01*
X192880000Y51030000D02*
X192880000Y56970000D01*
X199120000Y51030000D02*
X199120000Y56970000D01*
X194660000Y50880000D02*
X197340000Y50880000D01*
X197340000Y57120000D02*
X194660000Y57120000D01*
%TO.C,R1*%
X202280000Y55770000D02*
X205720000Y55770000D01*
X205720000Y55770000D02*
X205720000Y46530000D01*
X205720000Y46530000D02*
X202280000Y46530000D01*
X202280000Y46530000D02*
X202280000Y55770000D01*
X204000000Y56460000D02*
X204000000Y55770000D01*
X204000000Y45840000D02*
X204000000Y46530000D01*
%TO.C,J6*%
X245285000Y31840000D02*
X245285000Y27960000D01*
X240815000Y26790000D02*
X240815000Y27840000D01*
X243315000Y26790000D02*
X240815000Y26790000D01*
X240815000Y31960000D02*
X239825000Y31960000D01*
X240815000Y33010000D02*
X240815000Y31960000D01*
X243315000Y33010000D02*
X240815000Y33010000D01*
%TO.C,J4*%
X219738000Y-4535600D02*
X217138000Y-4535600D01*
X219738000Y-19235600D02*
X219738000Y-4535600D01*
X210538000Y-4535600D02*
X210538000Y-6435600D01*
X213238000Y-4535600D02*
X210538000Y-4535600D01*
X210538000Y-19235600D02*
X219738000Y-19235600D01*
X210538000Y-10435600D02*
X210538000Y-19235600D01*
X219938000Y-5385600D02*
X219938000Y-4335600D01*
X218888000Y-4335600D02*
X219938000Y-4335600D01*
%TO.C,R5*%
X222780000Y55770000D02*
X226220000Y55770000D01*
X226220000Y55770000D02*
X226220000Y46530000D01*
X226220000Y46530000D02*
X222780000Y46530000D01*
X222780000Y46530000D02*
X222780000Y55770000D01*
X224500000Y56460000D02*
X224500000Y55770000D01*
X224500000Y45840000D02*
X224500000Y46530000D01*
%TO.C,SW3*%
X234130000Y20990000D02*
X234130000Y18310000D01*
X240370000Y18310000D02*
X240370000Y20990000D01*
X240220000Y22770000D02*
X234280000Y22770000D01*
X240220000Y16530000D02*
X234280000Y16530000D01*
X238664214Y19650000D02*
G75*
G03*
X238664214Y19650000I-1414214J0D01*
G01*
%TO.C,J7*%
X207130000Y-12050000D02*
G75*
G03*
X207130000Y-12050000I-2180000J0D01*
G01*
X202130000Y-12050000D02*
G75*
G03*
X202130000Y-12050000I-2180000J0D01*
G01*
X207510000Y-16650000D02*
X197390000Y-16650000D01*
X207510000Y-15550000D02*
X197390000Y-15550000D01*
X207510000Y-7990000D02*
X197390000Y-7990000D01*
X207510000Y-17110000D02*
X197390000Y-17110000D01*
X207510000Y-7990000D02*
X207510000Y-17110000D01*
X197390000Y-7990000D02*
X197390000Y-17110000D01*
X203296000Y-10662000D02*
X203403000Y-10769000D01*
X206232000Y-13597000D02*
X206338000Y-13704000D01*
X203562000Y-10396000D02*
X203669000Y-10503000D01*
X206498000Y-13331000D02*
X206604000Y-13438000D01*
X198296000Y-10662000D02*
X198691000Y-11058000D01*
X200957000Y-13324000D02*
X201337000Y-13704000D01*
X198562000Y-10396000D02*
X198942000Y-10776000D01*
X201208000Y-13042000D02*
X201603000Y-13438000D01*
X207750000Y-16710000D02*
X207750000Y-17350000D01*
X207750000Y-17350000D02*
X207350000Y-17350000D01*
D10*
%TO.C,J15*%
X242066000Y46134200D02*
G75*
G02*
X242316000Y45884200I0J-250000D01*
G01*
X241066000Y46134200D02*
G75*
G02*
X240566000Y46634200I0J500000D01*
G01*
X242316000Y56884200D02*
G75*
G02*
X242066000Y56634200I-250000J0D01*
G01*
X240566000Y56134200D02*
G75*
G02*
X241066000Y56634200I500000J0D01*
G01*
X246166000Y56884200D02*
G75*
G02*
X246666000Y56384200I0J-500000D01*
G01*
X246666000Y46384200D02*
G75*
G02*
X246166000Y45884200I-500000J0D01*
G01*
X246166000Y45884200D02*
X242816000Y45884200D01*
X246666000Y56384200D02*
X246666000Y46384200D01*
X242816000Y56884200D02*
X246166000Y56884200D01*
X242316000Y45884200D02*
X242316000Y45384200D01*
X242066000Y46134200D02*
X241066000Y46134200D01*
X242066000Y56634200D02*
X241066000Y56634200D01*
X242316000Y57334200D02*
X242316000Y56884200D01*
X240516000Y56134200D02*
X240516000Y46634200D01*
X242316000Y57334200D02*
X230866000Y57334200D01*
X242316000Y45384200D02*
X230866000Y45384200D01*
X230866000Y57334200D02*
X230866000Y45384200D01*
D11*
%TO.C,R4*%
X214280000Y55770000D02*
X217720000Y55770000D01*
X217720000Y55770000D02*
X217720000Y46530000D01*
X217720000Y46530000D02*
X214280000Y46530000D01*
X214280000Y46530000D02*
X214280000Y55770000D01*
X216000000Y56460000D02*
X216000000Y55770000D01*
X216000000Y45840000D02*
X216000000Y46530000D01*
%TO.C,R3*%
X210280000Y55770000D02*
X213720000Y55770000D01*
X213720000Y55770000D02*
X213720000Y46530000D01*
X213720000Y46530000D02*
X210280000Y46530000D01*
X210280000Y46530000D02*
X210280000Y55770000D01*
X212000000Y56460000D02*
X212000000Y55770000D01*
X212000000Y45840000D02*
X212000000Y46530000D01*
%TO.C,R2*%
X206280000Y55770000D02*
X209720000Y55770000D01*
X209720000Y55770000D02*
X209720000Y46530000D01*
X209720000Y46530000D02*
X206280000Y46530000D01*
X206280000Y46530000D02*
X206280000Y55770000D01*
X208000000Y56460000D02*
X208000000Y55770000D01*
X208000000Y45840000D02*
X208000000Y46530000D01*
%TO.C,C5*%
X233528733Y61310000D02*
X233871267Y61310000D01*
X233528733Y60290000D02*
X233871267Y60290000D01*
%TO.C,JP1*%
X229025400Y68587800D02*
X226225400Y68587800D01*
X226225400Y68587800D02*
X226225400Y66587800D01*
X226225400Y66587800D02*
X229025400Y66587800D01*
X229025400Y66587800D02*
X229025400Y68587800D01*
D12*
%TO.C,U1*%
X219049600Y78248000D02*
X235049600Y78248000D01*
X219049600Y90048000D02*
X219049600Y90448000D01*
X219049600Y88048000D02*
X219049600Y88448000D01*
X219049600Y86048000D02*
X219049600Y86448000D01*
X219049600Y84048000D02*
X219049600Y84448000D01*
X219049600Y82448000D02*
X219049600Y82048000D01*
X219049600Y80448000D02*
X219049600Y80048000D01*
X218049600Y78448000D02*
X219049600Y78448000D01*
X219049600Y78448000D02*
X219049600Y78248000D01*
X219049600Y92048000D02*
X219049600Y92448000D01*
X235049600Y78248000D02*
X235049600Y78448000D01*
X235049600Y80048000D02*
X235049600Y80448000D01*
X235049600Y82048000D02*
X235049600Y82448000D01*
X235049600Y84048000D02*
X235049600Y84448000D01*
X235049600Y86048000D02*
X235049600Y86448000D01*
X235049600Y88048000D02*
X235049600Y88448000D01*
X235049600Y90048000D02*
X235049600Y90448000D01*
X235049600Y92048000D02*
X235049600Y92448000D01*
X235049600Y94048000D02*
X235049600Y94248000D01*
X235049600Y94248000D02*
X219049600Y94248000D01*
X219049600Y94248000D02*
X219049600Y94048000D01*
D11*
%TO.C,SW1*%
X194744214Y70204400D02*
G75*
G03*
X194744214Y70204400I-1414214J0D01*
G01*
X190210000Y67234400D02*
X190210000Y73174400D01*
X196450000Y67234400D02*
X196450000Y73174400D01*
X191990000Y67084400D02*
X194670000Y67084400D01*
X194670000Y73324400D02*
X191990000Y73324400D01*
%TO.C,D1*%
D10*
X190588095Y-5452380D02*
X190588095Y-4452380D01*
X190350000Y-4452380D01*
X190207142Y-4500000D01*
X190111904Y-4595238D01*
X190064285Y-4690476D01*
X190016666Y-4880952D01*
X190016666Y-5023809D01*
X190064285Y-5214285D01*
X190111904Y-5309523D01*
X190207142Y-5404761D01*
X190350000Y-5452380D01*
X190588095Y-5452380D01*
X189064285Y-5452380D02*
X189635714Y-5452380D01*
X189350000Y-5452380D02*
X189350000Y-4452380D01*
X189445238Y-4595238D01*
X189540476Y-4690476D01*
X189635714Y-4738095D01*
X197311904Y-5302380D02*
X197311904Y-4302380D01*
X196740476Y-5302380D02*
X197169047Y-4730952D01*
X196740476Y-4302380D02*
X197311904Y-4873809D01*
%TO.C,C2*%
X236907142Y3366666D02*
X236954761Y3414285D01*
X237002380Y3557142D01*
X237002380Y3652380D01*
X236954761Y3795238D01*
X236859523Y3890476D01*
X236764285Y3938095D01*
X236573809Y3985714D01*
X236430952Y3985714D01*
X236240476Y3938095D01*
X236145238Y3890476D01*
X236050000Y3795238D01*
X236002380Y3652380D01*
X236002380Y3557142D01*
X236050000Y3414285D01*
X236097619Y3366666D01*
X236097619Y2985714D02*
X236050000Y2938095D01*
X236002380Y2842857D01*
X236002380Y2604761D01*
X236050000Y2509523D01*
X236097619Y2461904D01*
X236192857Y2414285D01*
X236288095Y2414285D01*
X236430952Y2461904D01*
X237002380Y3033333D01*
X237002380Y2414285D01*
%TO.C,C1*%
X236907142Y-3283333D02*
X236954761Y-3235714D01*
X237002380Y-3092857D01*
X237002380Y-2997619D01*
X236954761Y-2854761D01*
X236859523Y-2759523D01*
X236764285Y-2711904D01*
X236573809Y-2664285D01*
X236430952Y-2664285D01*
X236240476Y-2711904D01*
X236145238Y-2759523D01*
X236050000Y-2854761D01*
X236002380Y-2997619D01*
X236002380Y-3092857D01*
X236050000Y-3235714D01*
X236097619Y-3283333D01*
X237002380Y-4235714D02*
X237002380Y-3664285D01*
X237002380Y-3950000D02*
X236002380Y-3950000D01*
X236145238Y-3854761D01*
X236240476Y-3759523D01*
X236288095Y-3664285D01*
%TO.C,J9*%
X224833333Y-6102380D02*
X224833333Y-6816666D01*
X224880952Y-6959523D01*
X224976190Y-7054761D01*
X225119047Y-7102380D01*
X225214285Y-7102380D01*
X224309523Y-7102380D02*
X224119047Y-7102380D01*
X224023809Y-7054761D01*
X223976190Y-7007142D01*
X223880952Y-6864285D01*
X223833333Y-6673809D01*
X223833333Y-6292857D01*
X223880952Y-6197619D01*
X223928571Y-6150000D01*
X224023809Y-6102380D01*
X224214285Y-6102380D01*
X224309523Y-6150000D01*
X224357142Y-6197619D01*
X224404761Y-6292857D01*
X224404761Y-6530952D01*
X224357142Y-6626190D01*
X224309523Y-6673809D01*
X224214285Y-6721428D01*
X224023809Y-6721428D01*
X223928571Y-6673809D01*
X223880952Y-6626190D01*
X223833333Y-6530952D01*
%TO.C,SW2*%
X197333333Y58595238D02*
X197190476Y58547619D01*
X196952380Y58547619D01*
X196857142Y58595238D01*
X196809523Y58642857D01*
X196761904Y58738095D01*
X196761904Y58833333D01*
X196809523Y58928571D01*
X196857142Y58976190D01*
X196952380Y59023809D01*
X197142857Y59071428D01*
X197238095Y59119047D01*
X197285714Y59166666D01*
X197333333Y59261904D01*
X197333333Y59357142D01*
X197285714Y59452380D01*
X197238095Y59500000D01*
X197142857Y59547619D01*
X196904761Y59547619D01*
X196761904Y59500000D01*
X196428571Y59547619D02*
X196190476Y58547619D01*
X196000000Y59261904D01*
X195809523Y58547619D01*
X195571428Y59547619D01*
X195238095Y59452380D02*
X195190476Y59500000D01*
X195095238Y59547619D01*
X194857142Y59547619D01*
X194761904Y59500000D01*
X194714285Y59452380D01*
X194666666Y59357142D01*
X194666666Y59261904D01*
X194714285Y59119047D01*
X195285714Y58547619D01*
X194666666Y58547619D01*
%TO.C,R1*%
X204166666Y59197619D02*
X204500000Y59673809D01*
X204738095Y59197619D02*
X204738095Y60197619D01*
X204357142Y60197619D01*
X204261904Y60150000D01*
X204214285Y60102380D01*
X204166666Y60007142D01*
X204166666Y59864285D01*
X204214285Y59769047D01*
X204261904Y59721428D01*
X204357142Y59673809D01*
X204738095Y59673809D01*
X203214285Y59197619D02*
X203785714Y59197619D01*
X203500000Y59197619D02*
X203500000Y60197619D01*
X203595238Y60054761D01*
X203690476Y59959523D01*
X203785714Y59911904D01*
%TO.C,J6*%
X243034933Y26129619D02*
X243034933Y25415333D01*
X243082552Y25272476D01*
X243177790Y25177238D01*
X243320647Y25129619D01*
X243415885Y25129619D01*
X242130171Y26129619D02*
X242320647Y26129619D01*
X242415885Y26082000D01*
X242463504Y26034380D01*
X242558742Y25891523D01*
X242606361Y25701047D01*
X242606361Y25320095D01*
X242558742Y25224857D01*
X242511123Y25177238D01*
X242415885Y25129619D01*
X242225409Y25129619D01*
X242130171Y25177238D01*
X242082552Y25224857D01*
X242034933Y25320095D01*
X242034933Y25558190D01*
X242082552Y25653428D01*
X242130171Y25701047D01*
X242225409Y25748666D01*
X242415885Y25748666D01*
X242511123Y25701047D01*
X242558742Y25653428D01*
X242606361Y25558190D01*
%TO.C,J4*%
X212321733Y-17486380D02*
X212321733Y-18200666D01*
X212369352Y-18343523D01*
X212464590Y-18438761D01*
X212607447Y-18486380D01*
X212702685Y-18486380D01*
X211416971Y-17819714D02*
X211416971Y-18486380D01*
X211655066Y-17438761D02*
X211893161Y-18153047D01*
X211274114Y-18153047D01*
%TO.C,R5*%
X224566666Y59347619D02*
X224900000Y59823809D01*
X225138095Y59347619D02*
X225138095Y60347619D01*
X224757142Y60347619D01*
X224661904Y60300000D01*
X224614285Y60252380D01*
X224566666Y60157142D01*
X224566666Y60014285D01*
X224614285Y59919047D01*
X224661904Y59871428D01*
X224757142Y59823809D01*
X225138095Y59823809D01*
X223661904Y60347619D02*
X224138095Y60347619D01*
X224185714Y59871428D01*
X224138095Y59919047D01*
X224042857Y59966666D01*
X223804761Y59966666D01*
X223709523Y59919047D01*
X223661904Y59871428D01*
X223614285Y59776190D01*
X223614285Y59538095D01*
X223661904Y59442857D01*
X223709523Y59395238D01*
X223804761Y59347619D01*
X224042857Y59347619D01*
X224138095Y59395238D01*
X224185714Y59442857D01*
%TO.C,SW3*%
X232548161Y21277533D02*
X232595780Y21134676D01*
X232595780Y20896580D01*
X232548161Y20801342D01*
X232500542Y20753723D01*
X232405304Y20706104D01*
X232310066Y20706104D01*
X232214828Y20753723D01*
X232167209Y20801342D01*
X232119590Y20896580D01*
X232071971Y21087057D01*
X232024352Y21182295D01*
X231976733Y21229914D01*
X231881495Y21277533D01*
X231786257Y21277533D01*
X231691019Y21229914D01*
X231643400Y21182295D01*
X231595780Y21087057D01*
X231595780Y20848961D01*
X231643400Y20706104D01*
X231595780Y20372771D02*
X232595780Y20134676D01*
X231881495Y19944200D01*
X232595780Y19753723D01*
X231595780Y19515628D01*
X231595780Y19229914D02*
X231595780Y18610866D01*
X231976733Y18944200D01*
X231976733Y18801342D01*
X232024352Y18706104D01*
X232071971Y18658485D01*
X232167209Y18610866D01*
X232405304Y18610866D01*
X232500542Y18658485D01*
X232548161Y18706104D01*
X232595780Y18801342D01*
X232595780Y19087057D01*
X232548161Y19182295D01*
X232500542Y19229914D01*
%TO.C,J7*%
X202743333Y-8505180D02*
X202743333Y-9219466D01*
X202790952Y-9362323D01*
X202886190Y-9457561D01*
X203029047Y-9505180D01*
X203124285Y-9505180D01*
X202362380Y-8505180D02*
X201695714Y-8505180D01*
X202124285Y-9505180D01*
%TO.C,J15*%
X240433123Y58916819D02*
X240433123Y58202533D01*
X240480742Y58059676D01*
X240575980Y57964438D01*
X240718838Y57916819D01*
X240814076Y57916819D01*
X239433123Y57916819D02*
X240004552Y57916819D01*
X239718838Y57916819D02*
X239718838Y58916819D01*
X239814076Y58773961D01*
X239909314Y58678723D01*
X240004552Y58631104D01*
X238528361Y58916819D02*
X239004552Y58916819D01*
X239052171Y58440628D01*
X239004552Y58488247D01*
X238909314Y58535866D01*
X238671219Y58535866D01*
X238575980Y58488247D01*
X238528361Y58440628D01*
X238480742Y58345390D01*
X238480742Y58107295D01*
X238528361Y58012057D01*
X238575980Y57964438D01*
X238671219Y57916819D01*
X238909314Y57916819D01*
X239004552Y57964438D01*
X239052171Y58012057D01*
%TO.C,R4*%
X216166666Y59397619D02*
X216500000Y59873809D01*
X216738095Y59397619D02*
X216738095Y60397619D01*
X216357142Y60397619D01*
X216261904Y60350000D01*
X216214285Y60302380D01*
X216166666Y60207142D01*
X216166666Y60064285D01*
X216214285Y59969047D01*
X216261904Y59921428D01*
X216357142Y59873809D01*
X216738095Y59873809D01*
X215309523Y60064285D02*
X215309523Y59397619D01*
X215547619Y60445238D02*
X215785714Y59730952D01*
X215166666Y59730952D01*
%TO.C,R3*%
X212166666Y59397619D02*
X212500000Y59873809D01*
X212738095Y59397619D02*
X212738095Y60397619D01*
X212357142Y60397619D01*
X212261904Y60350000D01*
X212214285Y60302380D01*
X212166666Y60207142D01*
X212166666Y60064285D01*
X212214285Y59969047D01*
X212261904Y59921428D01*
X212357142Y59873809D01*
X212738095Y59873809D01*
X211833333Y60397619D02*
X211214285Y60397619D01*
X211547619Y60016666D01*
X211404761Y60016666D01*
X211309523Y59969047D01*
X211261904Y59921428D01*
X211214285Y59826190D01*
X211214285Y59588095D01*
X211261904Y59492857D01*
X211309523Y59445238D01*
X211404761Y59397619D01*
X211690476Y59397619D01*
X211785714Y59445238D01*
X211833333Y59492857D01*
%TO.C,R2*%
X208016666Y59247619D02*
X208350000Y59723809D01*
X208588095Y59247619D02*
X208588095Y60247619D01*
X208207142Y60247619D01*
X208111904Y60200000D01*
X208064285Y60152380D01*
X208016666Y60057142D01*
X208016666Y59914285D01*
X208064285Y59819047D01*
X208111904Y59771428D01*
X208207142Y59723809D01*
X208588095Y59723809D01*
X207635714Y60152380D02*
X207588095Y60200000D01*
X207492857Y60247619D01*
X207254761Y60247619D01*
X207159523Y60200000D01*
X207111904Y60152380D01*
X207064285Y60057142D01*
X207064285Y59961904D01*
X207111904Y59819047D01*
X207683333Y59247619D01*
X207064285Y59247619D01*
%TO.C,C5*%
X233917466Y61916057D02*
X233965085Y61868438D01*
X234107942Y61820819D01*
X234203180Y61820819D01*
X234346038Y61868438D01*
X234441276Y61963676D01*
X234488895Y62058914D01*
X234536514Y62249390D01*
X234536514Y62392247D01*
X234488895Y62582723D01*
X234441276Y62677961D01*
X234346038Y62773200D01*
X234203180Y62820819D01*
X234107942Y62820819D01*
X233965085Y62773200D01*
X233917466Y62725580D01*
X233012704Y62820819D02*
X233488895Y62820819D01*
X233536514Y62344628D01*
X233488895Y62392247D01*
X233393657Y62439866D01*
X233155561Y62439866D01*
X233060323Y62392247D01*
X233012704Y62344628D01*
X232965085Y62249390D01*
X232965085Y62011295D01*
X233012704Y61916057D01*
X233060323Y61868438D01*
X233155561Y61820819D01*
X233393657Y61820819D01*
X233488895Y61868438D01*
X233536514Y61916057D01*
%TO.C,JP1*%
X228560333Y65951019D02*
X228560333Y65236733D01*
X228607952Y65093876D01*
X228703190Y64998638D01*
X228846047Y64951019D01*
X228941285Y64951019D01*
X228084142Y64951019D02*
X228084142Y65951019D01*
X227703190Y65951019D01*
X227607952Y65903400D01*
X227560333Y65855780D01*
X227512714Y65760542D01*
X227512714Y65617685D01*
X227560333Y65522447D01*
X227607952Y65474828D01*
X227703190Y65427209D01*
X228084142Y65427209D01*
X226560333Y64951019D02*
X227131761Y64951019D01*
X226846047Y64951019D02*
X226846047Y65951019D01*
X226941285Y65808161D01*
X227036523Y65712923D01*
X227131761Y65665304D01*
%TO.C,U1*%
X228041104Y77560419D02*
X228041104Y76750895D01*
X227993485Y76655657D01*
X227945866Y76608038D01*
X227850628Y76560419D01*
X227660152Y76560419D01*
X227564914Y76608038D01*
X227517295Y76655657D01*
X227469676Y76750895D01*
X227469676Y77560419D01*
X226469676Y76560419D02*
X227041104Y76560419D01*
X226755390Y76560419D02*
X226755390Y77560419D01*
X226850628Y77417561D01*
X226945866Y77322323D01*
X227041104Y77274704D01*
%TO.C,SW1*%
X194703533Y74982438D02*
X194560676Y74934819D01*
X194322580Y74934819D01*
X194227342Y74982438D01*
X194179723Y75030057D01*
X194132104Y75125295D01*
X194132104Y75220533D01*
X194179723Y75315771D01*
X194227342Y75363390D01*
X194322580Y75411009D01*
X194513057Y75458628D01*
X194608295Y75506247D01*
X194655914Y75553866D01*
X194703533Y75649104D01*
X194703533Y75744342D01*
X194655914Y75839580D01*
X194608295Y75887200D01*
X194513057Y75934819D01*
X194274961Y75934819D01*
X194132104Y75887200D01*
X193798771Y75934819D02*
X193560676Y74934819D01*
X193370200Y75649104D01*
X193179723Y74934819D01*
X192941628Y75934819D01*
X192036866Y74934819D02*
X192608295Y74934819D01*
X192322580Y74934819D02*
X192322580Y75934819D01*
X192417819Y75791961D01*
X192513057Y75696723D01*
X192608295Y75649104D01*
%TD*%
M02*
