%TF.GenerationSoftware,KiCad,Pcbnew,5.1.12-84ad8e8a86~92~ubuntu18.04.1*%
%TF.CreationDate,2022-02-03T16:03:31-05:00*%
%TF.ProjectId,remote,72656d6f-7465-42e6-9b69-6361645f7063,rev?*%
%TF.SameCoordinates,Original*%
%TF.FileFunction,Soldermask,Top*%
%TF.FilePolarity,Negative*%
%FSLAX46Y46*%
G04 Gerber Fmt 4.6, Leading zero omitted, Abs format (unit mm)*
G04 Created by KiCad (PCBNEW 5.1.12-84ad8e8a86~92~ubuntu18.04.1) date 2022-02-03 16:03:31*
%MOMM*%
%LPD*%
G01*
G04 APERTURE LIST*
%ADD10C,2.800000*%
G04 APERTURE END LIST*
D10*
%TO.C,H4*%
X3750000Y-11950000D03*
%TD*%
%TO.C,H2*%
X48090000Y-11950000D03*
%TD*%
%TO.C,H3*%
X48250000Y-105410000D03*
%TD*%
%TO.C,H1*%
X3790000Y-105410000D03*
%TD*%
M02*
