%TF.GenerationSoftware,KiCad,Pcbnew,5.1.12-84ad8e8a86~92~ubuntu18.04.1*%
%TF.CreationDate,2022-01-16T18:39:34-05:00*%
%TF.ProjectId,remote,72656d6f-7465-42e6-9b69-6361645f7063,rev?*%
%TF.SameCoordinates,Original*%
%TF.FileFunction,Soldermask,Top*%
%TF.FilePolarity,Negative*%
%FSLAX46Y46*%
G04 Gerber Fmt 4.6, Leading zero omitted, Abs format (unit mm)*
G04 Created by KiCad (PCBNEW 5.1.12-84ad8e8a86~92~ubuntu18.04.1) date 2022-01-16 18:39:34*
%MOMM*%
%LPD*%
G01*
G04 APERTURE LIST*
%ADD10O,1.800000X1.800000*%
%ADD11C,2.800000*%
%ADD12C,2.700000*%
%ADD13O,2.100000X2.005000*%
%ADD14O,3.600000X3.600000*%
%ADD15O,1.700000X1.700000*%
%ADD16C,1.700000*%
%ADD17C,1.800000*%
%ADD18C,2.200000*%
%ADD19C,1.850000*%
%ADD20O,2.900000X2.900000*%
G04 APERTURE END LIST*
%TO.C,J2*%
G36*
G01*
X10850000Y-8845832D02*
X10850000Y-10204168D01*
G75*
G02*
X10579168Y-10475000I-270832J0D01*
G01*
X9820832Y-10475000D01*
G75*
G02*
X9550000Y-10204168I0J270832D01*
G01*
X9550000Y-8845832D01*
G75*
G02*
X9820832Y-8575000I270832J0D01*
G01*
X10579168Y-8575000D01*
G75*
G02*
X10850000Y-8845832I0J-270832D01*
G01*
G37*
G36*
G01*
X16450000Y-8845832D02*
X16450000Y-10204168D01*
G75*
G02*
X16179168Y-10475000I-270832J0D01*
G01*
X15420832Y-10475000D01*
G75*
G02*
X15150000Y-10204168I0J270832D01*
G01*
X15150000Y-8845832D01*
G75*
G02*
X15420832Y-8575000I270832J0D01*
G01*
X16179168Y-8575000D01*
G75*
G02*
X16450000Y-8845832I0J-270832D01*
G01*
G37*
G36*
G01*
X11850000Y-12750000D02*
X11850000Y-14050000D01*
G75*
G02*
X11675000Y-14225000I-175000J0D01*
G01*
X11325000Y-14225000D01*
G75*
G02*
X11150000Y-14050000I0J175000D01*
G01*
X11150000Y-12750000D01*
G75*
G02*
X11325000Y-12575000I175000J0D01*
G01*
X11675000Y-12575000D01*
G75*
G02*
X11850000Y-12750000I0J-175000D01*
G01*
G37*
G36*
G01*
X12850000Y-12750000D02*
X12850000Y-14050000D01*
G75*
G02*
X12675000Y-14225000I-175000J0D01*
G01*
X12325000Y-14225000D01*
G75*
G02*
X12150000Y-14050000I0J175000D01*
G01*
X12150000Y-12750000D01*
G75*
G02*
X12325000Y-12575000I175000J0D01*
G01*
X12675000Y-12575000D01*
G75*
G02*
X12850000Y-12750000I0J-175000D01*
G01*
G37*
G36*
G01*
X13850000Y-12750000D02*
X13850000Y-14050000D01*
G75*
G02*
X13675000Y-14225000I-175000J0D01*
G01*
X13325000Y-14225000D01*
G75*
G02*
X13150000Y-14050000I0J175000D01*
G01*
X13150000Y-12750000D01*
G75*
G02*
X13325000Y-12575000I175000J0D01*
G01*
X13675000Y-12575000D01*
G75*
G02*
X13850000Y-12750000I0J-175000D01*
G01*
G37*
G36*
G01*
X14850000Y-12750000D02*
X14850000Y-14050000D01*
G75*
G02*
X14675000Y-14225000I-175000J0D01*
G01*
X14325000Y-14225000D01*
G75*
G02*
X14150000Y-14050000I0J175000D01*
G01*
X14150000Y-12750000D01*
G75*
G02*
X14325000Y-12575000I175000J0D01*
G01*
X14675000Y-12575000D01*
G75*
G02*
X14850000Y-12750000I0J-175000D01*
G01*
G37*
%TD*%
%TO.C,J7*%
G36*
G01*
X23040000Y-44530000D02*
X21340000Y-44530000D01*
G75*
G02*
X21290000Y-44480000I0J50000D01*
G01*
X21290000Y-42780000D01*
G75*
G02*
X21340000Y-42730000I50000J0D01*
G01*
X23040000Y-42730000D01*
G75*
G02*
X23090000Y-42780000I0J-50000D01*
G01*
X23090000Y-44480000D01*
G75*
G02*
X23040000Y-44530000I-50000J0D01*
G01*
G37*
D10*
X24730000Y-43630000D03*
X27270000Y-43630000D03*
X29810000Y-43630000D03*
%TD*%
D11*
%TO.C,H4*%
X3750000Y-11950000D03*
%TD*%
%TO.C,H2*%
X48090000Y-11950000D03*
%TD*%
%TO.C,H3*%
X48250000Y-105410000D03*
%TD*%
%TO.C,H1*%
X3790000Y-105410000D03*
%TD*%
D10*
%TO.C,J4*%
X42580000Y-13170000D03*
X40040000Y-13170000D03*
X37500000Y-13170000D03*
G36*
G01*
X35810000Y-14070000D02*
X34110000Y-14070000D01*
G75*
G02*
X34060000Y-14020000I0J50000D01*
G01*
X34060000Y-12320000D01*
G75*
G02*
X34110000Y-12270000I50000J0D01*
G01*
X35810000Y-12270000D01*
G75*
G02*
X35860000Y-12320000I0J-50000D01*
G01*
X35860000Y-14020000D01*
G75*
G02*
X35810000Y-14070000I-50000J0D01*
G01*
G37*
%TD*%
D12*
%TO.C,J11*%
X41000000Y-98200000D03*
G36*
G01*
X34650000Y-99500000D02*
X34650000Y-96900000D01*
G75*
G02*
X34700000Y-96850000I50000J0D01*
G01*
X37300000Y-96850000D01*
G75*
G02*
X37350000Y-96900000I0J-50000D01*
G01*
X37350000Y-99500000D01*
G75*
G02*
X37300000Y-99550000I-50000J0D01*
G01*
X34700000Y-99550000D01*
G75*
G02*
X34650000Y-99500000I0J50000D01*
G01*
G37*
%TD*%
D10*
%TO.C,J8*%
X50500000Y-22760000D03*
X50500000Y-20220000D03*
G36*
G01*
X49600000Y-18530000D02*
X49600000Y-16830000D01*
G75*
G02*
X49650000Y-16780000I50000J0D01*
G01*
X51350000Y-16780000D01*
G75*
G02*
X51400000Y-16830000I0J-50000D01*
G01*
X51400000Y-18530000D01*
G75*
G02*
X51350000Y-18580000I-50000J0D01*
G01*
X49650000Y-18580000D01*
G75*
G02*
X49600000Y-18530000I0J50000D01*
G01*
G37*
%TD*%
%TO.C,J3*%
X1470000Y-37370000D03*
X1470000Y-39910000D03*
G36*
G01*
X2370000Y-41600000D02*
X2370000Y-43300000D01*
G75*
G02*
X2320000Y-43350000I-50000J0D01*
G01*
X620000Y-43350000D01*
G75*
G02*
X570000Y-43300000I0J50000D01*
G01*
X570000Y-41600000D01*
G75*
G02*
X620000Y-41550000I50000J0D01*
G01*
X2320000Y-41550000D01*
G75*
G02*
X2370000Y-41600000I0J-50000D01*
G01*
G37*
%TD*%
%TO.C,J6*%
X41230000Y-16140000D03*
X38690000Y-16140000D03*
X36150000Y-16140000D03*
X33610000Y-16140000D03*
X31070000Y-16140000D03*
X28530000Y-16140000D03*
X25990000Y-16140000D03*
X23450000Y-16140000D03*
X20910000Y-16140000D03*
X18370000Y-16140000D03*
X15830000Y-16140000D03*
X13290000Y-16140000D03*
G36*
G01*
X11600000Y-17040000D02*
X9900000Y-17040000D01*
G75*
G02*
X9850000Y-16990000I0J50000D01*
G01*
X9850000Y-15290000D01*
G75*
G02*
X9900000Y-15240000I50000J0D01*
G01*
X11600000Y-15240000D01*
G75*
G02*
X11650000Y-15290000I0J-50000D01*
G01*
X11650000Y-16990000D01*
G75*
G02*
X11600000Y-17040000I-50000J0D01*
G01*
G37*
%TD*%
D13*
%TO.C,Q1*%
X31130000Y-59390000D03*
X31130000Y-56850000D03*
G36*
G01*
X30130000Y-53307500D02*
X32130000Y-53307500D01*
G75*
G02*
X32180000Y-53357500I0J-50000D01*
G01*
X32180000Y-55262500D01*
G75*
G02*
X32130000Y-55312500I-50000J0D01*
G01*
X30130000Y-55312500D01*
G75*
G02*
X30080000Y-55262500I0J50000D01*
G01*
X30080000Y-53357500D01*
G75*
G02*
X30130000Y-53307500I50000J0D01*
G01*
G37*
D14*
X47790000Y-56850000D03*
%TD*%
%TO.C,BZ1*%
G36*
G01*
X7150000Y-82800000D02*
X7150000Y-84500000D01*
G75*
G02*
X7100000Y-84550000I-50000J0D01*
G01*
X5400000Y-84550000D01*
G75*
G02*
X5350000Y-84500000I0J50000D01*
G01*
X5350000Y-82800000D01*
G75*
G02*
X5400000Y-82750000I50000J0D01*
G01*
X7100000Y-82750000D01*
G75*
G02*
X7150000Y-82800000I0J-50000D01*
G01*
G37*
D10*
X6250000Y-78570000D03*
%TD*%
%TO.C,J5*%
X4490000Y-32810000D03*
X4490000Y-30270000D03*
X4490000Y-27730000D03*
X4490000Y-25190000D03*
X4490000Y-22650000D03*
X4490000Y-20110000D03*
G36*
G01*
X3590000Y-18420000D02*
X3590000Y-16720000D01*
G75*
G02*
X3640000Y-16670000I50000J0D01*
G01*
X5340000Y-16670000D01*
G75*
G02*
X5390000Y-16720000I0J-50000D01*
G01*
X5390000Y-18420000D01*
G75*
G02*
X5340000Y-18470000I-50000J0D01*
G01*
X3640000Y-18470000D01*
G75*
G02*
X3590000Y-18420000I0J50000D01*
G01*
G37*
%TD*%
%TO.C,U2*%
X6858000Y-46974000D03*
X9398000Y-46974000D03*
X11938000Y-46974000D03*
X14478000Y-46974000D03*
X17018000Y-46974000D03*
X19558000Y-46974000D03*
X22098000Y-46974000D03*
X24638000Y-46974000D03*
X27178000Y-46974000D03*
X29718000Y-46974000D03*
X32258000Y-46974000D03*
X34798000Y-46974000D03*
X37338000Y-46974000D03*
X39878000Y-46974000D03*
X42418000Y-46974000D03*
G36*
G01*
X44108000Y-46074000D02*
X45808000Y-46074000D01*
G75*
G02*
X45858000Y-46124000I0J-50000D01*
G01*
X45858000Y-47824000D01*
G75*
G02*
X45808000Y-47874000I-50000J0D01*
G01*
X44108000Y-47874000D01*
G75*
G02*
X44058000Y-47824000I0J50000D01*
G01*
X44058000Y-46124000D01*
G75*
G02*
X44108000Y-46074000I50000J0D01*
G01*
G37*
X24558000Y-67294000D03*
X27098000Y-67294000D03*
X11858000Y-67294000D03*
X14398000Y-67294000D03*
X6778000Y-67294000D03*
X19478000Y-67294000D03*
X22018000Y-67294000D03*
X32178000Y-67294000D03*
X9318000Y-67294000D03*
X16938000Y-67294000D03*
G36*
G01*
X33868000Y-66394000D02*
X35568000Y-66394000D01*
G75*
G02*
X35618000Y-66444000I0J-50000D01*
G01*
X35618000Y-68144000D01*
G75*
G02*
X35568000Y-68194000I-50000J0D01*
G01*
X33868000Y-68194000D01*
G75*
G02*
X33818000Y-68144000I0J50000D01*
G01*
X33818000Y-66444000D01*
G75*
G02*
X33868000Y-66394000I50000J0D01*
G01*
G37*
X29638000Y-67294000D03*
%TD*%
%TO.C,U1*%
X29638000Y-90920000D03*
G36*
G01*
X33868000Y-90020000D02*
X35568000Y-90020000D01*
G75*
G02*
X35618000Y-90070000I0J-50000D01*
G01*
X35618000Y-91770000D01*
G75*
G02*
X35568000Y-91820000I-50000J0D01*
G01*
X33868000Y-91820000D01*
G75*
G02*
X33818000Y-91770000I0J50000D01*
G01*
X33818000Y-90070000D01*
G75*
G02*
X33868000Y-90020000I50000J0D01*
G01*
G37*
X16938000Y-90920000D03*
X9318000Y-90920000D03*
X32178000Y-90920000D03*
X22018000Y-90920000D03*
X19478000Y-90920000D03*
X6778000Y-90920000D03*
X14398000Y-90920000D03*
X11858000Y-90920000D03*
X27098000Y-90920000D03*
X24558000Y-90920000D03*
G36*
G01*
X44108000Y-69700000D02*
X45808000Y-69700000D01*
G75*
G02*
X45858000Y-69750000I0J-50000D01*
G01*
X45858000Y-71450000D01*
G75*
G02*
X45808000Y-71500000I-50000J0D01*
G01*
X44108000Y-71500000D01*
G75*
G02*
X44058000Y-71450000I0J50000D01*
G01*
X44058000Y-69750000D01*
G75*
G02*
X44108000Y-69700000I50000J0D01*
G01*
G37*
X42418000Y-70600000D03*
X39878000Y-70600000D03*
X37338000Y-70600000D03*
X34798000Y-70600000D03*
X32258000Y-70600000D03*
X29718000Y-70600000D03*
X27178000Y-70600000D03*
X24638000Y-70600000D03*
X22098000Y-70600000D03*
X19558000Y-70600000D03*
X17018000Y-70600000D03*
X14478000Y-70600000D03*
X11938000Y-70600000D03*
X9398000Y-70600000D03*
X6858000Y-70600000D03*
%TD*%
D15*
%TO.C,R6*%
X27590000Y-64370000D03*
D16*
X27590000Y-51670000D03*
%TD*%
D17*
%TO.C,SW3*%
X50790000Y-93930000D03*
X50790000Y-100430000D03*
X46290000Y-93930000D03*
X46290000Y-100430000D03*
%TD*%
D16*
%TO.C,R1*%
X8720000Y-51670000D03*
D15*
X8720000Y-64370000D03*
%TD*%
%TO.C,J1*%
G36*
G01*
X40123000Y-39511000D02*
X41823000Y-39511000D01*
G75*
G02*
X41873000Y-39561000I0J-50000D01*
G01*
X41873000Y-41261000D01*
G75*
G02*
X41823000Y-41311000I-50000J0D01*
G01*
X40123000Y-41311000D01*
G75*
G02*
X40073000Y-41261000I0J50000D01*
G01*
X40073000Y-39561000D01*
G75*
G02*
X40123000Y-39511000I50000J0D01*
G01*
G37*
D10*
X38433000Y-40411000D03*
X35893000Y-40411000D03*
X33353000Y-40411000D03*
X30813000Y-40411000D03*
X28273000Y-40411000D03*
X25733000Y-40411000D03*
%TD*%
D18*
%TO.C,SW2*%
X45170000Y-43870000D03*
D19*
X47660000Y-42610000D03*
X47660000Y-38110000D03*
D18*
X45170000Y-36860000D03*
%TD*%
%TO.C,SW1*%
X45170000Y-26860000D03*
D19*
X47660000Y-28110000D03*
X47660000Y-32610000D03*
D18*
X45170000Y-33870000D03*
%TD*%
%TO.C,D1*%
G36*
G01*
X20400000Y-108450000D02*
X17600000Y-108450000D01*
G75*
G02*
X17550000Y-108400000I0J50000D01*
G01*
X17550000Y-105600000D01*
G75*
G02*
X17600000Y-105550000I50000J0D01*
G01*
X20400000Y-105550000D01*
G75*
G02*
X20450000Y-105600000I0J-50000D01*
G01*
X20450000Y-108400000D01*
G75*
G02*
X20400000Y-108450000I-50000J0D01*
G01*
G37*
D20*
X19000000Y-94300000D03*
%TD*%
%TO.C,C2*%
G36*
G01*
X8400000Y-104150000D02*
X10000000Y-104150000D01*
G75*
G02*
X10050000Y-104200000I0J-50000D01*
G01*
X10050000Y-105800000D01*
G75*
G02*
X10000000Y-105850000I-50000J0D01*
G01*
X8400000Y-105850000D01*
G75*
G02*
X8350000Y-105800000I0J50000D01*
G01*
X8350000Y-104200000D01*
G75*
G02*
X8400000Y-104150000I50000J0D01*
G01*
G37*
D16*
X9200000Y-107500000D03*
%TD*%
%TO.C,C1*%
X13900000Y-104300000D03*
G36*
G01*
X13100000Y-100950000D02*
X14700000Y-100950000D01*
G75*
G02*
X14750000Y-101000000I0J-50000D01*
G01*
X14750000Y-102600000D01*
G75*
G02*
X14700000Y-102650000I-50000J0D01*
G01*
X13100000Y-102650000D01*
G75*
G02*
X13050000Y-102600000I0J50000D01*
G01*
X13050000Y-101000000D01*
G75*
G02*
X13100000Y-100950000I50000J0D01*
G01*
G37*
%TD*%
%TO.C,J9*%
G36*
G01*
X8197000Y-93909000D02*
X9897000Y-93909000D01*
G75*
G02*
X9947000Y-93959000I0J-50000D01*
G01*
X9947000Y-95659000D01*
G75*
G02*
X9897000Y-95709000I-50000J0D01*
G01*
X8197000Y-95709000D01*
G75*
G02*
X8147000Y-95659000I0J50000D01*
G01*
X8147000Y-93959000D01*
G75*
G02*
X8197000Y-93909000I50000J0D01*
G01*
G37*
D10*
X6507000Y-94809000D03*
X3967000Y-94809000D03*
%TD*%
D16*
%TO.C,R5*%
X23810000Y-64370000D03*
D15*
X23810000Y-51670000D03*
%TD*%
%TO.C,J10*%
G36*
G01*
X27658000Y-96542000D02*
X24158000Y-96542000D01*
G75*
G02*
X24108000Y-96492000I0J50000D01*
G01*
X24108000Y-92992000D01*
G75*
G02*
X24158000Y-92942000I50000J0D01*
G01*
X27658000Y-92942000D01*
G75*
G02*
X27708000Y-92992000I0J-50000D01*
G01*
X27708000Y-96492000D01*
G75*
G02*
X27658000Y-96542000I-50000J0D01*
G01*
G37*
G36*
G01*
X26933000Y-102292000D02*
X24883000Y-102292000D01*
G75*
G02*
X24108000Y-101517000I0J775000D01*
G01*
X24108000Y-99967000D01*
G75*
G02*
X24883000Y-99192000I775000J0D01*
G01*
X26933000Y-99192000D01*
G75*
G02*
X27708000Y-99967000I0J-775000D01*
G01*
X27708000Y-101517000D01*
G75*
G02*
X26933000Y-102292000I-775000J0D01*
G01*
G37*
G36*
G01*
X31508000Y-99542000D02*
X29708000Y-99542000D01*
G75*
G02*
X28808000Y-98642000I0J900000D01*
G01*
X28808000Y-96842000D01*
G75*
G02*
X29708000Y-95942000I900000J0D01*
G01*
X31508000Y-95942000D01*
G75*
G02*
X32408000Y-96842000I0J-900000D01*
G01*
X32408000Y-98642000D01*
G75*
G02*
X31508000Y-99542000I-900000J0D01*
G01*
G37*
%TD*%
%TO.C,R3*%
X16310000Y-64370000D03*
D16*
X16310000Y-51670000D03*
%TD*%
D15*
%TO.C,R2*%
X12460000Y-64370000D03*
D16*
X12460000Y-51670000D03*
%TD*%
D15*
%TO.C,R4*%
X20040000Y-51670000D03*
D16*
X20040000Y-64370000D03*
%TD*%
M02*
