%TF.GenerationSoftware,KiCad,Pcbnew,5.1.6-c6e7f7d~87~ubuntu18.04.1*%
%TF.CreationDate,2021-08-30T12:36:41-04:00*%
%TF.ProjectId,remote,72656d6f-7465-42e6-9b69-6361645f7063,rev?*%
%TF.SameCoordinates,Original*%
%TF.FileFunction,Copper,L2,Bot*%
%TF.FilePolarity,Positive*%
%FSLAX46Y46*%
G04 Gerber Fmt 4.6, Leading zero omitted, Abs format (unit mm)*
G04 Created by KiCad (PCBNEW 5.1.6-c6e7f7d~87~ubuntu18.04.1) date 2021-08-30 12:36:41*
%MOMM*%
%LPD*%
G01*
G04 APERTURE LIST*
%TA.AperFunction,ComponentPad*%
%ADD10O,1.700000X1.700000*%
%TD*%
%TA.AperFunction,ComponentPad*%
%ADD11R,1.700000X1.700000*%
%TD*%
%TA.AperFunction,ViaPad*%
%ADD12C,0.800000*%
%TD*%
%TA.AperFunction,Conductor*%
%ADD13C,0.700000*%
%TD*%
%TA.AperFunction,Conductor*%
%ADD14C,0.400000*%
%TD*%
%TA.AperFunction,Conductor*%
%ADD15C,0.250000*%
%TD*%
G04 APERTURE END LIST*
D10*
%TO.P,J5,12*%
%TO.N,N/C*%
X195800000Y-60390000D03*
%TO.P,J5,11*%
X195800000Y-57850000D03*
%TO.P,J5,10*%
X195800000Y-55310000D03*
%TO.P,J5,9*%
X195800000Y-52770000D03*
%TO.P,J5,8*%
X195800000Y-50230000D03*
%TO.P,J5,7*%
X195800000Y-47690000D03*
%TO.P,J5,6*%
X195800000Y-45150000D03*
%TO.P,J5,5*%
X195800000Y-42610000D03*
%TO.P,J5,4*%
X195800000Y-40070000D03*
%TO.P,J5,3*%
X195800000Y-37530000D03*
%TO.P,J5,2*%
X195800000Y-34990000D03*
D11*
%TO.P,J5,1*%
X195800000Y-32450000D03*
%TD*%
%TO.P,J7,1*%
%TO.N,GND*%
%TA.AperFunction,SMDPad,CuDef*%
G36*
G01*
X244625000Y-41575000D02*
X244625000Y-42825000D01*
G75*
G02*
X244475000Y-42975000I-150000J0D01*
G01*
X244175000Y-42975000D01*
G75*
G02*
X244025000Y-42825000I0J150000D01*
G01*
X244025000Y-41575000D01*
G75*
G02*
X244175000Y-41425000I150000J0D01*
G01*
X244475000Y-41425000D01*
G75*
G02*
X244625000Y-41575000I0J-150000D01*
G01*
G37*
%TD.AperFunction*%
%TO.P,J7,2*%
%TO.N,+3V3*%
%TA.AperFunction,SMDPad,CuDef*%
G36*
G01*
X243625000Y-41575000D02*
X243625000Y-42825000D01*
G75*
G02*
X243475000Y-42975000I-150000J0D01*
G01*
X243175000Y-42975000D01*
G75*
G02*
X243025000Y-42825000I0J150000D01*
G01*
X243025000Y-41575000D01*
G75*
G02*
X243175000Y-41425000I150000J0D01*
G01*
X243475000Y-41425000D01*
G75*
G02*
X243625000Y-41575000I0J-150000D01*
G01*
G37*
%TD.AperFunction*%
%TO.P,J7,3*%
%TO.N,SDA*%
%TA.AperFunction,SMDPad,CuDef*%
G36*
G01*
X242625000Y-41575000D02*
X242625000Y-42825000D01*
G75*
G02*
X242475000Y-42975000I-150000J0D01*
G01*
X242175000Y-42975000D01*
G75*
G02*
X242025000Y-42825000I0J150000D01*
G01*
X242025000Y-41575000D01*
G75*
G02*
X242175000Y-41425000I150000J0D01*
G01*
X242475000Y-41425000D01*
G75*
G02*
X242625000Y-41575000I0J-150000D01*
G01*
G37*
%TD.AperFunction*%
%TO.P,J7,4*%
%TO.N,SCL*%
%TA.AperFunction,SMDPad,CuDef*%
G36*
G01*
X241625000Y-41575000D02*
X241625000Y-42825000D01*
G75*
G02*
X241475000Y-42975000I-150000J0D01*
G01*
X241175000Y-42975000D01*
G75*
G02*
X241025000Y-42825000I0J150000D01*
G01*
X241025000Y-41575000D01*
G75*
G02*
X241175000Y-41425000I150000J0D01*
G01*
X241475000Y-41425000D01*
G75*
G02*
X241625000Y-41575000I0J-150000D01*
G01*
G37*
%TD.AperFunction*%
%TO.P,J7,MP*%
%TO.N,N/C*%
%TA.AperFunction,SMDPad,CuDef*%
G36*
G01*
X246225000Y-45424999D02*
X246225000Y-46725001D01*
G75*
G02*
X245975001Y-46975000I-249999J0D01*
G01*
X245274999Y-46975000D01*
G75*
G02*
X245025000Y-46725001I0J249999D01*
G01*
X245025000Y-45424999D01*
G75*
G02*
X245274999Y-45175000I249999J0D01*
G01*
X245975001Y-45175000D01*
G75*
G02*
X246225000Y-45424999I0J-249999D01*
G01*
G37*
%TD.AperFunction*%
%TA.AperFunction,SMDPad,CuDef*%
G36*
G01*
X240625000Y-45424999D02*
X240625000Y-46725001D01*
G75*
G02*
X240375001Y-46975000I-249999J0D01*
G01*
X239674999Y-46975000D01*
G75*
G02*
X239425000Y-46725001I0J249999D01*
G01*
X239425000Y-45424999D01*
G75*
G02*
X239674999Y-45175000I249999J0D01*
G01*
X240375001Y-45175000D01*
G75*
G02*
X240625000Y-45424999I0J-249999D01*
G01*
G37*
%TD.AperFunction*%
%TD*%
D10*
%TO.P,J15,4*%
%TO.N,SCL*%
X198980000Y-64475000D03*
%TO.P,J15,3*%
%TO.N,SDA*%
X201520000Y-64475000D03*
%TO.P,J15,2*%
%TO.N,+3V3*%
X204060000Y-64475000D03*
D11*
%TO.P,J15,1*%
%TO.N,GND*%
X206600000Y-64475000D03*
%TD*%
%TO.P,J11,MP*%
%TO.N,N/C*%
%TA.AperFunction,SMDPad,CuDef*%
G36*
G01*
X187975001Y-61400000D02*
X186674999Y-61400000D01*
G75*
G02*
X186425000Y-61150001I0J249999D01*
G01*
X186425000Y-60449999D01*
G75*
G02*
X186674999Y-60200000I249999J0D01*
G01*
X187975001Y-60200000D01*
G75*
G02*
X188225000Y-60449999I0J-249999D01*
G01*
X188225000Y-61150001D01*
G75*
G02*
X187975001Y-61400000I-249999J0D01*
G01*
G37*
%TD.AperFunction*%
%TA.AperFunction,SMDPad,CuDef*%
G36*
G01*
X187975001Y-67000000D02*
X186674999Y-67000000D01*
G75*
G02*
X186425000Y-66750001I0J249999D01*
G01*
X186425000Y-66049999D01*
G75*
G02*
X186674999Y-65800000I249999J0D01*
G01*
X187975001Y-65800000D01*
G75*
G02*
X188225000Y-66049999I0J-249999D01*
G01*
X188225000Y-66750001D01*
G75*
G02*
X187975001Y-67000000I-249999J0D01*
G01*
G37*
%TD.AperFunction*%
%TO.P,J11,4*%
%TO.N,SCL*%
%TA.AperFunction,SMDPad,CuDef*%
G36*
G01*
X191825000Y-62400000D02*
X190575000Y-62400000D01*
G75*
G02*
X190425000Y-62250000I0J150000D01*
G01*
X190425000Y-61950000D01*
G75*
G02*
X190575000Y-61800000I150000J0D01*
G01*
X191825000Y-61800000D01*
G75*
G02*
X191975000Y-61950000I0J-150000D01*
G01*
X191975000Y-62250000D01*
G75*
G02*
X191825000Y-62400000I-150000J0D01*
G01*
G37*
%TD.AperFunction*%
%TO.P,J11,3*%
%TO.N,SDA*%
%TA.AperFunction,SMDPad,CuDef*%
G36*
G01*
X191825000Y-63400000D02*
X190575000Y-63400000D01*
G75*
G02*
X190425000Y-63250000I0J150000D01*
G01*
X190425000Y-62950000D01*
G75*
G02*
X190575000Y-62800000I150000J0D01*
G01*
X191825000Y-62800000D01*
G75*
G02*
X191975000Y-62950000I0J-150000D01*
G01*
X191975000Y-63250000D01*
G75*
G02*
X191825000Y-63400000I-150000J0D01*
G01*
G37*
%TD.AperFunction*%
%TO.P,J11,2*%
%TO.N,+3V3*%
%TA.AperFunction,SMDPad,CuDef*%
G36*
G01*
X191825000Y-64400000D02*
X190575000Y-64400000D01*
G75*
G02*
X190425000Y-64250000I0J150000D01*
G01*
X190425000Y-63950000D01*
G75*
G02*
X190575000Y-63800000I150000J0D01*
G01*
X191825000Y-63800000D01*
G75*
G02*
X191975000Y-63950000I0J-150000D01*
G01*
X191975000Y-64250000D01*
G75*
G02*
X191825000Y-64400000I-150000J0D01*
G01*
G37*
%TD.AperFunction*%
%TO.P,J11,1*%
%TO.N,GND*%
%TA.AperFunction,SMDPad,CuDef*%
G36*
G01*
X191825000Y-65400000D02*
X190575000Y-65400000D01*
G75*
G02*
X190425000Y-65250000I0J150000D01*
G01*
X190425000Y-64950000D01*
G75*
G02*
X190575000Y-64800000I150000J0D01*
G01*
X191825000Y-64800000D01*
G75*
G02*
X191975000Y-64950000I0J-150000D01*
G01*
X191975000Y-65250000D01*
G75*
G02*
X191825000Y-65400000I-150000J0D01*
G01*
G37*
%TD.AperFunction*%
%TD*%
%TO.P,J10,MP*%
%TO.N,N/C*%
%TA.AperFunction,SMDPad,CuDef*%
G36*
G01*
X187600001Y-42425000D02*
X186299999Y-42425000D01*
G75*
G02*
X186050000Y-42175001I0J249999D01*
G01*
X186050000Y-41474999D01*
G75*
G02*
X186299999Y-41225000I249999J0D01*
G01*
X187600001Y-41225000D01*
G75*
G02*
X187850000Y-41474999I0J-249999D01*
G01*
X187850000Y-42175001D01*
G75*
G02*
X187600001Y-42425000I-249999J0D01*
G01*
G37*
%TD.AperFunction*%
%TA.AperFunction,SMDPad,CuDef*%
G36*
G01*
X187600001Y-48025000D02*
X186299999Y-48025000D01*
G75*
G02*
X186050000Y-47775001I0J249999D01*
G01*
X186050000Y-47074999D01*
G75*
G02*
X186299999Y-46825000I249999J0D01*
G01*
X187600001Y-46825000D01*
G75*
G02*
X187850000Y-47074999I0J-249999D01*
G01*
X187850000Y-47775001D01*
G75*
G02*
X187600001Y-48025000I-249999J0D01*
G01*
G37*
%TD.AperFunction*%
%TO.P,J10,4*%
%TO.N,SCL*%
%TA.AperFunction,SMDPad,CuDef*%
G36*
G01*
X191450000Y-43425000D02*
X190200000Y-43425000D01*
G75*
G02*
X190050000Y-43275000I0J150000D01*
G01*
X190050000Y-42975000D01*
G75*
G02*
X190200000Y-42825000I150000J0D01*
G01*
X191450000Y-42825000D01*
G75*
G02*
X191600000Y-42975000I0J-150000D01*
G01*
X191600000Y-43275000D01*
G75*
G02*
X191450000Y-43425000I-150000J0D01*
G01*
G37*
%TD.AperFunction*%
%TO.P,J10,3*%
%TO.N,SDA*%
%TA.AperFunction,SMDPad,CuDef*%
G36*
G01*
X191450000Y-44425000D02*
X190200000Y-44425000D01*
G75*
G02*
X190050000Y-44275000I0J150000D01*
G01*
X190050000Y-43975000D01*
G75*
G02*
X190200000Y-43825000I150000J0D01*
G01*
X191450000Y-43825000D01*
G75*
G02*
X191600000Y-43975000I0J-150000D01*
G01*
X191600000Y-44275000D01*
G75*
G02*
X191450000Y-44425000I-150000J0D01*
G01*
G37*
%TD.AperFunction*%
%TO.P,J10,2*%
%TO.N,+3V3*%
%TA.AperFunction,SMDPad,CuDef*%
G36*
G01*
X191450000Y-45425000D02*
X190200000Y-45425000D01*
G75*
G02*
X190050000Y-45275000I0J150000D01*
G01*
X190050000Y-44975000D01*
G75*
G02*
X190200000Y-44825000I150000J0D01*
G01*
X191450000Y-44825000D01*
G75*
G02*
X191600000Y-44975000I0J-150000D01*
G01*
X191600000Y-45275000D01*
G75*
G02*
X191450000Y-45425000I-150000J0D01*
G01*
G37*
%TD.AperFunction*%
%TO.P,J10,1*%
%TO.N,GND*%
%TA.AperFunction,SMDPad,CuDef*%
G36*
G01*
X191450000Y-46425000D02*
X190200000Y-46425000D01*
G75*
G02*
X190050000Y-46275000I0J150000D01*
G01*
X190050000Y-45975000D01*
G75*
G02*
X190200000Y-45825000I150000J0D01*
G01*
X191450000Y-45825000D01*
G75*
G02*
X191600000Y-45975000I0J-150000D01*
G01*
X191600000Y-46275000D01*
G75*
G02*
X191450000Y-46425000I-150000J0D01*
G01*
G37*
%TD.AperFunction*%
%TD*%
D10*
%TO.P,J9,7*%
%TO.N,N/C*%
X216710000Y-56650000D03*
%TO.P,J9,6*%
X219250000Y-56650000D03*
%TO.P,J9,5*%
X221790000Y-56650000D03*
%TO.P,J9,4*%
%TO.N,SDA*%
X224330000Y-56650000D03*
%TO.P,J9,3*%
%TO.N,SCL*%
X226870000Y-56650000D03*
%TO.P,J9,2*%
%TO.N,GND*%
X229410000Y-56650000D03*
D11*
%TO.P,J9,1*%
%TO.N,+3V3*%
X231950000Y-56650000D03*
%TD*%
%TO.P,J7,MP*%
%TO.N,N/C*%
%TA.AperFunction,SMDPad,CuDef*%
G36*
G01*
X240625001Y-63525000D02*
X239324999Y-63525000D01*
G75*
G02*
X239075000Y-63275001I0J249999D01*
G01*
X239075000Y-62574999D01*
G75*
G02*
X239324999Y-62325000I249999J0D01*
G01*
X240625001Y-62325000D01*
G75*
G02*
X240875000Y-62574999I0J-249999D01*
G01*
X240875000Y-63275001D01*
G75*
G02*
X240625001Y-63525000I-249999J0D01*
G01*
G37*
%TD.AperFunction*%
%TA.AperFunction,SMDPad,CuDef*%
G36*
G01*
X240625001Y-69125000D02*
X239324999Y-69125000D01*
G75*
G02*
X239075000Y-68875001I0J249999D01*
G01*
X239075000Y-68174999D01*
G75*
G02*
X239324999Y-67925000I249999J0D01*
G01*
X240625001Y-67925000D01*
G75*
G02*
X240875000Y-68174999I0J-249999D01*
G01*
X240875000Y-68875001D01*
G75*
G02*
X240625001Y-69125000I-249999J0D01*
G01*
G37*
%TD.AperFunction*%
%TO.P,J7,4*%
%TO.N,SCL*%
%TA.AperFunction,SMDPad,CuDef*%
G36*
G01*
X244475000Y-64525000D02*
X243225000Y-64525000D01*
G75*
G02*
X243075000Y-64375000I0J150000D01*
G01*
X243075000Y-64075000D01*
G75*
G02*
X243225000Y-63925000I150000J0D01*
G01*
X244475000Y-63925000D01*
G75*
G02*
X244625000Y-64075000I0J-150000D01*
G01*
X244625000Y-64375000D01*
G75*
G02*
X244475000Y-64525000I-150000J0D01*
G01*
G37*
%TD.AperFunction*%
%TO.P,J7,3*%
%TO.N,SDA*%
%TA.AperFunction,SMDPad,CuDef*%
G36*
G01*
X244475000Y-65525000D02*
X243225000Y-65525000D01*
G75*
G02*
X243075000Y-65375000I0J150000D01*
G01*
X243075000Y-65075000D01*
G75*
G02*
X243225000Y-64925000I150000J0D01*
G01*
X244475000Y-64925000D01*
G75*
G02*
X244625000Y-65075000I0J-150000D01*
G01*
X244625000Y-65375000D01*
G75*
G02*
X244475000Y-65525000I-150000J0D01*
G01*
G37*
%TD.AperFunction*%
%TO.P,J7,2*%
%TO.N,+3V3*%
%TA.AperFunction,SMDPad,CuDef*%
G36*
G01*
X244475000Y-66525000D02*
X243225000Y-66525000D01*
G75*
G02*
X243075000Y-66375000I0J150000D01*
G01*
X243075000Y-66075000D01*
G75*
G02*
X243225000Y-65925000I150000J0D01*
G01*
X244475000Y-65925000D01*
G75*
G02*
X244625000Y-66075000I0J-150000D01*
G01*
X244625000Y-66375000D01*
G75*
G02*
X244475000Y-66525000I-150000J0D01*
G01*
G37*
%TD.AperFunction*%
%TO.P,J7,1*%
%TO.N,GND*%
%TA.AperFunction,SMDPad,CuDef*%
G36*
G01*
X244475000Y-67525000D02*
X243225000Y-67525000D01*
G75*
G02*
X243075000Y-67375000I0J150000D01*
G01*
X243075000Y-67075000D01*
G75*
G02*
X243225000Y-66925000I150000J0D01*
G01*
X244475000Y-66925000D01*
G75*
G02*
X244625000Y-67075000I0J-150000D01*
G01*
X244625000Y-67375000D01*
G75*
G02*
X244475000Y-67525000I-150000J0D01*
G01*
G37*
%TD.AperFunction*%
%TD*%
%TO.P,J2,1*%
%TO.N,GND*%
X206150000Y-27750000D03*
D10*
%TO.P,J2,2*%
%TO.N,+3V3*%
X203610000Y-27750000D03*
%TO.P,J2,3*%
%TO.N,SDA*%
X201070000Y-27750000D03*
%TO.P,J2,4*%
%TO.N,SCL*%
X198530000Y-27750000D03*
%TD*%
%TO.P,J1,16*%
%TO.N,N/C*%
X236450000Y-32450000D03*
%TO.P,J1,15*%
X233910000Y-32450000D03*
%TO.P,J1,14*%
X231370000Y-32450000D03*
%TO.P,J1,13*%
X228830000Y-32450000D03*
%TO.P,J1,12*%
X226290000Y-32450000D03*
%TO.P,J1,11*%
X223750000Y-32450000D03*
%TO.P,J1,10*%
X221210000Y-32450000D03*
%TO.P,J1,9*%
X218670000Y-32450000D03*
%TO.P,J1,8*%
X216130000Y-32450000D03*
%TO.P,J1,7*%
X213590000Y-32450000D03*
%TO.P,J1,6*%
X211050000Y-32450000D03*
%TO.P,J1,5*%
X208510000Y-32450000D03*
%TO.P,J1,4*%
X205970000Y-32450000D03*
%TO.P,J1,3*%
X203430000Y-32450000D03*
%TO.P,J1,2*%
X200890000Y-32450000D03*
D11*
%TO.P,J1,1*%
X198350000Y-32450000D03*
%TD*%
%TO.P,J12,1*%
%TO.N,N/C*%
X236450000Y-32450000D03*
D10*
%TO.P,J12,2*%
X236450000Y-34990000D03*
%TO.P,J12,3*%
X236450000Y-37530000D03*
%TO.P,J12,4*%
X236450000Y-40070000D03*
%TO.P,J12,5*%
X236450000Y-42610000D03*
%TO.P,J12,6*%
X236450000Y-45150000D03*
%TO.P,J12,7*%
X236450000Y-47690000D03*
%TO.P,J12,8*%
X236450000Y-50230000D03*
%TO.P,J12,9*%
X236450000Y-52770000D03*
%TO.P,J12,10*%
X236450000Y-55310000D03*
%TO.P,J12,11*%
X236450000Y-57850000D03*
%TO.P,J12,12*%
X236450000Y-60390000D03*
%TD*%
D11*
%TO.P,J3,1*%
%TO.N,N/C*%
X233900000Y-60400000D03*
D10*
%TO.P,J3,2*%
X231360000Y-60400000D03*
%TO.P,J3,3*%
X228820000Y-60400000D03*
%TO.P,J3,4*%
X226280000Y-60400000D03*
%TO.P,J3,5*%
X223740000Y-60400000D03*
%TO.P,J3,6*%
X221200000Y-60400000D03*
%TO.P,J3,7*%
X218660000Y-60400000D03*
%TO.P,J3,8*%
X216120000Y-60400000D03*
%TO.P,J3,9*%
X213580000Y-60400000D03*
%TO.P,J3,10*%
X211040000Y-60400000D03*
%TO.P,J3,11*%
X208500000Y-60400000D03*
%TO.P,J3,12*%
X205960000Y-60400000D03*
%TO.P,J3,13*%
X203420000Y-60400000D03*
%TO.P,J3,14*%
X200880000Y-60400000D03*
%TO.P,J3,15*%
X198340000Y-60400000D03*
%TO.P,J3,16*%
X195800000Y-60400000D03*
%TD*%
D12*
%TO.N,+3V3*%
X203100000Y-66800000D03*
X189225000Y-45125000D03*
X194900000Y-25500000D03*
X203400000Y-25500000D03*
X243500000Y-44000000D03*
X242100000Y-66100000D03*
X193400000Y-66300000D03*
X193100000Y-64200000D03*
X192800000Y-56800000D03*
X191500000Y-53800000D03*
%TO.N,GND*%
X223800000Y-67225000D03*
X221325000Y-62800000D03*
X245600000Y-42300000D03*
X206700000Y-67900000D03*
X193000000Y-32400000D03*
X192600000Y-46200000D03*
X228800000Y-67200000D03*
X189400000Y-65000000D03*
X239400000Y-49500000D03*
X245600000Y-62200000D03*
X245600000Y-66300000D03*
X240000000Y-60500000D03*
%TO.N,SDA*%
X198400000Y-46100000D03*
X199100000Y-53800000D03*
X223900000Y-54800000D03*
X240200000Y-65000000D03*
X199515001Y-62470001D03*
X238200000Y-49900000D03*
X237900000Y-54000000D03*
X241300000Y-48200000D03*
X242000000Y-44300000D03*
%TO.N,SCL*%
X197400000Y-43900000D03*
X197400000Y-51500000D03*
X226700000Y-53700000D03*
X234800000Y-46300000D03*
X233300000Y-53500000D03*
X243900000Y-63100000D03*
X235200000Y-63500000D03*
X196200000Y-62300000D03*
%TD*%
D13*
%TO.N,+3V3*%
X204060000Y-64475000D02*
X204060000Y-65760000D01*
X204060000Y-65760000D02*
X204900000Y-66600000D01*
X204900000Y-66600000D02*
X222500000Y-66600000D01*
X222500000Y-66600000D02*
X223000000Y-66100000D01*
X242225000Y-66225000D02*
X243850000Y-66225000D01*
X242100000Y-66100000D02*
X242225000Y-66225000D01*
X241400000Y-66100000D02*
X242100000Y-66100000D01*
X190825000Y-45125000D02*
X189225000Y-45125000D01*
X194900000Y-25500000D02*
X203400000Y-25500000D01*
X232400000Y-66100000D02*
X232400000Y-62400000D01*
X232400000Y-66100000D02*
X241400000Y-66100000D01*
X223000000Y-66100000D02*
X232400000Y-66100000D01*
X231950000Y-56650000D02*
X231950000Y-58917998D01*
X231950000Y-58917998D02*
X232432002Y-59400000D01*
D14*
X232610001Y-59710001D02*
X232610001Y-61489999D01*
X232432002Y-59400000D02*
X232432002Y-59532002D01*
X232432002Y-59532002D02*
X232610001Y-59710001D01*
X232610001Y-61489999D02*
X232400000Y-61700000D01*
D13*
X232400000Y-62400000D02*
X232400000Y-61700000D01*
X243325000Y-42200000D02*
X243325000Y-43825000D01*
X243325000Y-43825000D02*
X243500000Y-44000000D01*
X203100000Y-66800000D02*
X193900000Y-66800000D01*
X193900000Y-66800000D02*
X193400000Y-66300000D01*
X191300000Y-64200000D02*
X191200000Y-64100000D01*
X193100000Y-64200000D02*
X191300000Y-64200000D01*
X192800000Y-56800000D02*
X192800000Y-55100000D01*
X192800000Y-55100000D02*
X191500000Y-53800000D01*
%TO.N,GND*%
X221325000Y-62800000D02*
X208700000Y-62800000D01*
X208700000Y-62800000D02*
X208675000Y-62775000D01*
X208300000Y-62775000D02*
X206600000Y-64475000D01*
X208675000Y-62775000D02*
X208300000Y-62775000D01*
X244425000Y-42300000D02*
X244325000Y-42200000D01*
X245600000Y-42300000D02*
X244425000Y-42300000D01*
X206200000Y-29500000D02*
X193600000Y-29500000D01*
X193600000Y-29500000D02*
X193000000Y-30100000D01*
X193000000Y-30100000D02*
X193000000Y-32400000D01*
X190900000Y-46200000D02*
X190825000Y-46125000D01*
X192600000Y-46200000D02*
X190900000Y-46200000D01*
X228725000Y-67225000D02*
X228775000Y-67225000D01*
X228775000Y-67225000D02*
X228800000Y-67200000D01*
X228725000Y-67225000D02*
X223800000Y-67225000D01*
X243850000Y-67225000D02*
X228725000Y-67225000D01*
X191200000Y-65100000D02*
X191200000Y-67400000D01*
X191700000Y-67900000D02*
X206700000Y-67900000D01*
X191200000Y-67400000D02*
X191700000Y-67900000D01*
X191200000Y-65100000D02*
X189500000Y-65100000D01*
X189500000Y-65100000D02*
X189400000Y-65000000D01*
X245075000Y-67225000D02*
X245600000Y-66700000D01*
X243850000Y-67225000D02*
X245075000Y-67225000D01*
X244325000Y-42200000D02*
X244325000Y-42475000D01*
X241900000Y-49500000D02*
X239400000Y-49500000D01*
X244325000Y-42475000D02*
X244700000Y-42850000D01*
X244700000Y-44300000D02*
X244000000Y-45000000D01*
X240000000Y-60500000D02*
X240600000Y-61100000D01*
X244500000Y-61100000D02*
X245600000Y-62200000D01*
X240600000Y-61100000D02*
X244500000Y-61100000D01*
X244000000Y-45000000D02*
X244000000Y-47400000D01*
X244700000Y-42850000D02*
X244700000Y-44300000D01*
X244000000Y-47400000D02*
X241900000Y-49500000D01*
X245600000Y-66700000D02*
X245600000Y-66300000D01*
X206200000Y-27800000D02*
X206150000Y-27750000D01*
X206200000Y-29500000D02*
X206200000Y-27800000D01*
D15*
%TO.N,SDA*%
X190825000Y-44125000D02*
X192625000Y-44125000D01*
X198174999Y-46325001D02*
X198400000Y-46100000D01*
X192625000Y-44125000D02*
X194825001Y-46325001D01*
X194825001Y-46325001D02*
X198174999Y-46325001D01*
X198954999Y-53945001D02*
X199100000Y-53800000D01*
X200100000Y-54800000D02*
X199100000Y-53800000D01*
X223900000Y-54800000D02*
X200100000Y-54800000D01*
X243850000Y-65225000D02*
X240425000Y-65225000D01*
X240425000Y-65225000D02*
X240200000Y-65000000D01*
X191200000Y-63100000D02*
X197200000Y-63100000D01*
X197200000Y-63100000D02*
X197829999Y-62470001D01*
X197829999Y-62470001D02*
X199515001Y-62470001D01*
X235000000Y-54800000D02*
X223900000Y-54800000D01*
X235700000Y-54100000D02*
X235000000Y-54800000D01*
X237900000Y-54000000D02*
X235700000Y-54000000D01*
X235700000Y-54000000D02*
X235700000Y-54100000D01*
X242325000Y-42200000D02*
X242325000Y-43975000D01*
X242325000Y-43975000D02*
X242000000Y-44300000D01*
X238900000Y-48200000D02*
X238600000Y-48200000D01*
X238900000Y-48200000D02*
X238700000Y-48200000D01*
X241300000Y-48200000D02*
X238900000Y-48200000D01*
X238599999Y-49500001D02*
X238200000Y-49900000D01*
X238600000Y-48200000D02*
X238599999Y-49500001D01*
%TO.N,SCL*%
X197400000Y-43900000D02*
X193900000Y-43900000D01*
X193125000Y-43125000D02*
X190825000Y-43125000D01*
X193900000Y-43900000D02*
X193125000Y-43125000D01*
X197375000Y-51525000D02*
X197400000Y-51500000D01*
X226700000Y-53700000D02*
X226000000Y-53000000D01*
X226000000Y-53000000D02*
X200400000Y-53000000D01*
X198900000Y-51500000D02*
X197400000Y-51500000D01*
X200400000Y-53000000D02*
X198900000Y-51500000D01*
X241325000Y-42200000D02*
X241000000Y-42200000D01*
X241000000Y-42200000D02*
X239400000Y-43800000D01*
X239400000Y-43800000D02*
X235100000Y-43800000D01*
X235100000Y-43800000D02*
X234800000Y-44100000D01*
X234800000Y-44100000D02*
X234800000Y-46300000D01*
X226900000Y-53500000D02*
X226700000Y-53700000D01*
X233300000Y-53500000D02*
X226900000Y-53500000D01*
X243850000Y-64225000D02*
X243850000Y-63150000D01*
X243850000Y-63150000D02*
X243900000Y-63100000D01*
X243850000Y-64225000D02*
X235925000Y-64225000D01*
X235925000Y-64225000D02*
X235200000Y-63500000D01*
X191400000Y-62300000D02*
X191200000Y-62100000D01*
X196200000Y-62300000D02*
X191400000Y-62300000D01*
%TD*%
M02*
