%TF.GenerationSoftware,KiCad,Pcbnew,5.1.12-84ad8e8a86~92~ubuntu18.04.1*%
%TF.CreationDate,2022-01-16T18:39:34-05:00*%
%TF.ProjectId,remote,72656d6f-7465-42e6-9b69-6361645f7063,rev?*%
%TF.SameCoordinates,Original*%
%TF.FileFunction,Paste,Top*%
%TF.FilePolarity,Positive*%
%FSLAX46Y46*%
G04 Gerber Fmt 4.6, Leading zero omitted, Abs format (unit mm)*
G04 Created by KiCad (PCBNEW 5.1.12-84ad8e8a86~92~ubuntu18.04.1) date 2022-01-16 18:39:34*
%MOMM*%
%LPD*%
G01*
G04 APERTURE LIST*
G04 APERTURE END LIST*
%TO.C,J2*%
G36*
G01*
X10800000Y-8874999D02*
X10800000Y-10175001D01*
G75*
G02*
X10550001Y-10425000I-249999J0D01*
G01*
X9849999Y-10425000D01*
G75*
G02*
X9600000Y-10175001I0J249999D01*
G01*
X9600000Y-8874999D01*
G75*
G02*
X9849999Y-8625000I249999J0D01*
G01*
X10550001Y-8625000D01*
G75*
G02*
X10800000Y-8874999I0J-249999D01*
G01*
G37*
G36*
G01*
X16400000Y-8874999D02*
X16400000Y-10175001D01*
G75*
G02*
X16150001Y-10425000I-249999J0D01*
G01*
X15449999Y-10425000D01*
G75*
G02*
X15200000Y-10175001I0J249999D01*
G01*
X15200000Y-8874999D01*
G75*
G02*
X15449999Y-8625000I249999J0D01*
G01*
X16150001Y-8625000D01*
G75*
G02*
X16400000Y-8874999I0J-249999D01*
G01*
G37*
G36*
G01*
X11800000Y-12775000D02*
X11800000Y-14025000D01*
G75*
G02*
X11650000Y-14175000I-150000J0D01*
G01*
X11350000Y-14175000D01*
G75*
G02*
X11200000Y-14025000I0J150000D01*
G01*
X11200000Y-12775000D01*
G75*
G02*
X11350000Y-12625000I150000J0D01*
G01*
X11650000Y-12625000D01*
G75*
G02*
X11800000Y-12775000I0J-150000D01*
G01*
G37*
G36*
G01*
X12800000Y-12775000D02*
X12800000Y-14025000D01*
G75*
G02*
X12650000Y-14175000I-150000J0D01*
G01*
X12350000Y-14175000D01*
G75*
G02*
X12200000Y-14025000I0J150000D01*
G01*
X12200000Y-12775000D01*
G75*
G02*
X12350000Y-12625000I150000J0D01*
G01*
X12650000Y-12625000D01*
G75*
G02*
X12800000Y-12775000I0J-150000D01*
G01*
G37*
G36*
G01*
X13800000Y-12775000D02*
X13800000Y-14025000D01*
G75*
G02*
X13650000Y-14175000I-150000J0D01*
G01*
X13350000Y-14175000D01*
G75*
G02*
X13200000Y-14025000I0J150000D01*
G01*
X13200000Y-12775000D01*
G75*
G02*
X13350000Y-12625000I150000J0D01*
G01*
X13650000Y-12625000D01*
G75*
G02*
X13800000Y-12775000I0J-150000D01*
G01*
G37*
G36*
G01*
X14800000Y-12775000D02*
X14800000Y-14025000D01*
G75*
G02*
X14650000Y-14175000I-150000J0D01*
G01*
X14350000Y-14175000D01*
G75*
G02*
X14200000Y-14025000I0J150000D01*
G01*
X14200000Y-12775000D01*
G75*
G02*
X14350000Y-12625000I150000J0D01*
G01*
X14650000Y-12625000D01*
G75*
G02*
X14800000Y-12775000I0J-150000D01*
G01*
G37*
%TD*%
M02*
