%TF.GenerationSoftware,KiCad,Pcbnew,5.1.6-c6e7f7d~87~ubuntu18.04.1*%
%TF.CreationDate,2021-09-22T20:52:25-04:00*%
%TF.ProjectId,remote,72656d6f-7465-42e6-9b69-6361645f7063,rev?*%
%TF.SameCoordinates,Original*%
%TF.FileFunction,Copper,L1,Top*%
%TF.FilePolarity,Positive*%
%FSLAX46Y46*%
G04 Gerber Fmt 4.6, Leading zero omitted, Abs format (unit mm)*
G04 Created by KiCad (PCBNEW 5.1.6-c6e7f7d~87~ubuntu18.04.1) date 2021-09-22 20:52:25*
%MOMM*%
%LPD*%
G01*
G04 APERTURE LIST*
%TA.AperFunction,ComponentPad*%
%ADD10R,1.700000X1.700000*%
%TD*%
%TA.AperFunction,ComponentPad*%
%ADD11O,1.700000X1.700000*%
%TD*%
%TA.AperFunction,ComponentPad*%
%ADD12C,5.400000*%
%TD*%
%TA.AperFunction,ComponentPad*%
%ADD13C,2.100000*%
%TD*%
%TA.AperFunction,ComponentPad*%
%ADD14C,1.750000*%
%TD*%
%TA.AperFunction,ComponentPad*%
%ADD15O,1.200000X1.750000*%
%TD*%
%TA.AperFunction,ComponentPad*%
%ADD16O,2.800000X2.800000*%
%TD*%
%TA.AperFunction,ComponentPad*%
%ADD17R,2.800000X2.800000*%
%TD*%
%TA.AperFunction,ComponentPad*%
%ADD18R,1.600000X1.600000*%
%TD*%
%TA.AperFunction,ComponentPad*%
%ADD19C,1.600000*%
%TD*%
%TA.AperFunction,ComponentPad*%
%ADD20O,1.600000X1.600000*%
%TD*%
%TA.AperFunction,ComponentPad*%
%ADD21R,3.500000X3.500000*%
%TD*%
%TA.AperFunction,ComponentPad*%
%ADD22C,2.600000*%
%TD*%
%TA.AperFunction,ComponentPad*%
%ADD23R,2.600000X2.600000*%
%TD*%
%TA.AperFunction,ViaPad*%
%ADD24C,0.800000*%
%TD*%
%TA.AperFunction,Conductor*%
%ADD25C,0.700000*%
%TD*%
%TA.AperFunction,Conductor*%
%ADD26C,0.250000*%
%TD*%
G04 APERTURE END LIST*
%TO.P,J13,MP*%
%TO.N,N/C*%
%TA.AperFunction,SMDPad,CuDef*%
G36*
G01*
X14042000Y-91325001D02*
X14042000Y-90024999D01*
G75*
G02*
X14291999Y-89775000I249999J0D01*
G01*
X14992001Y-89775000D01*
G75*
G02*
X15242000Y-90024999I0J-249999D01*
G01*
X15242000Y-91325001D01*
G75*
G02*
X14992001Y-91575000I-249999J0D01*
G01*
X14291999Y-91575000D01*
G75*
G02*
X14042000Y-91325001I0J249999D01*
G01*
G37*
%TD.AperFunction*%
%TA.AperFunction,SMDPad,CuDef*%
G36*
G01*
X8442000Y-91325001D02*
X8442000Y-90024999D01*
G75*
G02*
X8691999Y-89775000I249999J0D01*
G01*
X9392001Y-89775000D01*
G75*
G02*
X9642000Y-90024999I0J-249999D01*
G01*
X9642000Y-91325001D01*
G75*
G02*
X9392001Y-91575000I-249999J0D01*
G01*
X8691999Y-91575000D01*
G75*
G02*
X8442000Y-91325001I0J249999D01*
G01*
G37*
%TD.AperFunction*%
%TO.P,J13,4*%
%TO.N,SCL*%
%TA.AperFunction,SMDPad,CuDef*%
G36*
G01*
X13042000Y-87425000D02*
X13042000Y-86175000D01*
G75*
G02*
X13192000Y-86025000I150000J0D01*
G01*
X13492000Y-86025000D01*
G75*
G02*
X13642000Y-86175000I0J-150000D01*
G01*
X13642000Y-87425000D01*
G75*
G02*
X13492000Y-87575000I-150000J0D01*
G01*
X13192000Y-87575000D01*
G75*
G02*
X13042000Y-87425000I0J150000D01*
G01*
G37*
%TD.AperFunction*%
%TO.P,J13,3*%
%TO.N,SDA*%
%TA.AperFunction,SMDPad,CuDef*%
G36*
G01*
X12042000Y-87425000D02*
X12042000Y-86175000D01*
G75*
G02*
X12192000Y-86025000I150000J0D01*
G01*
X12492000Y-86025000D01*
G75*
G02*
X12642000Y-86175000I0J-150000D01*
G01*
X12642000Y-87425000D01*
G75*
G02*
X12492000Y-87575000I-150000J0D01*
G01*
X12192000Y-87575000D01*
G75*
G02*
X12042000Y-87425000I0J150000D01*
G01*
G37*
%TD.AperFunction*%
%TO.P,J13,2*%
%TO.N,+3V3*%
%TA.AperFunction,SMDPad,CuDef*%
G36*
G01*
X11042000Y-87425000D02*
X11042000Y-86175000D01*
G75*
G02*
X11192000Y-86025000I150000J0D01*
G01*
X11492000Y-86025000D01*
G75*
G02*
X11642000Y-86175000I0J-150000D01*
G01*
X11642000Y-87425000D01*
G75*
G02*
X11492000Y-87575000I-150000J0D01*
G01*
X11192000Y-87575000D01*
G75*
G02*
X11042000Y-87425000I0J150000D01*
G01*
G37*
%TD.AperFunction*%
%TO.P,J13,1*%
%TO.N,GND*%
%TA.AperFunction,SMDPad,CuDef*%
G36*
G01*
X10042000Y-87425000D02*
X10042000Y-86175000D01*
G75*
G02*
X10192000Y-86025000I150000J0D01*
G01*
X10492000Y-86025000D01*
G75*
G02*
X10642000Y-86175000I0J-150000D01*
G01*
X10642000Y-87425000D01*
G75*
G02*
X10492000Y-87575000I-150000J0D01*
G01*
X10192000Y-87575000D01*
G75*
G02*
X10042000Y-87425000I0J150000D01*
G01*
G37*
%TD.AperFunction*%
%TD*%
D10*
%TO.P,J9,1*%
%TO.N,VBAT*%
X34872000Y-59070000D03*
D11*
%TO.P,J9,2*%
%TO.N,EN*%
X32332000Y-59070000D03*
%TO.P,J9,3*%
%TO.N,VBUS*%
X29792000Y-59070000D03*
%TO.P,J9,4*%
%TO.N,D13*%
X27252000Y-59070000D03*
%TO.P,J9,5*%
%TO.N,D12*%
X24712000Y-59070000D03*
%TO.P,J9,6*%
%TO.N,D11*%
X22172000Y-59070000D03*
%TO.P,J9,7*%
%TO.N,D10*%
X19632000Y-59070000D03*
%TO.P,J9,8*%
%TO.N,D9*%
X17092000Y-59070000D03*
%TO.P,J9,9*%
%TO.N,D6*%
X14552000Y-59070000D03*
%TO.P,J9,10*%
%TO.N,D5*%
X12012000Y-59070000D03*
%TO.P,J9,11*%
%TO.N,SCL*%
X9472000Y-59070000D03*
%TO.P,J9,12*%
%TO.N,SDA*%
X6932000Y-59070000D03*
%TD*%
%TO.P,J16,4*%
%TO.N,SDA*%
X16750000Y-5000000D03*
%TO.P,J16,3*%
%TO.N,SCL*%
X14210000Y-5000000D03*
%TO.P,J16,2*%
%TO.N,+3V3*%
X11670000Y-5000000D03*
D10*
%TO.P,J16,1*%
%TO.N,GND*%
X9130000Y-5000000D03*
%TD*%
D11*
%TO.P,J15,7*%
%TO.N,TX_D1*%
X18572000Y-87550000D03*
%TO.P,J15,6*%
%TO.N,RX_D0*%
X21112000Y-87550000D03*
%TO.P,J15,5*%
%TO.N,A2*%
X23652000Y-87550000D03*
%TO.P,J15,4*%
%TO.N,A1*%
X26192000Y-87550000D03*
%TO.P,J15,3*%
%TO.N,A0*%
X28732000Y-87550000D03*
%TO.P,J15,2*%
%TO.N,GND*%
X31272000Y-87550000D03*
D10*
%TO.P,J15,1*%
%TO.N,+3V3*%
X33812000Y-87550000D03*
%TD*%
D11*
%TO.P,J14,7*%
%TO.N,N/C*%
X46382000Y-28570000D03*
%TO.P,J14,6*%
X46382000Y-26030000D03*
%TO.P,J14,5*%
X46382000Y-23490000D03*
%TO.P,J14,4*%
X46382000Y-20950000D03*
%TO.P,J14,3*%
X46382000Y-18410000D03*
%TO.P,J14,2*%
X46382000Y-15870000D03*
D10*
%TO.P,J14,1*%
X46382000Y-13330000D03*
%TD*%
%TO.P,J11,1*%
%TO.N,N/C*%
X5502000Y-13330000D03*
D11*
%TO.P,J11,2*%
X5502000Y-15870000D03*
%TO.P,J11,3*%
X5502000Y-18410000D03*
%TO.P,J11,4*%
X5502000Y-20950000D03*
%TO.P,J11,5*%
X5502000Y-23490000D03*
%TO.P,J11,6*%
X5502000Y-26030000D03*
%TO.P,J11,7*%
X5502000Y-28570000D03*
%TD*%
%TO.P,J6,15*%
%TO.N,N/C*%
X43662000Y-9370000D03*
%TO.P,J6,14*%
X41122000Y-9370000D03*
%TO.P,J6,13*%
X38582000Y-9370000D03*
%TO.P,J6,12*%
X36042000Y-9370000D03*
%TO.P,J6,11*%
X33502000Y-9370000D03*
%TO.P,J6,10*%
X30962000Y-9370000D03*
%TO.P,J6,9*%
X28422000Y-9370000D03*
%TO.P,J6,8*%
X25882000Y-9370000D03*
%TO.P,J6,7*%
X23342000Y-9370000D03*
%TO.P,J6,6*%
X20802000Y-9370000D03*
%TO.P,J6,5*%
X18262000Y-9370000D03*
%TO.P,J6,4*%
X15722000Y-9370000D03*
%TO.P,J6,3*%
X13182000Y-9370000D03*
%TO.P,J6,2*%
X10642000Y-9370000D03*
D10*
%TO.P,J6,1*%
X8102000Y-9370000D03*
%TD*%
D11*
%TO.P,J17,7*%
%TO.N,N/C*%
X26712000Y-34280000D03*
%TO.P,J17,6*%
X29252000Y-34280000D03*
%TO.P,J17,5*%
X31792000Y-34280000D03*
%TO.P,J17,4*%
%TO.N,SDA*%
X34332000Y-34280000D03*
%TO.P,J17,3*%
%TO.N,SCL*%
X36872000Y-34280000D03*
%TO.P,J17,2*%
%TO.N,GND*%
X39412000Y-34280000D03*
D10*
%TO.P,J17,1*%
%TO.N,+3V3*%
X41952000Y-34280000D03*
%TD*%
D12*
%TO.P,H5,1*%
%TO.N,A3*%
X48060000Y-4020000D03*
%TD*%
%TO.P,H6,1*%
%TO.N,D5*%
X4000000Y-4000000D03*
%TD*%
%TO.P,H4,1*%
%TO.N,SDA*%
X48000000Y-34000000D03*
%TD*%
%TO.P,H3,1*%
%TO.N,SCL*%
X4000000Y-34000000D03*
%TD*%
%TO.P,H2,1*%
%TO.N,+3V3*%
X48000000Y-89000000D03*
%TD*%
%TO.P,H1,1*%
%TO.N,GND*%
X4000000Y-89000000D03*
%TD*%
%TO.P,J18,MP*%
%TO.N,N/C*%
%TA.AperFunction,SMDPad,CuDef*%
G36*
G01*
X42762000Y-91325001D02*
X42762000Y-90024999D01*
G75*
G02*
X43011999Y-89775000I249999J0D01*
G01*
X43712001Y-89775000D01*
G75*
G02*
X43962000Y-90024999I0J-249999D01*
G01*
X43962000Y-91325001D01*
G75*
G02*
X43712001Y-91575000I-249999J0D01*
G01*
X43011999Y-91575000D01*
G75*
G02*
X42762000Y-91325001I0J249999D01*
G01*
G37*
%TD.AperFunction*%
%TA.AperFunction,SMDPad,CuDef*%
G36*
G01*
X37162000Y-91325001D02*
X37162000Y-90024999D01*
G75*
G02*
X37411999Y-89775000I249999J0D01*
G01*
X38112001Y-89775000D01*
G75*
G02*
X38362000Y-90024999I0J-249999D01*
G01*
X38362000Y-91325001D01*
G75*
G02*
X38112001Y-91575000I-249999J0D01*
G01*
X37411999Y-91575000D01*
G75*
G02*
X37162000Y-91325001I0J249999D01*
G01*
G37*
%TD.AperFunction*%
%TO.P,J18,4*%
%TO.N,SCL*%
%TA.AperFunction,SMDPad,CuDef*%
G36*
G01*
X41762000Y-87425000D02*
X41762000Y-86175000D01*
G75*
G02*
X41912000Y-86025000I150000J0D01*
G01*
X42212000Y-86025000D01*
G75*
G02*
X42362000Y-86175000I0J-150000D01*
G01*
X42362000Y-87425000D01*
G75*
G02*
X42212000Y-87575000I-150000J0D01*
G01*
X41912000Y-87575000D01*
G75*
G02*
X41762000Y-87425000I0J150000D01*
G01*
G37*
%TD.AperFunction*%
%TO.P,J18,3*%
%TO.N,SDA*%
%TA.AperFunction,SMDPad,CuDef*%
G36*
G01*
X40762000Y-87425000D02*
X40762000Y-86175000D01*
G75*
G02*
X40912000Y-86025000I150000J0D01*
G01*
X41212000Y-86025000D01*
G75*
G02*
X41362000Y-86175000I0J-150000D01*
G01*
X41362000Y-87425000D01*
G75*
G02*
X41212000Y-87575000I-150000J0D01*
G01*
X40912000Y-87575000D01*
G75*
G02*
X40762000Y-87425000I0J150000D01*
G01*
G37*
%TD.AperFunction*%
%TO.P,J18,2*%
%TO.N,+3V3*%
%TA.AperFunction,SMDPad,CuDef*%
G36*
G01*
X39762000Y-87425000D02*
X39762000Y-86175000D01*
G75*
G02*
X39912000Y-86025000I150000J0D01*
G01*
X40212000Y-86025000D01*
G75*
G02*
X40362000Y-86175000I0J-150000D01*
G01*
X40362000Y-87425000D01*
G75*
G02*
X40212000Y-87575000I-150000J0D01*
G01*
X39912000Y-87575000D01*
G75*
G02*
X39762000Y-87425000I0J150000D01*
G01*
G37*
%TD.AperFunction*%
%TO.P,J18,1*%
%TO.N,GND*%
%TA.AperFunction,SMDPad,CuDef*%
G36*
G01*
X38762000Y-87425000D02*
X38762000Y-86175000D01*
G75*
G02*
X38912000Y-86025000I150000J0D01*
G01*
X39212000Y-86025000D01*
G75*
G02*
X39362000Y-86175000I0J-150000D01*
G01*
X39362000Y-87425000D01*
G75*
G02*
X39212000Y-87575000I-150000J0D01*
G01*
X38912000Y-87575000D01*
G75*
G02*
X38762000Y-87425000I0J150000D01*
G01*
G37*
%TD.AperFunction*%
%TD*%
D11*
%TO.P,J5,3*%
%TO.N,VBAT_EXT*%
X4110000Y-70810000D03*
%TO.P,J5,2*%
%TO.N,VBAT*%
X4110000Y-73350000D03*
D10*
%TO.P,J5,1*%
%TO.N,GND*%
X4110000Y-75890000D03*
%TD*%
D13*
%TO.P,SW2,*%
%TO.N,*%
X40508000Y-67664000D03*
D14*
%TO.P,SW2,1*%
%TO.N,A5*%
X42998000Y-68914000D03*
%TO.P,SW2,2*%
%TO.N,GND*%
X42998000Y-73414000D03*
D13*
%TO.P,SW2,*%
%TO.N,*%
X40508000Y-74674000D03*
%TD*%
%TO.P,SW1,*%
%TO.N,*%
X40508000Y-46074000D03*
D14*
%TO.P,SW1,1*%
%TO.N,A4*%
X42998000Y-47324000D03*
%TO.P,SW1,2*%
%TO.N,GND*%
X42998000Y-51824000D03*
D13*
%TO.P,SW1,*%
%TO.N,*%
X40508000Y-53084000D03*
%TD*%
D15*
%TO.P,J1,2*%
%TO.N,VBAT_EXT*%
X11672000Y-79640000D03*
%TO.P,J1,1*%
%TO.N,GND*%
%TA.AperFunction,ComponentPad*%
G36*
G01*
X9072000Y-80265001D02*
X9072000Y-79014999D01*
G75*
G02*
X9321999Y-78765000I249999J0D01*
G01*
X10022001Y-78765000D01*
G75*
G02*
X10272000Y-79014999I0J-249999D01*
G01*
X10272000Y-80265001D01*
G75*
G02*
X10022001Y-80515000I-249999J0D01*
G01*
X9321999Y-80515000D01*
G75*
G02*
X9072000Y-80265001I0J249999D01*
G01*
G37*
%TD.AperFunction*%
%TD*%
D10*
%TO.P,J10,1*%
%TO.N,D4*%
X6922000Y-38786000D03*
D11*
%TO.P,J10,2*%
%TO.N,TX_D1*%
X9462000Y-38786000D03*
%TO.P,J10,3*%
%TO.N,RX_D0*%
X12002000Y-38786000D03*
%TO.P,J10,4*%
%TO.N,MISO*%
X14542000Y-38786000D03*
%TO.P,J10,5*%
%TO.N,MOSI*%
X17082000Y-38786000D03*
%TO.P,J10,6*%
%TO.N,SCK*%
X19622000Y-38786000D03*
%TO.P,J10,7*%
%TO.N,A5*%
X22162000Y-38786000D03*
%TO.P,J10,8*%
%TO.N,A4*%
X24702000Y-38786000D03*
%TO.P,J10,9*%
%TO.N,A3*%
X27242000Y-38786000D03*
%TO.P,J10,10*%
%TO.N,A2*%
X29782000Y-38786000D03*
%TO.P,J10,11*%
%TO.N,A1*%
X32322000Y-38786000D03*
%TO.P,J10,12*%
%TO.N,A0*%
X34862000Y-38786000D03*
%TO.P,J10,13*%
%TO.N,GND*%
X37402000Y-38786000D03*
%TO.P,J10,14*%
%TO.N,AREF*%
X39942000Y-38786000D03*
%TO.P,J10,15*%
%TO.N,+3V3*%
X42482000Y-38786000D03*
%TO.P,J10,16*%
%TO.N,~RESET*%
X45022000Y-38786000D03*
%TD*%
%TO.P,J2,12*%
%TO.N,SDA*%
X6982000Y-83420000D03*
%TO.P,J2,11*%
%TO.N,SCL*%
X9522000Y-83420000D03*
%TO.P,J2,10*%
%TO.N,D5*%
X12062000Y-83420000D03*
%TO.P,J2,9*%
%TO.N,D6*%
X14602000Y-83420000D03*
%TO.P,J2,8*%
%TO.N,D9*%
X17142000Y-83420000D03*
%TO.P,J2,7*%
%TO.N,D10*%
X19682000Y-83420000D03*
%TO.P,J2,6*%
%TO.N,D11*%
X22222000Y-83420000D03*
%TO.P,J2,5*%
%TO.N,D12*%
X24762000Y-83420000D03*
%TO.P,J2,4*%
%TO.N,D13*%
X27302000Y-83420000D03*
%TO.P,J2,3*%
%TO.N,VBUS*%
X29842000Y-83420000D03*
%TO.P,J2,2*%
%TO.N,EN*%
X32382000Y-83420000D03*
D10*
%TO.P,J2,1*%
%TO.N,VBAT*%
X34922000Y-83420000D03*
%TD*%
D11*
%TO.P,J3,16*%
%TO.N,~RESET*%
X45042000Y-63130000D03*
%TO.P,J3,15*%
%TO.N,+3V3*%
X42502000Y-63130000D03*
%TO.P,J3,14*%
%TO.N,AREF*%
X39962000Y-63130000D03*
%TO.P,J3,13*%
%TO.N,GND*%
X37422000Y-63130000D03*
%TO.P,J3,12*%
%TO.N,A0*%
X34882000Y-63130000D03*
%TO.P,J3,11*%
%TO.N,A1*%
X32342000Y-63130000D03*
%TO.P,J3,10*%
%TO.N,A2*%
X29802000Y-63130000D03*
%TO.P,J3,9*%
%TO.N,A3*%
X27262000Y-63130000D03*
%TO.P,J3,8*%
%TO.N,A4*%
X24722000Y-63130000D03*
%TO.P,J3,7*%
%TO.N,A5*%
X22182000Y-63130000D03*
%TO.P,J3,6*%
%TO.N,SCK*%
X19642000Y-63130000D03*
%TO.P,J3,5*%
%TO.N,MOSI*%
X17102000Y-63130000D03*
%TO.P,J3,4*%
%TO.N,MISO*%
X14562000Y-63130000D03*
%TO.P,J3,3*%
%TO.N,RX_D0*%
X12022000Y-63130000D03*
%TO.P,J3,2*%
%TO.N,TX_D1*%
X9482000Y-63130000D03*
D10*
%TO.P,J3,1*%
%TO.N,D4*%
X6942000Y-63130000D03*
%TD*%
D16*
%TO.P,D1,2*%
%TO.N,VOUT_DCDC*%
X16042000Y-66940000D03*
D17*
%TO.P,D1,1*%
%TO.N,VBUS*%
X16042000Y-79640000D03*
%TD*%
D18*
%TO.P,C2,1*%
%TO.N,VOUT_DCDC*%
X45810000Y-79530000D03*
D19*
%TO.P,C2,2*%
%TO.N,GND*%
X48310000Y-79530000D03*
%TD*%
D18*
%TO.P,C1,1*%
%TO.N,VIN_DCDC*%
X39540000Y-79530000D03*
D19*
%TO.P,C1,2*%
%TO.N,GND*%
X42040000Y-79530000D03*
%TD*%
D10*
%TO.P,J4,1*%
%TO.N,VIN_DCDC*%
X34984000Y-75720000D03*
D11*
%TO.P,J4,2*%
%TO.N,GND*%
X34984000Y-73180000D03*
%TO.P,J4,3*%
%TO.N,VOUT_DCDC*%
X34984000Y-70640000D03*
%TD*%
D20*
%TO.P,R4,2*%
%TO.N,A4*%
X33332000Y-42000000D03*
D19*
%TO.P,R4,1*%
%TO.N,+3V3*%
X33332000Y-54700000D03*
%TD*%
%TO.P,J12,1*%
%TO.N,GND*%
%TA.AperFunction,SMDPad,CuDef*%
G36*
G01*
X40790000Y-5215000D02*
X40790000Y-6465000D01*
G75*
G02*
X40640000Y-6615000I-150000J0D01*
G01*
X40340000Y-6615000D01*
G75*
G02*
X40190000Y-6465000I0J150000D01*
G01*
X40190000Y-5215000D01*
G75*
G02*
X40340000Y-5065000I150000J0D01*
G01*
X40640000Y-5065000D01*
G75*
G02*
X40790000Y-5215000I0J-150000D01*
G01*
G37*
%TD.AperFunction*%
%TO.P,J12,2*%
%TO.N,+3V3*%
%TA.AperFunction,SMDPad,CuDef*%
G36*
G01*
X39790000Y-5215000D02*
X39790000Y-6465000D01*
G75*
G02*
X39640000Y-6615000I-150000J0D01*
G01*
X39340000Y-6615000D01*
G75*
G02*
X39190000Y-6465000I0J150000D01*
G01*
X39190000Y-5215000D01*
G75*
G02*
X39340000Y-5065000I150000J0D01*
G01*
X39640000Y-5065000D01*
G75*
G02*
X39790000Y-5215000I0J-150000D01*
G01*
G37*
%TD.AperFunction*%
%TO.P,J12,3*%
%TO.N,SDA*%
%TA.AperFunction,SMDPad,CuDef*%
G36*
G01*
X38790000Y-5215000D02*
X38790000Y-6465000D01*
G75*
G02*
X38640000Y-6615000I-150000J0D01*
G01*
X38340000Y-6615000D01*
G75*
G02*
X38190000Y-6465000I0J150000D01*
G01*
X38190000Y-5215000D01*
G75*
G02*
X38340000Y-5065000I150000J0D01*
G01*
X38640000Y-5065000D01*
G75*
G02*
X38790000Y-5215000I0J-150000D01*
G01*
G37*
%TD.AperFunction*%
%TO.P,J12,4*%
%TO.N,SCL*%
%TA.AperFunction,SMDPad,CuDef*%
G36*
G01*
X37790000Y-5215000D02*
X37790000Y-6465000D01*
G75*
G02*
X37640000Y-6615000I-150000J0D01*
G01*
X37340000Y-6615000D01*
G75*
G02*
X37190000Y-6465000I0J150000D01*
G01*
X37190000Y-5215000D01*
G75*
G02*
X37340000Y-5065000I150000J0D01*
G01*
X37640000Y-5065000D01*
G75*
G02*
X37790000Y-5215000I0J-150000D01*
G01*
G37*
%TD.AperFunction*%
%TO.P,J12,MP*%
%TO.N,N/C*%
%TA.AperFunction,SMDPad,CuDef*%
G36*
G01*
X42390000Y-1314999D02*
X42390000Y-2615001D01*
G75*
G02*
X42140001Y-2865000I-249999J0D01*
G01*
X41439999Y-2865000D01*
G75*
G02*
X41190000Y-2615001I0J249999D01*
G01*
X41190000Y-1314999D01*
G75*
G02*
X41439999Y-1065000I249999J0D01*
G01*
X42140001Y-1065000D01*
G75*
G02*
X42390000Y-1314999I0J-249999D01*
G01*
G37*
%TD.AperFunction*%
%TA.AperFunction,SMDPad,CuDef*%
G36*
G01*
X36790000Y-1314999D02*
X36790000Y-2615001D01*
G75*
G02*
X36540001Y-2865000I-249999J0D01*
G01*
X35839999Y-2865000D01*
G75*
G02*
X35590000Y-2615001I0J249999D01*
G01*
X35590000Y-1314999D01*
G75*
G02*
X35839999Y-1065000I249999J0D01*
G01*
X36540001Y-1065000D01*
G75*
G02*
X36790000Y-1314999I0J-249999D01*
G01*
G37*
%TD.AperFunction*%
%TD*%
%TO.P,J7,3*%
%TO.N,N/C*%
%TA.AperFunction,ComponentPad*%
G36*
G01*
X21901000Y-72140000D02*
X20151000Y-72140000D01*
G75*
G02*
X19276000Y-71265000I0J875000D01*
G01*
X19276000Y-69515000D01*
G75*
G02*
X20151000Y-68640000I875000J0D01*
G01*
X21901000Y-68640000D01*
G75*
G02*
X22776000Y-69515000I0J-875000D01*
G01*
X22776000Y-71265000D01*
G75*
G02*
X21901000Y-72140000I-875000J0D01*
G01*
G37*
%TD.AperFunction*%
%TO.P,J7,2*%
%TO.N,GND*%
%TA.AperFunction,ComponentPad*%
G36*
G01*
X26726000Y-74890000D02*
X24726000Y-74890000D01*
G75*
G02*
X23976000Y-74140000I0J750000D01*
G01*
X23976000Y-72640000D01*
G75*
G02*
X24726000Y-71890000I750000J0D01*
G01*
X26726000Y-71890000D01*
G75*
G02*
X27476000Y-72640000I0J-750000D01*
G01*
X27476000Y-74140000D01*
G75*
G02*
X26726000Y-74890000I-750000J0D01*
G01*
G37*
%TD.AperFunction*%
D21*
%TO.P,J7,1*%
%TO.N,VIN_DCDC*%
X25726000Y-67390000D03*
%TD*%
D22*
%TO.P,J8,2*%
%TO.N,VIN_DCDC*%
X9402000Y-51570000D03*
D23*
%TO.P,J8,1*%
%TO.N,GND*%
X9402000Y-46570000D03*
%TD*%
D19*
%TO.P,R2,1*%
%TO.N,+3V3*%
X22904000Y-54700000D03*
D20*
%TO.P,R2,2*%
%TO.N,SCL*%
X22904000Y-42000000D03*
%TD*%
D19*
%TO.P,R1,1*%
%TO.N,+3V3*%
X17724000Y-54700000D03*
D20*
%TO.P,R1,2*%
%TO.N,SDA*%
X17724000Y-42000000D03*
%TD*%
D19*
%TO.P,R3,1*%
%TO.N,+3V3*%
X28222000Y-54700000D03*
D20*
%TO.P,R3,2*%
%TO.N,A5*%
X28222000Y-42000000D03*
%TD*%
D24*
%TO.N,+3V3*%
X42572000Y-65750000D03*
X50422000Y-65800000D03*
X17562000Y-49370000D03*
X50362000Y-42385000D03*
X42462000Y-42335000D03*
X42537000Y-55435000D03*
X2262000Y-49285000D03*
X38950000Y-4180000D03*
X11050000Y-89270000D03*
X8540000Y-88000000D03*
X2262000Y-81642000D03*
%TO.N,GND*%
X49132000Y-73430000D03*
X49112000Y-51760000D03*
X9592000Y-74870000D03*
X4872000Y-79510000D03*
X38012000Y-72530000D03*
X37487000Y-50885000D03*
X37962000Y-36685000D03*
X43812000Y-36485000D03*
X36480000Y-7690000D03*
X36460000Y-4500000D03*
X38830000Y-88680000D03*
X46180000Y-83270000D03*
X36990000Y-86630000D03*
X1940000Y-10040000D03*
X5040000Y-45940000D03*
%TO.N,SDA*%
X6887000Y-66610000D03*
X4187000Y-65560000D03*
X4187000Y-60060000D03*
X23382000Y-36420000D03*
X19002000Y-36760000D03*
X33492000Y-37230000D03*
X7162000Y-43085000D03*
X4410000Y-9190000D03*
X48500000Y-10830000D03*
X12310000Y-88840000D03*
X40140000Y-89630000D03*
%TO.N,SCL*%
X22812000Y-52840000D03*
X11792000Y-53070000D03*
X25882000Y-41780000D03*
X25892000Y-36980000D03*
X36212000Y-36260000D03*
X9562000Y-41920000D03*
X10620000Y-6570000D03*
X5600000Y-9190000D03*
X13130000Y-41400000D03*
X14450000Y-87140000D03*
X40370000Y-91000000D03*
X15650000Y-88310000D03*
X31040000Y-90800000D03*
X8855000Y-33860000D03*
%TO.N,VIN_DCDC*%
X36762000Y-75910000D03*
X5262000Y-68960000D03*
X4322000Y-51810000D03*
X36692000Y-67860000D03*
%TO.N,VOUT_DCDC*%
X16102000Y-76270000D03*
X46182000Y-70490000D03*
X29092000Y-71140000D03*
X28562000Y-75870000D03*
%TO.N,D4*%
X7962000Y-57480000D03*
X5832000Y-56990000D03*
%TO.N,TX_D1*%
X8292000Y-56180000D03*
X10652000Y-56910000D03*
X11280000Y-84960000D03*
X18430000Y-85290000D03*
%TO.N,RX_D0*%
X15982000Y-85870000D03*
X15942000Y-81930000D03*
X9572000Y-81510000D03*
X8692000Y-66170000D03*
%TO.N,A5*%
X23652000Y-56890000D03*
X44012000Y-57070000D03*
X21182000Y-46140000D03*
X28272000Y-46090000D03*
X24412000Y-50640000D03*
X21212000Y-48930000D03*
%TO.N,A4*%
X24712000Y-47620000D03*
X33462000Y-48030000D03*
%TO.N,A3*%
X44110000Y-35170000D03*
X46782000Y-40330000D03*
%TO.N,A2*%
X29992000Y-76820000D03*
X23652000Y-77020000D03*
%TO.N,A1*%
X30672000Y-81000000D03*
X28312000Y-81650000D03*
%TO.N,VBAT*%
X21652000Y-73870000D03*
X21912000Y-78130000D03*
X35012000Y-78340000D03*
X47762000Y-59535000D03*
X44612000Y-83435000D03*
X44937000Y-67535000D03*
X47737000Y-67510000D03*
%TO.N,EN*%
X32372000Y-80260000D03*
X33512000Y-61570000D03*
%TO.N,VBUS*%
X29512000Y-79890000D03*
X29787000Y-44335000D03*
X3237000Y-44260000D03*
X3237000Y-67610000D03*
X12862000Y-78285000D03*
X10610000Y-67610000D03*
%TO.N,D13*%
X26772000Y-60990000D03*
X28542000Y-61760000D03*
%TO.N,D12*%
X24187000Y-69970000D03*
X28172000Y-69640000D03*
X25932000Y-64740000D03*
X23432000Y-64590000D03*
%TO.N,D5*%
X9270000Y-36870000D03*
X3180000Y-10330000D03*
%TO.N,VBAT_EXT*%
X10870000Y-71210000D03*
%TD*%
D25*
%TO.N,+3V3*%
X42572000Y-65750000D02*
X50372000Y-65750000D01*
X50372000Y-65750000D02*
X50422000Y-65800000D01*
X3432000Y-49270000D02*
X17462000Y-49270000D01*
X17462000Y-49270000D02*
X17562000Y-49370000D01*
X17724000Y-54700000D02*
X22904000Y-54700000D01*
X22904000Y-54700000D02*
X28222000Y-54700000D01*
X28222000Y-54700000D02*
X33332000Y-54700000D01*
X50362000Y-42385000D02*
X42512000Y-42385000D01*
X42512000Y-42385000D02*
X42462000Y-42335000D01*
X33332000Y-54700000D02*
X36952000Y-54700000D01*
X36952000Y-54700000D02*
X37687000Y-55435000D01*
X37687000Y-55435000D02*
X42537000Y-55435000D01*
X3432000Y-49270000D02*
X2277000Y-49270000D01*
X2277000Y-49270000D02*
X2262000Y-49285000D01*
X39490000Y-5740000D02*
X39480000Y-5730000D01*
X39490000Y-5840000D02*
X39490000Y-5740000D01*
X39480000Y-5730000D02*
X39480000Y-4710000D01*
X39480000Y-4710000D02*
X38950000Y-4180000D01*
X11342000Y-86800000D02*
X11342000Y-88978000D01*
X11342000Y-88978000D02*
X11050000Y-89270000D01*
X8540000Y-88000000D02*
X6290000Y-85750000D01*
X6290000Y-85750000D02*
X6180000Y-85750000D01*
X2262000Y-81832000D02*
X2262000Y-81642000D01*
X6180000Y-85750000D02*
X2262000Y-81832000D01*
X33812000Y-87550000D02*
X33812000Y-86828000D01*
X33812000Y-86828000D02*
X35170000Y-85470000D01*
X35170000Y-85470000D02*
X37920000Y-85470000D01*
X37920000Y-85470000D02*
X38660000Y-84730000D01*
X38660000Y-84730000D02*
X39740000Y-84730000D01*
X40062000Y-85052000D02*
X40062000Y-86800000D01*
X39740000Y-84730000D02*
X40062000Y-85052000D01*
X39740000Y-84730000D02*
X46870000Y-84730000D01*
X48000000Y-85860000D02*
X48000000Y-89000000D01*
X46870000Y-84730000D02*
X48000000Y-85860000D01*
%TO.N,GND*%
X25936000Y-73180000D02*
X25726000Y-73390000D01*
X34984000Y-73180000D02*
X25936000Y-73180000D01*
X34984000Y-73180000D02*
X37362000Y-73180000D01*
X37362000Y-73180000D02*
X38012000Y-72530000D01*
X42114000Y-72530000D02*
X42998000Y-73414000D01*
X38012000Y-72530000D02*
X42114000Y-72530000D01*
X42704000Y-80090000D02*
X42704000Y-81072000D01*
X42704000Y-81072000D02*
X43552000Y-81920000D01*
X42998000Y-73414000D02*
X49116000Y-73414000D01*
X49116000Y-73414000D02*
X49132000Y-73430000D01*
X43062000Y-51760000D02*
X42998000Y-51824000D01*
X49112000Y-51760000D02*
X43062000Y-51760000D01*
X25726000Y-73390000D02*
X24752000Y-73390000D01*
X24752000Y-73390000D02*
X23272000Y-74870000D01*
X23272000Y-74870000D02*
X9592000Y-74870000D01*
X9672000Y-79640000D02*
X5002000Y-79640000D01*
X5002000Y-79640000D02*
X4872000Y-79510000D01*
X42059000Y-50885000D02*
X42998000Y-51824000D01*
X37487000Y-50885000D02*
X42059000Y-50885000D01*
X37962000Y-36685000D02*
X43612000Y-36685000D01*
X43612000Y-36685000D02*
X43812000Y-36485000D01*
X8900000Y-5000000D02*
X9130000Y-5000000D01*
X9130000Y-5000000D02*
X9130000Y-6500000D01*
X10300000Y-7670000D02*
X25940000Y-7670000D01*
X29110000Y-7670000D02*
X29130000Y-7690000D01*
X25940000Y-7670000D02*
X29110000Y-7670000D01*
X29110000Y-7670000D02*
X36460000Y-7670000D01*
X36460000Y-7670000D02*
X36480000Y-7690000D01*
X40490000Y-5840000D02*
X40490000Y-3040000D01*
X40490000Y-3040000D02*
X40480000Y-3030000D01*
X40480000Y-3030000D02*
X37500000Y-3030000D01*
X36460000Y-4070000D02*
X36460000Y-4500000D01*
X37500000Y-3030000D02*
X36460000Y-4070000D01*
X9130000Y-6500000D02*
X10035000Y-7405000D01*
X10035000Y-7405000D02*
X10300000Y-7670000D01*
X10342000Y-86800000D02*
X10342000Y-87978000D01*
X9320000Y-89000000D02*
X4000000Y-89000000D01*
X10342000Y-87978000D02*
X9320000Y-89000000D01*
X39062000Y-86800000D02*
X39062000Y-88448000D01*
X39062000Y-88448000D02*
X38830000Y-88680000D01*
X46080000Y-83170000D02*
X46180000Y-83270000D01*
X46080000Y-81920000D02*
X46080000Y-83170000D01*
X46080000Y-81920000D02*
X48372000Y-81920000D01*
X43552000Y-81920000D02*
X46080000Y-81920000D01*
X38892000Y-86630000D02*
X39062000Y-86800000D01*
X36990000Y-86630000D02*
X38892000Y-86630000D01*
X42194000Y-79580000D02*
X42704000Y-80090000D01*
X42194000Y-79070000D02*
X42194000Y-79580000D01*
X42998000Y-78266000D02*
X42194000Y-79070000D01*
X42998000Y-73414000D02*
X42998000Y-78266000D01*
X48372000Y-79242000D02*
X48544000Y-79070000D01*
X48372000Y-81920000D02*
X48372000Y-79242000D01*
X9530000Y-7910000D02*
X2410000Y-7910000D01*
X10035000Y-7405000D02*
X9530000Y-7910000D01*
X2410000Y-7910000D02*
X2410000Y-7950000D01*
X1940000Y-8420000D02*
X1940000Y-10040000D01*
X2410000Y-7950000D02*
X1940000Y-8420000D01*
X9402000Y-46570000D02*
X5670000Y-46570000D01*
X5670000Y-46570000D02*
X5040000Y-45940000D01*
X9402000Y-46570000D02*
X18650000Y-46570000D01*
X18650000Y-46570000D02*
X20060000Y-47980000D01*
X20060000Y-47980000D02*
X20060000Y-50530000D01*
X20060000Y-50530000D02*
X20880000Y-51350000D01*
X20880000Y-51350000D02*
X23250000Y-51350000D01*
X23250000Y-51350000D02*
X23870000Y-51970000D01*
X36402000Y-51970000D02*
X37487000Y-50885000D01*
X23870000Y-51970000D02*
X36402000Y-51970000D01*
D26*
%TO.N,SDA*%
X6887000Y-66610000D02*
X6362000Y-66085000D01*
X6362000Y-66085000D02*
X4712000Y-66085000D01*
X4712000Y-66085000D02*
X4187000Y-65560000D01*
X4187000Y-60060000D02*
X4187000Y-59485000D01*
X4602000Y-59070000D02*
X6932000Y-59070000D01*
X4187000Y-59485000D02*
X4602000Y-59070000D01*
X17724000Y-42273000D02*
X17724000Y-42000000D01*
X16912000Y-43085000D02*
X17724000Y-42273000D01*
X23382000Y-36420000D02*
X19342000Y-36420000D01*
X19342000Y-36420000D02*
X19002000Y-36760000D01*
X15906999Y-40182999D02*
X15906999Y-37736999D01*
X17724000Y-42000000D02*
X15906999Y-40182999D01*
X7162000Y-43085000D02*
X16912000Y-43085000D01*
X2880000Y-30180000D02*
X2510000Y-29810000D01*
X3790000Y-30180000D02*
X2880000Y-30180000D01*
X4410000Y-9450000D02*
X4410000Y-9190000D01*
X3800000Y-30170000D02*
X3790000Y-30180000D01*
X44370000Y-37420000D02*
X47790000Y-34000000D01*
X33492000Y-37230000D02*
X33682000Y-37420000D01*
X47790000Y-34000000D02*
X48000000Y-34000000D01*
X33682000Y-37420000D02*
X44370000Y-37420000D01*
X38490000Y-5840000D02*
X38490000Y-6920000D01*
X38490000Y-6920000D02*
X39220000Y-7650000D01*
X39220000Y-7650000D02*
X45720000Y-7650000D01*
X45720000Y-7650000D02*
X45720000Y-8050000D01*
X45720000Y-8050000D02*
X48500000Y-10830000D01*
X3800000Y-30170000D02*
X5240000Y-30170000D01*
X5240000Y-30170000D02*
X5250000Y-30180000D01*
X5250000Y-30180000D02*
X5690000Y-30180000D01*
X7080000Y-31723590D02*
X8130000Y-32773590D01*
X5690000Y-30180000D02*
X7080000Y-31570000D01*
X7080000Y-31570000D02*
X7080000Y-31723590D01*
X8130000Y-32773590D02*
X8130000Y-34340000D01*
X8130000Y-34340000D02*
X9920000Y-36130000D01*
X9920000Y-36130000D02*
X11050000Y-36130000D01*
X11050000Y-36130000D02*
X12180000Y-37260000D01*
X15330000Y-37260000D02*
X15380000Y-37210000D01*
X12180000Y-37260000D02*
X15330000Y-37260000D01*
X15380000Y-37210000D02*
X15906999Y-37736999D01*
X12310000Y-86832000D02*
X12342000Y-86800000D01*
X12310000Y-88840000D02*
X12310000Y-86832000D01*
X41062000Y-86800000D02*
X41062000Y-88708000D01*
X41062000Y-88708000D02*
X40140000Y-89630000D01*
X2510000Y-29810000D02*
X2510000Y-29710000D01*
X3220000Y-29000000D02*
X3220000Y-11480000D01*
X4410000Y-10290000D02*
X4410000Y-9190000D01*
X3220000Y-11480000D02*
X4410000Y-10290000D01*
X2510000Y-29710000D02*
X3220000Y-29000000D01*
%TO.N,SCL*%
X22812000Y-52840000D02*
X12022000Y-52840000D01*
X12022000Y-52840000D02*
X11792000Y-53070000D01*
X22904000Y-42000000D02*
X25662000Y-42000000D01*
X25662000Y-42000000D02*
X25882000Y-41780000D01*
X25892000Y-36980000D02*
X26462000Y-36410000D01*
X26462000Y-36410000D02*
X36062000Y-36410000D01*
X36062000Y-36410000D02*
X36212000Y-36260000D01*
X3092000Y-34090000D02*
X3012000Y-34010000D01*
X14210000Y-5000000D02*
X13140000Y-6070000D01*
X13140000Y-6070000D02*
X13140000Y-6130000D01*
X13140000Y-6130000D02*
X12700000Y-6570000D01*
X12700000Y-6570000D02*
X10620000Y-6570000D01*
X5600000Y-9190000D02*
X5600000Y-10130000D01*
X5600000Y-10130000D02*
X3840000Y-11890000D01*
X3840000Y-11890000D02*
X3840000Y-26450000D01*
X3840000Y-26450000D02*
X4660000Y-27270000D01*
X4660000Y-27270000D02*
X6050000Y-27270000D01*
X13130000Y-41400000D02*
X12460000Y-42070000D01*
X9712000Y-42070000D02*
X9562000Y-41920000D01*
X12460000Y-42070000D02*
X9712000Y-42070000D01*
X4160000Y-34160000D02*
X4000000Y-34000000D01*
X4160000Y-40060000D02*
X4160000Y-34160000D01*
X5370000Y-41270000D02*
X4160000Y-40060000D01*
X9562000Y-41920000D02*
X8912000Y-41270000D01*
X8912000Y-41270000D02*
X5370000Y-41270000D01*
X13682000Y-87140000D02*
X13342000Y-86800000D01*
X14450000Y-87140000D02*
X13682000Y-87140000D01*
X42062000Y-86800000D02*
X42062000Y-89308000D01*
X42062000Y-89308000D02*
X40370000Y-91000000D01*
X15650000Y-88310000D02*
X17750000Y-90410000D01*
X17750000Y-90410000D02*
X30650000Y-90410000D01*
X30650000Y-90410000D02*
X31040000Y-90800000D01*
X6840000Y-28060000D02*
X6840000Y-30430000D01*
X6050000Y-27270000D02*
X6840000Y-28060000D01*
X8020000Y-32027180D02*
X8670000Y-32677180D01*
X6840000Y-30430000D02*
X8020000Y-31610000D01*
X8020000Y-31610000D02*
X8020000Y-32027180D01*
X8670000Y-32677180D02*
X8670000Y-33675000D01*
X8670000Y-33675000D02*
X8855000Y-33860000D01*
X37320000Y-6010000D02*
X37490000Y-5840000D01*
X37870000Y-11040000D02*
X37320000Y-10490000D01*
X43384999Y-35135001D02*
X43384999Y-31635001D01*
X44700000Y-11010000D02*
X44670000Y-11040000D01*
X45530000Y-27270000D02*
X47690000Y-27270000D01*
X47950000Y-14480000D02*
X47960000Y-14470000D01*
X43232998Y-35287002D02*
X43384999Y-35135001D01*
X44670000Y-11040000D02*
X37870000Y-11040000D01*
X47960000Y-12160000D02*
X46810000Y-11010000D01*
X43384999Y-31635001D02*
X44970000Y-30050000D01*
X42727002Y-35790000D02*
X43230000Y-35287002D01*
X36872000Y-34280000D02*
X38382000Y-35790000D01*
X38382000Y-35790000D02*
X42727002Y-35790000D01*
X44970000Y-30050000D02*
X44970000Y-27830000D01*
X43230000Y-35287002D02*
X43232998Y-35287002D01*
X47690000Y-27270000D02*
X47950000Y-27010000D01*
X44970000Y-27830000D02*
X45530000Y-27270000D01*
X46810000Y-11010000D02*
X44700000Y-11010000D01*
X37320000Y-10490000D02*
X37320000Y-6010000D01*
X47960000Y-14470000D02*
X47960000Y-12160000D01*
X47950000Y-27010000D02*
X47950000Y-14480000D01*
D25*
%TO.N,VIN_DCDC*%
X25726000Y-67390000D02*
X32492000Y-67390000D01*
X32492000Y-67390000D02*
X32512000Y-67370000D01*
X34604000Y-76100000D02*
X34984000Y-75720000D01*
X35174000Y-75910000D02*
X34984000Y-75720000D01*
X36762000Y-75910000D02*
X35174000Y-75910000D01*
X25726000Y-67390000D02*
X18507000Y-67390000D01*
X18507000Y-67390000D02*
X18312000Y-67585000D01*
X17462000Y-69710000D02*
X7462000Y-69710000D01*
X9387000Y-51585000D02*
X9402000Y-51570000D01*
X5312000Y-51585000D02*
X9387000Y-51585000D01*
X6712000Y-68960000D02*
X7462000Y-69710000D01*
X5262000Y-68960000D02*
X6712000Y-68960000D01*
X5312000Y-51585000D02*
X4547000Y-51585000D01*
X4547000Y-51585000D02*
X4322000Y-51810000D01*
X32492000Y-67390000D02*
X36222000Y-67390000D01*
X36222000Y-67390000D02*
X36692000Y-67860000D01*
X18507000Y-68665000D02*
X17462000Y-69710000D01*
X18507000Y-67390000D02*
X18507000Y-68665000D01*
X36762000Y-76138000D02*
X39694000Y-79070000D01*
X36762000Y-75910000D02*
X36762000Y-76138000D01*
%TO.N,VOUT_DCDC*%
X34984000Y-70640000D02*
X31252000Y-70640000D01*
X46182000Y-70490000D02*
X45622000Y-71050000D01*
X35394000Y-71050000D02*
X34984000Y-70640000D01*
X45622000Y-71050000D02*
X35394000Y-71050000D01*
X31252000Y-70640000D02*
X29592000Y-70640000D01*
X29592000Y-70640000D02*
X29092000Y-71140000D01*
X16501999Y-75870001D02*
X16102000Y-76270000D01*
X28562000Y-75870000D02*
X16501999Y-75870001D01*
D26*
%TO.N,D4*%
X7962000Y-57480000D02*
X6322000Y-57480000D01*
X6322000Y-57480000D02*
X5832000Y-56990000D01*
%TO.N,TX_D1*%
X8292000Y-56180000D02*
X8692000Y-56580000D01*
X8692000Y-56580000D02*
X10322000Y-56580000D01*
X10322000Y-56580000D02*
X10652000Y-56910000D01*
X11280000Y-84960000D02*
X18100000Y-84960000D01*
X18100000Y-84960000D02*
X18430000Y-85290000D01*
%TO.N,RX_D0*%
X21112000Y-87550000D02*
X19772000Y-86210000D01*
X19772000Y-86210000D02*
X16322000Y-86210000D01*
X16322000Y-86210000D02*
X15982000Y-85870000D01*
X15942000Y-81930000D02*
X15522000Y-81510000D01*
X15522000Y-81510000D02*
X9572000Y-81510000D01*
X8982000Y-66170000D02*
X8692000Y-66170000D01*
X12022000Y-63130000D02*
X8982000Y-66170000D01*
%TO.N,A5*%
X23652000Y-56890000D02*
X43832000Y-56890000D01*
X43832000Y-56890000D02*
X44012000Y-57070000D01*
X28162000Y-42060000D02*
X28222000Y-42000000D01*
X28222000Y-46140000D02*
X28272000Y-46090000D01*
X21182000Y-46140000D02*
X21682000Y-46640000D01*
X27722000Y-46640000D02*
X28272000Y-46090000D01*
X21682000Y-46640000D02*
X27722000Y-46640000D01*
X24412000Y-50640000D02*
X23382000Y-49610000D01*
X23382000Y-49610000D02*
X21892000Y-49610000D01*
X21892000Y-49610000D02*
X21212000Y-48930000D01*
%TO.N,A4*%
X24712000Y-47620000D02*
X24712000Y-48400000D01*
X24712000Y-48400000D02*
X24892000Y-48580000D01*
X24892000Y-48580000D02*
X32912000Y-48580000D01*
X32912000Y-48580000D02*
X33462000Y-48030000D01*
X42998000Y-47324000D02*
X41992000Y-48330000D01*
X33762000Y-48330000D02*
X33462000Y-48030000D01*
X41992000Y-48330000D02*
X33762000Y-48330000D01*
%TO.N,A3*%
X27242000Y-38786000D02*
X29046000Y-40590000D01*
X29046000Y-40590000D02*
X46522000Y-40590000D01*
X46522000Y-40590000D02*
X46782000Y-40330000D01*
X49592000Y-28548000D02*
X49532000Y-28548000D01*
X49592000Y-28548000D02*
X49592000Y-14850000D01*
X49532000Y-28548000D02*
X47610000Y-30470000D01*
X47610000Y-30470000D02*
X46400000Y-30470000D01*
X46400000Y-30470000D02*
X44210000Y-32660000D01*
X44210000Y-32660000D02*
X44210000Y-35070000D01*
X44210000Y-35070000D02*
X44110000Y-35170000D01*
X49592000Y-14850000D02*
X49592000Y-9922000D01*
X48060000Y-8390000D02*
X48060000Y-4020000D01*
X49592000Y-9922000D02*
X48060000Y-8390000D01*
%TO.N,A2*%
X29992000Y-76820000D02*
X23852000Y-76820000D01*
X23852000Y-76820000D02*
X23652000Y-77020000D01*
%TO.N,A1*%
X30672000Y-81000000D02*
X28962000Y-81000000D01*
X28962000Y-81000000D02*
X28312000Y-81650000D01*
D25*
%TO.N,VBAT*%
X21362000Y-73580000D02*
X21652000Y-73870000D01*
X21912000Y-78130000D02*
X34802000Y-78130000D01*
X34802000Y-78130000D02*
X35012000Y-78340000D01*
X34872000Y-59070000D02*
X47297000Y-59070000D01*
X47297000Y-59070000D02*
X47762000Y-59535000D01*
X34922000Y-83420000D02*
X44597000Y-83420000D01*
X44597000Y-83420000D02*
X44612000Y-83435000D01*
X44937000Y-67535000D02*
X47712000Y-67535000D01*
X47712000Y-67535000D02*
X47737000Y-67510000D01*
X4340000Y-73580000D02*
X4110000Y-73350000D01*
X5630000Y-73580000D02*
X4340000Y-73580000D01*
X5630000Y-73580000D02*
X21362000Y-73580000D01*
X4962000Y-73580000D02*
X5630000Y-73580000D01*
D26*
%TO.N,EN*%
X32382000Y-83420000D02*
X32382000Y-80270000D01*
X32382000Y-80270000D02*
X32372000Y-80260000D01*
X32332000Y-60390000D02*
X32332000Y-59070000D01*
X33512000Y-61570000D02*
X32332000Y-60390000D01*
D25*
%TO.N,VBUS*%
X16042000Y-79640000D02*
X29262000Y-79640000D01*
X29262000Y-79640000D02*
X29512000Y-79890000D01*
X29787000Y-44335000D02*
X14862000Y-44335000D01*
X14862000Y-44335000D02*
X14812000Y-44285000D01*
X14812000Y-44285000D02*
X3262000Y-44285000D01*
X3262000Y-44285000D02*
X3237000Y-44260000D01*
X14687000Y-78285000D02*
X16042000Y-79640000D01*
X12862000Y-78285000D02*
X14687000Y-78285000D01*
X10610000Y-67610000D02*
X7690000Y-67610000D01*
X7690000Y-67610000D02*
X7550000Y-67750000D01*
X3377000Y-67750000D02*
X3237000Y-67610000D01*
X7550000Y-67750000D02*
X3377000Y-67750000D01*
D26*
%TO.N,D13*%
X26772000Y-60990000D02*
X27252000Y-61470000D01*
X27252000Y-61470000D02*
X28252000Y-61470000D01*
X28252000Y-61470000D02*
X28542000Y-61760000D01*
%TO.N,D12*%
X27842000Y-69970000D02*
X28172000Y-69640000D01*
X25932000Y-64740000D02*
X23582000Y-64740000D01*
X23582000Y-64740000D02*
X23432000Y-64590000D01*
X27842000Y-69970000D02*
X24187000Y-69970000D01*
%TO.N,D5*%
X2152000Y-3870000D02*
X3012000Y-3010000D01*
X2410000Y-30720000D02*
X5440000Y-30720000D01*
X5440000Y-30720000D02*
X7480000Y-32760000D01*
X7480000Y-32760000D02*
X7480000Y-34490000D01*
X7480000Y-35080000D02*
X7480000Y-34490000D01*
X9270000Y-36870000D02*
X7480000Y-35080000D01*
X1870000Y-11640000D02*
X1870000Y-12120000D01*
X3180000Y-10330000D02*
X1870000Y-11640000D01*
X1870000Y-12120000D02*
X1870000Y-30180000D01*
X1870000Y-30180000D02*
X2410000Y-30720000D01*
D25*
%TO.N,VBAT_EXT*%
X4992000Y-71010000D02*
X4962000Y-71040000D01*
X5132000Y-71210000D02*
X4962000Y-71040000D01*
X10870000Y-71210000D02*
X5132000Y-71210000D01*
X4510000Y-71210000D02*
X4110000Y-70810000D01*
X5132000Y-71210000D02*
X4510000Y-71210000D01*
%TD*%
M02*
