"Id";"Designator";"Package";"Quantity";"Designation";"Supplier and ref";
1;"J14";"PinSocket_1x08_P2.54mm_Vertical";1;"Conn_01x08_Female";;;
2;"J3,J10";"PinSocket_1x16_P2.54mm_Vertical";2;"Conn_01x16_Female";;;
3;"Q3";"TO-92L_Wide";1;"Q_NPN_EBC";;;
4;"SP1";"BUZZER_SMT_5MM";1;"SPEAKER_BUZZER5MM";;;
5;"R8,R5";"R_Axial_DIN0309_L9.0mm_D3.2mm_P12.70mm_Horizontal";2;"R";;;
6;"D2";"D_5W_P12.70mm_Horizontal";1;"DIODE";;;
7;"Q2,Q1";"TO-220-3_Vertical";2;"Q_NMOS_GDS";;;
8;"JP1,JP3,JP2";"SolderJumper-2_P1.3mm_Open_Pad1.0x1.5mm";3;"Jumper_NO_Small";;;
9;"J20,J12";"JST_SH_SM04B-SRSS-TB_1x04-1MP_P1.00mm_Horizontal";2;"Conn_01x04_Female";;;
10;"J18";"PinSocket_1x06_P2.54mm_Vertical";1;"Conn_01x06_Female";;;
11;"R7,R6";"R_Axial_DIN0309_L9.0mm_D3.2mm_P12.70mm_Horizontal";2;"10K";;;
12;"J15";"PinSocket_1x09_P2.54mm_Vertical";1;"Conn_01x09_Female";;;
13;"J11";"PinSocket_1x10_P2.54mm_Vertical";1;"Conn_01x10_Female";;;
14;"J6";"PinSocket_1x13_P2.54mm_Vertical";1;"Conn_01x13_Female";;;
15;"J2,J9";"PinSocket_1x12_P2.54mm_Vertical";2;"Conn_01x12_Female";;;
16;"SW4";"SW_TH_Tactile_Omron_B3F-10xx";1;"SW_Push_Dual";;;
17;"H6,H5,H2,H1";"MountingHole_2.7mm_M2.5_Pad";4;"MountingHole_Pad";;;
18;"J19,J5,J4";"PinSocket_1x03_P2.54mm_Vertical";3;"Conn_01x03_Female";;;
19;"J16";"PinSocket_1x04_P2.54mm_Vertical";1;"Conn_01x04_Female";;;
20;"J17";"PinSocket_1x07_P2.54mm_Vertical";1;"Conn_01x07_Female";;;
21;"SW2,SW1";"SW_Tactile_SPST_Angled_PTS645Vx58-2LFS";2;"SW_Push";;;
22;"J1";"JST_PH_S2B-PH-K_1x02_P2.00mm_Horizontal";1;"Conn_01x02_Female";;;
23;"D1";"D_5W_P12.70mm_Horizontal";1;"D";;;
24;"C2";"CP_Radial_D5.0mm_P2.50mm";1;"22uF";;;
25;"C1";"CP_Radial_D5.0mm_P2.50mm";1;"10uF";;;
26;"R4,R2,R1,R3";"R_Axial_DIN0309_L9.0mm_D3.2mm_P12.70mm_Horizontal";4;"4.7K";;;
27;"J7";"BarrelJack_Horizontal";1;"Barrel_Jack_MountingPin";;;
28;"J8";"TerminalBlock_Phoenix_PT-1,5-2-5.0-H_1x02_P5.00mm_Horizontal";1;"Screw_Terminal_01x02";;;
