%TF.GenerationSoftware,KiCad,Pcbnew,5.1.6-c6e7f7d~87~ubuntu18.04.1*%
%TF.CreationDate,2021-09-22T20:52:25-04:00*%
%TF.ProjectId,remote,72656d6f-7465-42e6-9b69-6361645f7063,rev?*%
%TF.SameCoordinates,Original*%
%TF.FileFunction,Copper,L2,Bot*%
%TF.FilePolarity,Positive*%
%FSLAX46Y46*%
G04 Gerber Fmt 4.6, Leading zero omitted, Abs format (unit mm)*
G04 Created by KiCad (PCBNEW 5.1.6-c6e7f7d~87~ubuntu18.04.1) date 2021-09-22 20:52:25*
%MOMM*%
%LPD*%
G01*
G04 APERTURE LIST*
%TA.AperFunction,ComponentPad*%
%ADD10R,1.700000X1.700000*%
%TD*%
%TA.AperFunction,ComponentPad*%
%ADD11O,1.700000X1.700000*%
%TD*%
%TA.AperFunction,ComponentPad*%
%ADD12C,5.400000*%
%TD*%
%TA.AperFunction,ComponentPad*%
%ADD13C,2.100000*%
%TD*%
%TA.AperFunction,ComponentPad*%
%ADD14C,1.750000*%
%TD*%
%TA.AperFunction,ComponentPad*%
%ADD15O,1.200000X1.750000*%
%TD*%
%TA.AperFunction,ComponentPad*%
%ADD16O,2.800000X2.800000*%
%TD*%
%TA.AperFunction,ComponentPad*%
%ADD17R,2.800000X2.800000*%
%TD*%
%TA.AperFunction,ComponentPad*%
%ADD18R,1.600000X1.600000*%
%TD*%
%TA.AperFunction,ComponentPad*%
%ADD19C,1.600000*%
%TD*%
%TA.AperFunction,ComponentPad*%
%ADD20O,1.600000X1.600000*%
%TD*%
%TA.AperFunction,ComponentPad*%
%ADD21R,3.500000X3.500000*%
%TD*%
%TA.AperFunction,ComponentPad*%
%ADD22C,2.600000*%
%TD*%
%TA.AperFunction,ComponentPad*%
%ADD23R,2.600000X2.600000*%
%TD*%
%TA.AperFunction,ViaPad*%
%ADD24C,0.800000*%
%TD*%
%TA.AperFunction,Conductor*%
%ADD25C,0.700000*%
%TD*%
%TA.AperFunction,Conductor*%
%ADD26C,0.250000*%
%TD*%
G04 APERTURE END LIST*
D10*
%TO.P,J9,1*%
%TO.N,VBAT*%
X34872000Y-59070000D03*
D11*
%TO.P,J9,2*%
%TO.N,EN*%
X32332000Y-59070000D03*
%TO.P,J9,3*%
%TO.N,VBUS*%
X29792000Y-59070000D03*
%TO.P,J9,4*%
%TO.N,D13*%
X27252000Y-59070000D03*
%TO.P,J9,5*%
%TO.N,D12*%
X24712000Y-59070000D03*
%TO.P,J9,6*%
%TO.N,D11*%
X22172000Y-59070000D03*
%TO.P,J9,7*%
%TO.N,D10*%
X19632000Y-59070000D03*
%TO.P,J9,8*%
%TO.N,D9*%
X17092000Y-59070000D03*
%TO.P,J9,9*%
%TO.N,D6*%
X14552000Y-59070000D03*
%TO.P,J9,10*%
%TO.N,D5*%
X12012000Y-59070000D03*
%TO.P,J9,11*%
%TO.N,SCL*%
X9472000Y-59070000D03*
%TO.P,J9,12*%
%TO.N,SDA*%
X6932000Y-59070000D03*
%TD*%
%TO.P,J16,4*%
%TO.N,SDA*%
X16750000Y-5000000D03*
%TO.P,J16,3*%
%TO.N,SCL*%
X14210000Y-5000000D03*
%TO.P,J16,2*%
%TO.N,+3V3*%
X11670000Y-5000000D03*
D10*
%TO.P,J16,1*%
%TO.N,GND*%
X9130000Y-5000000D03*
%TD*%
D11*
%TO.P,J15,7*%
%TO.N,TX_D1*%
X18572000Y-87550000D03*
%TO.P,J15,6*%
%TO.N,RX_D0*%
X21112000Y-87550000D03*
%TO.P,J15,5*%
%TO.N,A2*%
X23652000Y-87550000D03*
%TO.P,J15,4*%
%TO.N,A1*%
X26192000Y-87550000D03*
%TO.P,J15,3*%
%TO.N,A0*%
X28732000Y-87550000D03*
%TO.P,J15,2*%
%TO.N,GND*%
X31272000Y-87550000D03*
D10*
%TO.P,J15,1*%
%TO.N,+3V3*%
X33812000Y-87550000D03*
%TD*%
D11*
%TO.P,J14,7*%
%TO.N,N/C*%
X46382000Y-28570000D03*
%TO.P,J14,6*%
X46382000Y-26030000D03*
%TO.P,J14,5*%
X46382000Y-23490000D03*
%TO.P,J14,4*%
X46382000Y-20950000D03*
%TO.P,J14,3*%
X46382000Y-18410000D03*
%TO.P,J14,2*%
X46382000Y-15870000D03*
D10*
%TO.P,J14,1*%
X46382000Y-13330000D03*
%TD*%
%TO.P,J11,1*%
%TO.N,N/C*%
X5502000Y-13330000D03*
D11*
%TO.P,J11,2*%
X5502000Y-15870000D03*
%TO.P,J11,3*%
X5502000Y-18410000D03*
%TO.P,J11,4*%
X5502000Y-20950000D03*
%TO.P,J11,5*%
X5502000Y-23490000D03*
%TO.P,J11,6*%
X5502000Y-26030000D03*
%TO.P,J11,7*%
X5502000Y-28570000D03*
%TD*%
%TO.P,J6,15*%
%TO.N,N/C*%
X43662000Y-9370000D03*
%TO.P,J6,14*%
X41122000Y-9370000D03*
%TO.P,J6,13*%
X38582000Y-9370000D03*
%TO.P,J6,12*%
X36042000Y-9370000D03*
%TO.P,J6,11*%
X33502000Y-9370000D03*
%TO.P,J6,10*%
X30962000Y-9370000D03*
%TO.P,J6,9*%
X28422000Y-9370000D03*
%TO.P,J6,8*%
X25882000Y-9370000D03*
%TO.P,J6,7*%
X23342000Y-9370000D03*
%TO.P,J6,6*%
X20802000Y-9370000D03*
%TO.P,J6,5*%
X18262000Y-9370000D03*
%TO.P,J6,4*%
X15722000Y-9370000D03*
%TO.P,J6,3*%
X13182000Y-9370000D03*
%TO.P,J6,2*%
X10642000Y-9370000D03*
D10*
%TO.P,J6,1*%
X8102000Y-9370000D03*
%TD*%
D11*
%TO.P,J17,7*%
%TO.N,N/C*%
X26712000Y-34280000D03*
%TO.P,J17,6*%
X29252000Y-34280000D03*
%TO.P,J17,5*%
X31792000Y-34280000D03*
%TO.P,J17,4*%
%TO.N,SDA*%
X34332000Y-34280000D03*
%TO.P,J17,3*%
%TO.N,SCL*%
X36872000Y-34280000D03*
%TO.P,J17,2*%
%TO.N,GND*%
X39412000Y-34280000D03*
D10*
%TO.P,J17,1*%
%TO.N,+3V3*%
X41952000Y-34280000D03*
%TD*%
D12*
%TO.P,H5,1*%
%TO.N,A3*%
X48060000Y-4020000D03*
%TD*%
%TO.P,H6,1*%
%TO.N,D5*%
X4000000Y-4000000D03*
%TD*%
%TO.P,H4,1*%
%TO.N,SDA*%
X48000000Y-34000000D03*
%TD*%
%TO.P,H3,1*%
%TO.N,SCL*%
X4000000Y-34000000D03*
%TD*%
%TO.P,H2,1*%
%TO.N,+3V3*%
X48000000Y-89000000D03*
%TD*%
%TO.P,H1,1*%
%TO.N,GND*%
X4000000Y-89000000D03*
%TD*%
D11*
%TO.P,J5,3*%
%TO.N,VBAT_EXT*%
X4110000Y-70810000D03*
%TO.P,J5,2*%
%TO.N,VBAT*%
X4110000Y-73350000D03*
D10*
%TO.P,J5,1*%
%TO.N,GND*%
X4110000Y-75890000D03*
%TD*%
D13*
%TO.P,SW2,*%
%TO.N,*%
X40508000Y-67664000D03*
D14*
%TO.P,SW2,1*%
%TO.N,A5*%
X42998000Y-68914000D03*
%TO.P,SW2,2*%
%TO.N,GND*%
X42998000Y-73414000D03*
D13*
%TO.P,SW2,*%
%TO.N,*%
X40508000Y-74674000D03*
%TD*%
%TO.P,SW1,*%
%TO.N,*%
X40508000Y-46074000D03*
D14*
%TO.P,SW1,1*%
%TO.N,A4*%
X42998000Y-47324000D03*
%TO.P,SW1,2*%
%TO.N,GND*%
X42998000Y-51824000D03*
D13*
%TO.P,SW1,*%
%TO.N,*%
X40508000Y-53084000D03*
%TD*%
D15*
%TO.P,J1,2*%
%TO.N,VBAT_EXT*%
X11672000Y-79640000D03*
%TO.P,J1,1*%
%TO.N,GND*%
%TA.AperFunction,ComponentPad*%
G36*
G01*
X9072000Y-80265001D02*
X9072000Y-79014999D01*
G75*
G02*
X9321999Y-78765000I249999J0D01*
G01*
X10022001Y-78765000D01*
G75*
G02*
X10272000Y-79014999I0J-249999D01*
G01*
X10272000Y-80265001D01*
G75*
G02*
X10022001Y-80515000I-249999J0D01*
G01*
X9321999Y-80515000D01*
G75*
G02*
X9072000Y-80265001I0J249999D01*
G01*
G37*
%TD.AperFunction*%
%TD*%
D10*
%TO.P,J10,1*%
%TO.N,D4*%
X6922000Y-38786000D03*
D11*
%TO.P,J10,2*%
%TO.N,TX_D1*%
X9462000Y-38786000D03*
%TO.P,J10,3*%
%TO.N,RX_D0*%
X12002000Y-38786000D03*
%TO.P,J10,4*%
%TO.N,MISO*%
X14542000Y-38786000D03*
%TO.P,J10,5*%
%TO.N,MOSI*%
X17082000Y-38786000D03*
%TO.P,J10,6*%
%TO.N,SCK*%
X19622000Y-38786000D03*
%TO.P,J10,7*%
%TO.N,A5*%
X22162000Y-38786000D03*
%TO.P,J10,8*%
%TO.N,A4*%
X24702000Y-38786000D03*
%TO.P,J10,9*%
%TO.N,A3*%
X27242000Y-38786000D03*
%TO.P,J10,10*%
%TO.N,A2*%
X29782000Y-38786000D03*
%TO.P,J10,11*%
%TO.N,A1*%
X32322000Y-38786000D03*
%TO.P,J10,12*%
%TO.N,A0*%
X34862000Y-38786000D03*
%TO.P,J10,13*%
%TO.N,GND*%
X37402000Y-38786000D03*
%TO.P,J10,14*%
%TO.N,AREF*%
X39942000Y-38786000D03*
%TO.P,J10,15*%
%TO.N,+3V3*%
X42482000Y-38786000D03*
%TO.P,J10,16*%
%TO.N,~RESET*%
X45022000Y-38786000D03*
%TD*%
%TO.P,J2,12*%
%TO.N,SDA*%
X6982000Y-83420000D03*
%TO.P,J2,11*%
%TO.N,SCL*%
X9522000Y-83420000D03*
%TO.P,J2,10*%
%TO.N,D5*%
X12062000Y-83420000D03*
%TO.P,J2,9*%
%TO.N,D6*%
X14602000Y-83420000D03*
%TO.P,J2,8*%
%TO.N,D9*%
X17142000Y-83420000D03*
%TO.P,J2,7*%
%TO.N,D10*%
X19682000Y-83420000D03*
%TO.P,J2,6*%
%TO.N,D11*%
X22222000Y-83420000D03*
%TO.P,J2,5*%
%TO.N,D12*%
X24762000Y-83420000D03*
%TO.P,J2,4*%
%TO.N,D13*%
X27302000Y-83420000D03*
%TO.P,J2,3*%
%TO.N,VBUS*%
X29842000Y-83420000D03*
%TO.P,J2,2*%
%TO.N,EN*%
X32382000Y-83420000D03*
D10*
%TO.P,J2,1*%
%TO.N,VBAT*%
X34922000Y-83420000D03*
%TD*%
D11*
%TO.P,J3,16*%
%TO.N,~RESET*%
X45042000Y-63130000D03*
%TO.P,J3,15*%
%TO.N,+3V3*%
X42502000Y-63130000D03*
%TO.P,J3,14*%
%TO.N,AREF*%
X39962000Y-63130000D03*
%TO.P,J3,13*%
%TO.N,GND*%
X37422000Y-63130000D03*
%TO.P,J3,12*%
%TO.N,A0*%
X34882000Y-63130000D03*
%TO.P,J3,11*%
%TO.N,A1*%
X32342000Y-63130000D03*
%TO.P,J3,10*%
%TO.N,A2*%
X29802000Y-63130000D03*
%TO.P,J3,9*%
%TO.N,A3*%
X27262000Y-63130000D03*
%TO.P,J3,8*%
%TO.N,A4*%
X24722000Y-63130000D03*
%TO.P,J3,7*%
%TO.N,A5*%
X22182000Y-63130000D03*
%TO.P,J3,6*%
%TO.N,SCK*%
X19642000Y-63130000D03*
%TO.P,J3,5*%
%TO.N,MOSI*%
X17102000Y-63130000D03*
%TO.P,J3,4*%
%TO.N,MISO*%
X14562000Y-63130000D03*
%TO.P,J3,3*%
%TO.N,RX_D0*%
X12022000Y-63130000D03*
%TO.P,J3,2*%
%TO.N,TX_D1*%
X9482000Y-63130000D03*
D10*
%TO.P,J3,1*%
%TO.N,D4*%
X6942000Y-63130000D03*
%TD*%
D16*
%TO.P,D1,2*%
%TO.N,VOUT_DCDC*%
X16042000Y-66940000D03*
D17*
%TO.P,D1,1*%
%TO.N,VBUS*%
X16042000Y-79640000D03*
%TD*%
D18*
%TO.P,C2,1*%
%TO.N,VOUT_DCDC*%
X45810000Y-79530000D03*
D19*
%TO.P,C2,2*%
%TO.N,GND*%
X48310000Y-79530000D03*
%TD*%
D18*
%TO.P,C1,1*%
%TO.N,VIN_DCDC*%
X39540000Y-79530000D03*
D19*
%TO.P,C1,2*%
%TO.N,GND*%
X42040000Y-79530000D03*
%TD*%
D10*
%TO.P,J4,1*%
%TO.N,VIN_DCDC*%
X34984000Y-75720000D03*
D11*
%TO.P,J4,2*%
%TO.N,GND*%
X34984000Y-73180000D03*
%TO.P,J4,3*%
%TO.N,VOUT_DCDC*%
X34984000Y-70640000D03*
%TD*%
D20*
%TO.P,R4,2*%
%TO.N,A4*%
X33332000Y-42000000D03*
D19*
%TO.P,R4,1*%
%TO.N,+3V3*%
X33332000Y-54700000D03*
%TD*%
%TO.P,J7,3*%
%TO.N,N/C*%
%TA.AperFunction,ComponentPad*%
G36*
G01*
X21901000Y-72140000D02*
X20151000Y-72140000D01*
G75*
G02*
X19276000Y-71265000I0J875000D01*
G01*
X19276000Y-69515000D01*
G75*
G02*
X20151000Y-68640000I875000J0D01*
G01*
X21901000Y-68640000D01*
G75*
G02*
X22776000Y-69515000I0J-875000D01*
G01*
X22776000Y-71265000D01*
G75*
G02*
X21901000Y-72140000I-875000J0D01*
G01*
G37*
%TD.AperFunction*%
%TO.P,J7,2*%
%TO.N,GND*%
%TA.AperFunction,ComponentPad*%
G36*
G01*
X26726000Y-74890000D02*
X24726000Y-74890000D01*
G75*
G02*
X23976000Y-74140000I0J750000D01*
G01*
X23976000Y-72640000D01*
G75*
G02*
X24726000Y-71890000I750000J0D01*
G01*
X26726000Y-71890000D01*
G75*
G02*
X27476000Y-72640000I0J-750000D01*
G01*
X27476000Y-74140000D01*
G75*
G02*
X26726000Y-74890000I-750000J0D01*
G01*
G37*
%TD.AperFunction*%
D21*
%TO.P,J7,1*%
%TO.N,VIN_DCDC*%
X25726000Y-67390000D03*
%TD*%
D22*
%TO.P,J8,2*%
%TO.N,VIN_DCDC*%
X9402000Y-51570000D03*
D23*
%TO.P,J8,1*%
%TO.N,GND*%
X9402000Y-46570000D03*
%TD*%
D19*
%TO.P,R2,1*%
%TO.N,+3V3*%
X22904000Y-54700000D03*
D20*
%TO.P,R2,2*%
%TO.N,SCL*%
X22904000Y-42000000D03*
%TD*%
D19*
%TO.P,R1,1*%
%TO.N,+3V3*%
X17724000Y-54700000D03*
D20*
%TO.P,R1,2*%
%TO.N,SDA*%
X17724000Y-42000000D03*
%TD*%
D19*
%TO.P,R3,1*%
%TO.N,+3V3*%
X28222000Y-54700000D03*
D20*
%TO.P,R3,2*%
%TO.N,A5*%
X28222000Y-42000000D03*
%TD*%
D24*
%TO.N,+3V3*%
X42572000Y-65750000D03*
X50422000Y-65800000D03*
X17562000Y-49370000D03*
X50362000Y-42385000D03*
X42462000Y-42335000D03*
X42537000Y-55435000D03*
X2262000Y-49285000D03*
X38950000Y-4180000D03*
X11050000Y-89270000D03*
X8540000Y-88000000D03*
X2262000Y-81642000D03*
%TO.N,GND*%
X49132000Y-73430000D03*
X49112000Y-51760000D03*
X9592000Y-74870000D03*
X4872000Y-79510000D03*
X38012000Y-72530000D03*
X37487000Y-50885000D03*
X37962000Y-36685000D03*
X43812000Y-36485000D03*
X36480000Y-7690000D03*
X36460000Y-4500000D03*
X38830000Y-88680000D03*
X46180000Y-83270000D03*
X36990000Y-86630000D03*
X1940000Y-10040000D03*
X5040000Y-45940000D03*
%TO.N,SDA*%
X6887000Y-66610000D03*
X4187000Y-65560000D03*
X4187000Y-60060000D03*
X23382000Y-36420000D03*
X19002000Y-36760000D03*
X33492000Y-37230000D03*
X7162000Y-43085000D03*
X4410000Y-9190000D03*
X48500000Y-10830000D03*
X12310000Y-88840000D03*
X40140000Y-89630000D03*
%TO.N,SCL*%
X22812000Y-52840000D03*
X11792000Y-53070000D03*
X25882000Y-41780000D03*
X25892000Y-36980000D03*
X36212000Y-36260000D03*
X9562000Y-41920000D03*
X10620000Y-6570000D03*
X5600000Y-9190000D03*
X13130000Y-41400000D03*
X14450000Y-87140000D03*
X40370000Y-91000000D03*
X15650000Y-88310000D03*
X31040000Y-90800000D03*
X8855000Y-33860000D03*
%TO.N,VIN_DCDC*%
X36762000Y-75910000D03*
X5262000Y-68960000D03*
X4322000Y-51810000D03*
X36692000Y-67860000D03*
%TO.N,VOUT_DCDC*%
X16102000Y-76270000D03*
X46182000Y-70490000D03*
X29092000Y-71140000D03*
X28562000Y-75870000D03*
%TO.N,D4*%
X7962000Y-57480000D03*
X5832000Y-56990000D03*
%TO.N,TX_D1*%
X8292000Y-56180000D03*
X10652000Y-56910000D03*
X11280000Y-84960000D03*
X18430000Y-85290000D03*
%TO.N,RX_D0*%
X15982000Y-85870000D03*
X15942000Y-81930000D03*
X9572000Y-81510000D03*
X8692000Y-66170000D03*
%TO.N,A5*%
X23652000Y-56890000D03*
X44012000Y-57070000D03*
X21182000Y-46140000D03*
X28272000Y-46090000D03*
X24412000Y-50640000D03*
X21212000Y-48930000D03*
%TO.N,A4*%
X24712000Y-47620000D03*
X33462000Y-48030000D03*
%TO.N,A3*%
X44110000Y-35170000D03*
X46782000Y-40330000D03*
%TO.N,A2*%
X29992000Y-76820000D03*
X23652000Y-77020000D03*
%TO.N,A1*%
X30672000Y-81000000D03*
X28312000Y-81650000D03*
%TO.N,VBAT*%
X21652000Y-73870000D03*
X21912000Y-78130000D03*
X35012000Y-78340000D03*
X47762000Y-59535000D03*
X44612000Y-83435000D03*
X44937000Y-67535000D03*
X47737000Y-67510000D03*
%TO.N,EN*%
X32372000Y-80260000D03*
X33512000Y-61570000D03*
%TO.N,VBUS*%
X29512000Y-79890000D03*
X29787000Y-44335000D03*
X3237000Y-44260000D03*
X3237000Y-67610000D03*
X12862000Y-78285000D03*
X10610000Y-67610000D03*
%TO.N,D13*%
X26772000Y-60990000D03*
X28542000Y-61760000D03*
%TO.N,D12*%
X24187000Y-69970000D03*
X28172000Y-69640000D03*
X25932000Y-64740000D03*
X23432000Y-64590000D03*
%TO.N,D5*%
X9270000Y-36870000D03*
X3180000Y-10330000D03*
%TO.N,VBAT_EXT*%
X10870000Y-71210000D03*
%TD*%
D25*
%TO.N,+3V3*%
X42502000Y-63130000D02*
X42502000Y-65680000D01*
X42502000Y-65680000D02*
X42572000Y-65750000D01*
X50422000Y-65800000D02*
X50422000Y-78490000D01*
X50422000Y-78490000D02*
X50782000Y-78850000D01*
X50782000Y-78850000D02*
X50782000Y-85860000D01*
X50782000Y-85860000D02*
X50662000Y-85980000D01*
X17562000Y-54538000D02*
X17724000Y-54700000D01*
X17562000Y-49370000D02*
X17562000Y-54538000D01*
X42482000Y-34810000D02*
X41952000Y-34280000D01*
X42482000Y-38786000D02*
X42482000Y-34810000D01*
X50422000Y-65800000D02*
X50422000Y-42445000D01*
X50422000Y-42445000D02*
X50362000Y-42385000D01*
X42462000Y-38806000D02*
X42482000Y-38786000D01*
X42462000Y-42335000D02*
X42462000Y-38806000D01*
X42537000Y-63095000D02*
X42502000Y-63130000D01*
X42537000Y-55435000D02*
X42537000Y-63095000D01*
X33787000Y-87525000D02*
X33812000Y-87550000D01*
X50662000Y-88360000D02*
X49012000Y-90010000D01*
X50662000Y-85980000D02*
X50662000Y-88360000D01*
X41952000Y-34280000D02*
X42700000Y-34280000D01*
X42700000Y-34280000D02*
X44810000Y-32170000D01*
X38950000Y-4180000D02*
X37980000Y-3210000D01*
X37980000Y-3210000D02*
X35990000Y-3210000D01*
X35990000Y-3210000D02*
X35450000Y-3750000D01*
X35450000Y-3750000D02*
X35450000Y-7200000D01*
X35450000Y-7200000D02*
X34890000Y-7760000D01*
X34890000Y-7760000D02*
X12130000Y-7760000D01*
X11670000Y-7300000D02*
X11670000Y-5000000D01*
X12130000Y-7760000D02*
X11670000Y-7300000D01*
X40970000Y-4180000D02*
X40030000Y-4180000D01*
X45510000Y-10190000D02*
X45510000Y-8720000D01*
X46680000Y-11360000D02*
X45510000Y-10190000D01*
X47240000Y-11360000D02*
X46680000Y-11360000D01*
X47340000Y-30150000D02*
X48170000Y-29320000D01*
X40030000Y-4180000D02*
X38950000Y-4180000D01*
X44810000Y-31990000D02*
X46250000Y-30550000D01*
X45510000Y-8720000D02*
X40970000Y-4180000D01*
X47200000Y-30150000D02*
X47340000Y-30150000D01*
X46250000Y-30550000D02*
X46800000Y-30550000D01*
X48170000Y-12290000D02*
X47240000Y-11360000D01*
X48170000Y-29320000D02*
X48170000Y-12290000D01*
X46800000Y-30550000D02*
X47200000Y-30150000D01*
X11050000Y-89270000D02*
X10400000Y-89920000D01*
X10400000Y-89920000D02*
X9070000Y-89920000D01*
X9070000Y-89920000D02*
X8540000Y-89390000D01*
X8540000Y-89390000D02*
X8540000Y-88000000D01*
X2262000Y-49285000D02*
X2262000Y-81642000D01*
X46640000Y-89000000D02*
X48000000Y-89000000D01*
%TO.N,GND*%
X49132000Y-73430000D02*
X49132000Y-53570000D01*
X49132000Y-53570000D02*
X49112000Y-53550000D01*
X49112000Y-53550000D02*
X49112000Y-51760000D01*
X9592000Y-79560000D02*
X9672000Y-79640000D01*
X9592000Y-74870000D02*
X9592000Y-79560000D01*
X42642000Y-73770000D02*
X42998000Y-73414000D01*
X37402000Y-38786000D02*
X37402000Y-37245000D01*
X39412000Y-35235000D02*
X39412000Y-34280000D01*
X37402000Y-37245000D02*
X39412000Y-35235000D01*
X38012000Y-63720000D02*
X37422000Y-63130000D01*
X38012000Y-72530000D02*
X38012000Y-63720000D01*
X37402000Y-38786000D02*
X37402000Y-50800000D01*
X37402000Y-50800000D02*
X37487000Y-50885000D01*
X37402000Y-37245000D02*
X37962000Y-36685000D01*
X31187000Y-87635000D02*
X31272000Y-87550000D01*
X31272000Y-87550000D02*
X31272000Y-88070000D01*
X31272000Y-88070000D02*
X32182000Y-88980000D01*
X4672000Y-88350000D02*
X3012000Y-90010000D01*
X9180000Y-5050000D02*
X9130000Y-5000000D01*
X36480000Y-7690000D02*
X36480000Y-4540000D01*
X36480000Y-4540000D02*
X36480000Y-4520000D01*
X36480000Y-4520000D02*
X36460000Y-4500000D01*
X5100000Y-37560000D02*
X5300000Y-37560000D01*
X5300000Y-37560000D02*
X5800000Y-37060000D01*
X5800000Y-37060000D02*
X6580000Y-37060000D01*
X6580000Y-37060000D02*
X7750000Y-35890000D01*
X7750000Y-35890000D02*
X7750000Y-32150000D01*
X7750000Y-32150000D02*
X6380000Y-30780000D01*
X6380000Y-30780000D02*
X5170000Y-30780000D01*
X5170000Y-30780000D02*
X4840000Y-30450000D01*
X2882000Y-30450000D02*
X2252000Y-29820000D01*
X4840000Y-30450000D02*
X2882000Y-30450000D01*
X2252000Y-29820000D02*
X2252000Y-29772000D01*
X2252000Y-29772000D02*
X1960000Y-29480000D01*
X1960000Y-18480000D02*
X1940000Y-18460000D01*
X1960000Y-29480000D02*
X1960000Y-18480000D01*
X4672000Y-88328000D02*
X4000000Y-89000000D01*
X4872000Y-79510000D02*
X4672000Y-79710000D01*
X4672000Y-79710000D02*
X4672000Y-88328000D01*
X38830000Y-88680000D02*
X37990000Y-89520000D01*
X32722000Y-89520000D02*
X32182000Y-88980000D01*
X37990000Y-89520000D02*
X32722000Y-89520000D01*
X46180000Y-83270000D02*
X46180000Y-84600000D01*
X46180000Y-84600000D02*
X45940000Y-84840000D01*
X45940000Y-84840000D02*
X37840000Y-84840000D01*
X37840000Y-84840000D02*
X36990000Y-85690000D01*
X36990000Y-85690000D02*
X36990000Y-86630000D01*
X1940000Y-18460000D02*
X1940000Y-10040000D01*
X4872000Y-76652000D02*
X4110000Y-75890000D01*
X4872000Y-79510000D02*
X4872000Y-76652000D01*
X5040000Y-45940000D02*
X5040000Y-42180000D01*
X4360000Y-41500000D02*
X4360000Y-38300000D01*
X5040000Y-42180000D02*
X4360000Y-41500000D01*
X4360000Y-38300000D02*
X5100000Y-37560000D01*
D26*
%TO.N,SDA*%
X6982000Y-83420000D02*
X6982000Y-66705000D01*
X6982000Y-66705000D02*
X6887000Y-66610000D01*
X4187000Y-65560000D02*
X4187000Y-60060000D01*
X6932000Y-59070000D02*
X6932000Y-43315000D01*
X6932000Y-43315000D02*
X7162000Y-43085000D01*
X19002000Y-36760000D02*
X18442000Y-37320000D01*
X18442000Y-37320000D02*
X18442000Y-37590000D01*
X18442000Y-37590000D02*
X18382000Y-37650000D01*
X18382000Y-41342000D02*
X17724000Y-42000000D01*
X18382000Y-37650000D02*
X18382000Y-41342000D01*
X15962000Y-4790000D02*
X16082000Y-4910000D01*
X33492000Y-37230000D02*
X32792000Y-36530000D01*
X32792000Y-36530000D02*
X32792000Y-35900000D01*
X34332000Y-34360000D02*
X34332000Y-34280000D01*
X32792000Y-35900000D02*
X34332000Y-34360000D01*
X7360000Y-4040000D02*
X8230000Y-3170000D01*
X4410000Y-8440000D02*
X7360000Y-5490000D01*
X4410000Y-9190000D02*
X4410000Y-8440000D01*
X16750000Y-3510000D02*
X16750000Y-5000000D01*
X16410000Y-3170000D02*
X16750000Y-3510000D01*
X8230000Y-3170000D02*
X16410000Y-3170000D01*
X7360000Y-5490000D02*
X7360000Y-4040000D01*
X48500000Y-10830000D02*
X49090000Y-11420000D01*
X49090000Y-32910000D02*
X48000000Y-34000000D01*
X49090000Y-11420000D02*
X49090000Y-32910000D01*
X6982000Y-83420000D02*
X6982000Y-84812000D01*
X6982000Y-84812000D02*
X10160000Y-87990000D01*
X10160000Y-87990000D02*
X11460000Y-87990000D01*
X11460000Y-87990000D02*
X12310000Y-88840000D01*
X40140000Y-89630000D02*
X39260000Y-90510000D01*
X39260000Y-90510000D02*
X32160000Y-90510000D01*
X32160000Y-90510000D02*
X31070000Y-89420000D01*
X22320000Y-89420000D02*
X22300000Y-89400000D01*
X31070000Y-89420000D02*
X22320000Y-89420000D01*
X12890000Y-89420000D02*
X12310000Y-88840000D01*
X22320000Y-89420000D02*
X12890000Y-89420000D01*
X33492000Y-37230000D02*
X27820000Y-37230000D01*
X27820000Y-37230000D02*
X26610000Y-36020000D01*
X23781999Y-36020001D02*
X23382000Y-36420000D01*
X26610000Y-36020000D02*
X23781999Y-36020001D01*
%TO.N,SCL*%
X22904000Y-42000000D02*
X22904000Y-52748000D01*
X22904000Y-52748000D02*
X22812000Y-52840000D01*
X9472000Y-55390000D02*
X9472000Y-59070000D01*
X11792000Y-53070000D02*
X9472000Y-55390000D01*
X25882000Y-41780000D02*
X25882000Y-39360000D01*
X25882000Y-39360000D02*
X25892000Y-39350000D01*
X25892000Y-39350000D02*
X25892000Y-36980000D01*
X36212000Y-34940000D02*
X36872000Y-34280000D01*
X36212000Y-36260000D02*
X36212000Y-34940000D01*
X9472000Y-60300000D02*
X9472000Y-59070000D01*
X8262000Y-62040000D02*
X8772000Y-61530000D01*
X8306999Y-62084999D02*
X8262000Y-62040000D01*
X8306999Y-64475001D02*
X8306999Y-62084999D01*
X8772000Y-61000000D02*
X9472000Y-60300000D01*
X7852000Y-64930000D02*
X8306999Y-64475001D01*
X8132000Y-82040000D02*
X7612000Y-81520000D01*
X9522000Y-83420000D02*
X8142000Y-82040000D01*
X8142000Y-82040000D02*
X8132000Y-82040000D01*
X7612000Y-81520000D02*
X7612000Y-67410000D01*
X8772000Y-61530000D02*
X8772000Y-61000000D01*
X7612000Y-67410000D02*
X7852000Y-67170000D01*
X7852000Y-67170000D02*
X7852000Y-64930000D01*
X11792000Y-53070000D02*
X11792000Y-45570000D01*
X11792000Y-45570000D02*
X9782000Y-43560000D01*
X9782000Y-43560000D02*
X9782000Y-43470000D01*
X9782000Y-43470000D02*
X9562000Y-43250000D01*
X9562000Y-43250000D02*
X9562000Y-41920000D01*
X14462000Y-5252000D02*
X14210000Y-5000000D01*
X10620000Y-6570000D02*
X9300000Y-6570000D01*
X9300000Y-6570000D02*
X7200000Y-6570000D01*
X7200000Y-6570000D02*
X5600000Y-8170000D01*
X5600000Y-8170000D02*
X5600000Y-9190000D01*
X10010000Y-36260000D02*
X8780000Y-35030000D01*
X10460000Y-36260000D02*
X10010000Y-36260000D01*
X13177001Y-41352999D02*
X13177001Y-37307001D01*
X11010000Y-36810000D02*
X10460000Y-36260000D01*
X13177001Y-37307001D02*
X13107001Y-37307001D01*
X13107001Y-37307001D02*
X12610000Y-36810000D01*
X13130000Y-41400000D02*
X13177001Y-41352999D01*
X12610000Y-36810000D02*
X11010000Y-36810000D01*
X9522000Y-83420000D02*
X9522000Y-85162000D01*
X9522000Y-85162000D02*
X12040000Y-87680000D01*
X12040000Y-87680000D02*
X13910000Y-87680000D01*
X13910000Y-87680000D02*
X14450000Y-87140000D01*
X40370000Y-91000000D02*
X40070000Y-91300000D01*
X14450000Y-87140000D02*
X14480000Y-87140000D01*
X14480000Y-87140000D02*
X15650000Y-88310000D01*
X31540000Y-91300000D02*
X31800000Y-91300000D01*
X40070000Y-91300000D02*
X31800000Y-91300000D01*
X31040000Y-90800000D02*
X31540000Y-91300000D01*
X8855000Y-34955000D02*
X8780000Y-35030000D01*
X8855000Y-33860000D02*
X8855000Y-34955000D01*
D25*
%TO.N,VIN_DCDC*%
X36702000Y-75970000D02*
X36762000Y-75910000D01*
X5262000Y-65160000D02*
X5262000Y-68960000D01*
X4322000Y-51810000D02*
X4322000Y-58460000D01*
X4322000Y-58460000D02*
X5202000Y-59340000D01*
X5202000Y-59340000D02*
X5202000Y-61450000D01*
X5202000Y-61450000D02*
X4992000Y-61660000D01*
X4992000Y-64890000D02*
X5262000Y-65160000D01*
X4992000Y-61660000D02*
X4992000Y-64890000D01*
X36692000Y-75840000D02*
X36762000Y-75910000D01*
X36692000Y-67860000D02*
X36692000Y-75840000D01*
%TO.N,VOUT_DCDC*%
X16102000Y-67000000D02*
X16042000Y-66940000D01*
X16102000Y-76270000D02*
X16102000Y-67000000D01*
X29092000Y-71140000D02*
X29092000Y-75340000D01*
X29092000Y-75340000D02*
X28562000Y-75870000D01*
X46182000Y-78932000D02*
X46044000Y-79070000D01*
X46182000Y-70490000D02*
X46182000Y-78932000D01*
D26*
%TO.N,D4*%
X6942000Y-63130000D02*
X6942000Y-61370000D01*
X8107001Y-57625001D02*
X7962000Y-57480000D01*
X6942000Y-61370000D02*
X8107001Y-60204999D01*
X8107001Y-60204999D02*
X8107001Y-57625001D01*
X6922000Y-38786000D02*
X6922000Y-40630000D01*
X6922000Y-40630000D02*
X6122000Y-41430000D01*
X5832000Y-52330000D02*
X6122000Y-52040000D01*
X5832000Y-56990000D02*
X5832000Y-52330000D01*
X6122000Y-41430000D02*
X6122000Y-52040000D01*
%TO.N,TX_D1*%
X8162000Y-53680000D02*
X7522000Y-53040000D01*
X8162000Y-53680000D02*
X8162000Y-56050000D01*
X8162000Y-56050000D02*
X8292000Y-56180000D01*
X10652000Y-56910000D02*
X10652000Y-60250000D01*
X9482000Y-61420000D02*
X9482000Y-63130000D01*
X10652000Y-60250000D02*
X9482000Y-61420000D01*
X9482000Y-63130000D02*
X9482000Y-72870000D01*
X10597010Y-73985010D02*
X10597010Y-78495010D01*
X9482000Y-72870000D02*
X10597010Y-73985010D01*
X10597010Y-78495010D02*
X10662000Y-78560000D01*
X10662000Y-79350000D02*
X10652000Y-79360000D01*
X10662000Y-78560000D02*
X10662000Y-79350000D01*
X10697001Y-79405001D02*
X10697001Y-84375001D01*
X10652000Y-79360000D02*
X10697001Y-79405001D01*
X9462000Y-38786000D02*
X8462000Y-39786000D01*
X8462000Y-44090000D02*
X7522000Y-45030000D01*
X8462000Y-39786000D02*
X8462000Y-44090000D01*
X7522000Y-53040000D02*
X7522000Y-45030000D01*
X10697001Y-84375001D02*
X10697001Y-84377001D01*
X10697001Y-84377001D02*
X11280000Y-84960000D01*
X18430000Y-87408000D02*
X18572000Y-87550000D01*
X18430000Y-85290000D02*
X18430000Y-87408000D01*
%TO.N,RX_D0*%
X12002000Y-41730000D02*
X12002000Y-38786000D01*
X13282000Y-43010000D02*
X12002000Y-41730000D01*
X12022000Y-63130000D02*
X12022000Y-61490000D01*
X13282000Y-60230000D02*
X13282000Y-43010000D01*
X12022000Y-61490000D02*
X13282000Y-60230000D01*
X15982000Y-85870000D02*
X15966999Y-85854999D01*
X15966999Y-81934999D02*
X15946999Y-81934999D01*
X15946999Y-81934999D02*
X15942000Y-81930000D01*
X9572000Y-81510000D02*
X9072000Y-81510000D01*
X9072000Y-81510000D02*
X8592010Y-81030010D01*
X8592010Y-81030010D02*
X8592010Y-74309990D01*
X8592010Y-74309990D02*
X8842000Y-74060000D01*
X8842000Y-74060000D02*
X8842000Y-66310000D01*
X8862000Y-66290000D02*
X8842000Y-66310000D01*
X8862000Y-66290000D02*
X8812000Y-66290000D01*
X8812000Y-66290000D02*
X8692000Y-66170000D01*
X15942000Y-81930000D02*
X15942000Y-82538000D01*
X15942000Y-82538000D02*
X15900000Y-82580000D01*
X15900000Y-85788000D02*
X15982000Y-85870000D01*
X15900000Y-82580000D02*
X15900000Y-85788000D01*
%TO.N,MISO*%
X14562000Y-63130000D02*
X14562000Y-61860000D01*
X14562000Y-61860000D02*
X15842000Y-60580000D01*
X14542000Y-55720000D02*
X15842000Y-57020000D01*
X14542000Y-38786000D02*
X14542000Y-55720000D01*
X15842000Y-60580000D02*
X15842000Y-57020000D01*
X15842000Y-57020000D02*
X15842000Y-56980000D01*
%TO.N,MOSI*%
X17102000Y-63130000D02*
X17102000Y-61980000D01*
X17592000Y-57100000D02*
X15762000Y-55270000D01*
X15762000Y-40106000D02*
X17082000Y-38786000D01*
X15762000Y-55270000D02*
X15762000Y-40106000D01*
X17592000Y-57100000D02*
X17592000Y-57160000D01*
X18267001Y-60814999D02*
X18197000Y-60885000D01*
X18267001Y-57835001D02*
X18267001Y-60814999D01*
X17592000Y-57160000D02*
X18267001Y-57835001D01*
X17102000Y-61980000D02*
X18197000Y-60885000D01*
%TO.N,SCK*%
X19642000Y-63130000D02*
X19642000Y-61760000D01*
X19642000Y-61760000D02*
X20902000Y-60500000D01*
X20902000Y-60500000D02*
X20902000Y-57180000D01*
X19622000Y-55900000D02*
X20902000Y-57180000D01*
X19622000Y-38786000D02*
X19622000Y-55900000D01*
%TO.N,A5*%
X22182000Y-63130000D02*
X22182000Y-61750000D01*
X22182000Y-61750000D02*
X23432000Y-60500000D01*
X23432000Y-60500000D02*
X23432000Y-57300000D01*
X23432000Y-57300000D02*
X23432000Y-57110000D01*
X23432000Y-57110000D02*
X23652000Y-56890000D01*
X43866999Y-68045001D02*
X42998000Y-68914000D01*
X43866999Y-61895001D02*
X43866999Y-68045001D01*
X44012000Y-57070000D02*
X44012000Y-61750000D01*
X44012000Y-61750000D02*
X43866999Y-61895001D01*
X22162000Y-38786000D02*
X20982000Y-39966000D01*
X20982000Y-39966000D02*
X20982000Y-45940000D01*
X20982000Y-45940000D02*
X21182000Y-46140000D01*
X28272000Y-42050000D02*
X28222000Y-42000000D01*
X28272000Y-46090000D02*
X28272000Y-42050000D01*
X23652000Y-56890000D02*
X24582000Y-55960000D01*
X24582000Y-55960000D02*
X24582000Y-50810000D01*
X24582000Y-50810000D02*
X24412000Y-50640000D01*
X21212000Y-46170000D02*
X21182000Y-46140000D01*
X21212000Y-48930000D02*
X21212000Y-46170000D01*
%TO.N,A4*%
X24702000Y-38786000D02*
X24702000Y-47610000D01*
X24702000Y-47610000D02*
X24712000Y-47620000D01*
X33462000Y-42130000D02*
X33332000Y-42000000D01*
X33462000Y-48030000D02*
X33462000Y-42130000D01*
X25932000Y-48840000D02*
X24712000Y-47620000D01*
X25932000Y-60640000D02*
X25932000Y-48840000D01*
X24722000Y-63130000D02*
X24722000Y-61850000D01*
X24722000Y-61850000D02*
X25932000Y-60640000D01*
%TO.N,A3*%
X28502000Y-57010000D02*
X27096999Y-55604999D01*
X27096999Y-55604999D02*
X27096999Y-38931001D01*
X27262000Y-61850000D02*
X28502000Y-60610000D01*
X27096999Y-38931001D02*
X27242000Y-38786000D01*
X28502000Y-60610000D02*
X28502000Y-57010000D01*
X27262000Y-63130000D02*
X27262000Y-61850000D01*
X44110000Y-35170000D02*
X46782000Y-37842000D01*
X46782000Y-37842000D02*
X46782000Y-40330000D01*
%TO.N,A2*%
X30967001Y-39971001D02*
X29782000Y-38786000D01*
X30967001Y-60444999D02*
X30967001Y-39971001D01*
X29802000Y-63130000D02*
X29802000Y-61610000D01*
X29802000Y-61610000D02*
X30967001Y-60444999D01*
X23652000Y-87550000D02*
X23652000Y-84660000D01*
X23652000Y-84660000D02*
X23502000Y-84510000D01*
X23502000Y-84510000D02*
X23502000Y-81450000D01*
X23502000Y-81450000D02*
X23542000Y-81410000D01*
X30302000Y-63630000D02*
X29802000Y-63130000D01*
X30302000Y-69570000D02*
X30302000Y-63630000D01*
X30302000Y-69570000D02*
X30302000Y-76510000D01*
X30302000Y-76510000D02*
X29992000Y-76820000D01*
X23652000Y-81300000D02*
X23542000Y-81410000D01*
X23652000Y-77020000D02*
X23652000Y-81300000D01*
%TO.N,A1*%
X32342000Y-63130000D02*
X32342000Y-61570000D01*
X32342000Y-61570000D02*
X33522000Y-60390000D01*
X33522000Y-60390000D02*
X33522000Y-57540000D01*
X33522000Y-57540000D02*
X32102000Y-56120000D01*
X32102000Y-39006000D02*
X32322000Y-38786000D01*
X32102000Y-56120000D02*
X32102000Y-39006000D01*
X32342000Y-63130000D02*
X31472000Y-64000000D01*
X31472000Y-64000000D02*
X31472000Y-69220000D01*
X28472000Y-82850998D02*
X28477001Y-82855999D01*
X26192000Y-87000000D02*
X26192000Y-87550000D01*
X28477001Y-84714999D02*
X26192000Y-87000000D01*
X31472000Y-69220000D02*
X31472000Y-80200000D01*
X31472000Y-80200000D02*
X30672000Y-81000000D01*
X28312000Y-81650000D02*
X28477001Y-81815001D01*
X28477001Y-82855999D02*
X28477001Y-83064999D01*
X28477001Y-81815001D02*
X28477001Y-83064999D01*
X28477001Y-83064999D02*
X28477001Y-84714999D01*
%TO.N,A0*%
X34882000Y-63130000D02*
X34882000Y-62180000D01*
X34882000Y-62180000D02*
X36652000Y-60410000D01*
X36652000Y-60410000D02*
X36652000Y-51830000D01*
X36652000Y-51830000D02*
X36172000Y-51350000D01*
X36172000Y-40096000D02*
X34862000Y-38786000D01*
X36172000Y-51350000D02*
X36172000Y-40096000D01*
X28732000Y-87550000D02*
X31052000Y-85230000D01*
X34882000Y-63130000D02*
X34882000Y-68090000D01*
X34882000Y-68090000D02*
X33332000Y-69640000D01*
X33332000Y-69640000D02*
X33332000Y-81050000D01*
X33332000Y-81050000D02*
X32852000Y-81530000D01*
X32852000Y-81530000D02*
X31692000Y-81530000D01*
X31052000Y-85230000D02*
X31052000Y-82170000D01*
X31692000Y-81530000D02*
X31052000Y-82170000D01*
%TO.N,AREF*%
X39962000Y-63130000D02*
X39962000Y-55440000D01*
X39962000Y-55440000D02*
X38862000Y-54340000D01*
X38862000Y-39866000D02*
X39942000Y-38786000D01*
X38862000Y-54340000D02*
X38862000Y-39866000D01*
%TO.N,~RESET*%
X45042000Y-38806000D02*
X45022000Y-38786000D01*
X45042000Y-63130000D02*
X45042000Y-38806000D01*
D25*
%TO.N,VBAT*%
X21652000Y-73870000D02*
X21652000Y-77870000D01*
X21652000Y-77870000D02*
X21912000Y-78130000D01*
X35012000Y-83330000D02*
X34922000Y-83420000D01*
X35012000Y-78340000D02*
X35012000Y-83330000D01*
X44612000Y-75260000D02*
X44962000Y-74910000D01*
X44962000Y-74910000D02*
X44962000Y-67560000D01*
X44962000Y-67560000D02*
X44937000Y-67535000D01*
X47737000Y-59560000D02*
X47762000Y-59535000D01*
X47737000Y-67510000D02*
X47737000Y-59560000D01*
X44612000Y-75260000D02*
X44612000Y-77058000D01*
X44612000Y-77058000D02*
X43820000Y-77850000D01*
X44005000Y-83435000D02*
X44612000Y-83435000D01*
X43820000Y-83250000D02*
X44005000Y-83435000D01*
X43820000Y-77850000D02*
X43820000Y-83250000D01*
D26*
%TO.N,EN*%
X32372000Y-80260000D02*
X32372000Y-65670000D01*
X33517001Y-61575001D02*
X33512000Y-61570000D01*
X32372000Y-65670000D02*
X33517001Y-64524999D01*
X33517001Y-64524999D02*
X33517001Y-61575001D01*
D25*
%TO.N,VBUS*%
X29512000Y-83090000D02*
X29842000Y-83420000D01*
X29512000Y-79890000D02*
X29512000Y-83090000D01*
X29792000Y-59070000D02*
X29792000Y-57205000D01*
X29792000Y-57205000D02*
X29887000Y-57110000D01*
X29887000Y-57110000D02*
X29887000Y-44435000D01*
X29887000Y-44435000D02*
X29787000Y-44335000D01*
X3237000Y-44260000D02*
X3237000Y-60385000D01*
X3237000Y-60385000D02*
X3237000Y-67610000D01*
X12637000Y-67610000D02*
X12637000Y-78060000D01*
X12637000Y-78060000D02*
X12862000Y-78285000D01*
X12637000Y-67610000D02*
X10610000Y-67610000D01*
D26*
%TO.N,D13*%
X27252000Y-59070000D02*
X27252000Y-60510000D01*
X27252000Y-60510000D02*
X26772000Y-60990000D01*
X28542000Y-64490000D02*
X28542000Y-61760000D01*
X29402000Y-65350000D02*
X28542000Y-64490000D01*
X29402000Y-69540000D02*
X29402000Y-65350000D01*
X27302000Y-75680000D02*
X28282000Y-74700000D01*
X27302000Y-83420000D02*
X27302000Y-75680000D01*
X28282000Y-70670000D02*
X28897001Y-70054999D01*
X28282000Y-74700000D02*
X28282000Y-70670000D01*
X28897001Y-70054999D02*
X28897001Y-70044999D01*
X28897001Y-70044999D02*
X29402000Y-69540000D01*
%TO.N,D12*%
X24762000Y-83420000D02*
X24762000Y-76740000D01*
X24762000Y-76740000D02*
X23392000Y-75370000D01*
X23392000Y-72346410D02*
X23622000Y-72116410D01*
X23392000Y-75370000D02*
X23392000Y-72346410D01*
X23622000Y-72116410D02*
X23622000Y-71490000D01*
X23622000Y-71490000D02*
X24187000Y-70925000D01*
X24187000Y-70925000D02*
X24187000Y-69970000D01*
X28172000Y-69640000D02*
X28172000Y-65340000D01*
X28172000Y-65340000D02*
X27502000Y-64670000D01*
X27502000Y-64670000D02*
X26822000Y-64670000D01*
X24712000Y-60580000D02*
X24712000Y-59070000D01*
X27502000Y-64670000D02*
X26002000Y-64670000D01*
X26002000Y-64670000D02*
X25932000Y-64740000D01*
X23432000Y-61860000D02*
X24712000Y-60580000D01*
X23432000Y-64590000D02*
X23432000Y-61860000D01*
%TO.N,D11*%
X23152000Y-71950000D02*
X23152000Y-70920000D01*
X22222000Y-79280000D02*
X22872000Y-78630000D01*
X22222000Y-83420000D02*
X22222000Y-79280000D01*
X22872000Y-78630000D02*
X22872000Y-72230000D01*
X22872000Y-72230000D02*
X23152000Y-71950000D01*
X23152000Y-70920000D02*
X23152000Y-66930000D01*
X23152000Y-66930000D02*
X20942000Y-64720000D01*
X20942000Y-64720000D02*
X20942000Y-61820000D01*
X22172000Y-60590000D02*
X22172000Y-59070000D01*
X20942000Y-61820000D02*
X22172000Y-60590000D01*
%TO.N,D10*%
X19222000Y-61090000D02*
X19222000Y-59480000D01*
X19682000Y-73690000D02*
X18502000Y-72510000D01*
X18502000Y-63729002D02*
X18466999Y-63694001D01*
X19682000Y-83420000D02*
X19682000Y-73690000D01*
X18502000Y-72510000D02*
X18502000Y-63729002D01*
X18466999Y-63694001D02*
X18466999Y-61845001D01*
X19222000Y-59480000D02*
X19632000Y-59070000D01*
X18466999Y-61845001D02*
X19222000Y-61090000D01*
%TO.N,D9*%
X17142000Y-83420000D02*
X18852000Y-81710000D01*
X18852000Y-81710000D02*
X18852000Y-73950000D01*
X18852000Y-73950000D02*
X17802000Y-72900000D01*
X17802000Y-68950000D02*
X17922000Y-68830000D01*
X17802000Y-72900000D02*
X17802000Y-68950000D01*
X17922000Y-68830000D02*
X17922000Y-65810000D01*
X17922000Y-65810000D02*
X16762000Y-64650000D01*
X16762000Y-64650000D02*
X16062000Y-64650000D01*
X16062000Y-64650000D02*
X15892000Y-64480000D01*
X15892000Y-64480000D02*
X15892000Y-62070000D01*
X15892000Y-62070000D02*
X16772000Y-61190000D01*
X16772000Y-59390000D02*
X17092000Y-59070000D01*
X16772000Y-61190000D02*
X16772000Y-59390000D01*
%TO.N,D6*%
X14552000Y-59070000D02*
X14552000Y-60680000D01*
X14552000Y-60680000D02*
X13282000Y-61950000D01*
X14142000Y-67760000D02*
X14142000Y-64950000D01*
X14142000Y-64950000D02*
X13282000Y-64090000D01*
X14292000Y-67910000D02*
X14142000Y-67760000D01*
X14302000Y-67910000D02*
X14292000Y-67910000D01*
X15152000Y-68760000D02*
X14302000Y-67910000D01*
X14092000Y-82910000D02*
X14092000Y-77830000D01*
X14092000Y-77830000D02*
X15152000Y-76770000D01*
X13282000Y-61950000D02*
X13282000Y-64090000D01*
X14602000Y-83420000D02*
X14092000Y-82910000D01*
X15152000Y-76770000D02*
X15152000Y-68760000D01*
%TO.N,D5*%
X12062000Y-83420000D02*
X13602000Y-81880000D01*
X13602000Y-81880000D02*
X13602000Y-65780000D01*
X13602000Y-65780000D02*
X12532000Y-64710000D01*
X12532000Y-64710000D02*
X11172000Y-64710000D01*
X11172000Y-64710000D02*
X10752000Y-64290000D01*
X10752000Y-64290000D02*
X10752000Y-62140000D01*
X10752000Y-62140000D02*
X11312000Y-61580000D01*
X11312000Y-61580000D02*
X11312000Y-61120000D01*
X12012000Y-60420000D02*
X12012000Y-59070000D01*
X11312000Y-61120000D02*
X12012000Y-60420000D01*
X12012000Y-59070000D02*
X12012000Y-55720000D01*
X12012000Y-55720000D02*
X12662000Y-55070000D01*
X12662000Y-51260000D02*
X12412000Y-51010000D01*
X12662000Y-55070000D02*
X12662000Y-51260000D01*
X12412000Y-51010000D02*
X12412000Y-44760000D01*
X12412000Y-44760000D02*
X10692000Y-43040000D01*
X10692000Y-43040000D02*
X10692000Y-37450000D01*
X3332000Y-3330000D02*
X3012000Y-3010000D01*
X3332000Y-4668000D02*
X4000000Y-4000000D01*
X3332000Y-8940000D02*
X3332000Y-4668000D01*
X10470000Y-37228000D02*
X10692000Y-37450000D01*
X10470000Y-37228000D02*
X9628000Y-37228000D01*
X9628000Y-37228000D02*
X9270000Y-36870000D01*
X3112000Y-9182000D02*
X3120000Y-9190000D01*
X3112000Y-9160000D02*
X3112000Y-9182000D01*
X3112000Y-9160000D02*
X3332000Y-8940000D01*
X3332000Y-8940000D02*
X3332000Y-10178000D01*
X3332000Y-10178000D02*
X3180000Y-10330000D01*
D25*
%TO.N,VBAT_EXT*%
X11672000Y-79640000D02*
X11672000Y-71220000D01*
X11672000Y-71220000D02*
X10880000Y-71220000D01*
X10880000Y-71220000D02*
X10870000Y-71210000D01*
%TD*%
M02*
