%TF.GenerationSoftware,KiCad,Pcbnew,5.1.9-73d0e3b20d~88~ubuntu18.04.1*%
%TF.CreationDate,2021-05-13T18:16:41-04:00*%
%TF.ProjectId,remote,72656d6f-7465-42e6-9b69-6361645f7063,rev?*%
%TF.SameCoordinates,Original*%
%TF.FileFunction,Legend,Bot*%
%TF.FilePolarity,Positive*%
%FSLAX46Y46*%
G04 Gerber Fmt 4.6, Leading zero omitted, Abs format (unit mm)*
G04 Created by KiCad (PCBNEW 5.1.9-73d0e3b20d~88~ubuntu18.04.1) date 2021-05-13 18:16:41*
%MOMM*%
%LPD*%
G01*
G04 APERTURE LIST*
%ADD10C,0.150000*%
%ADD11C,0.120000*%
%ADD12C,0.203200*%
%ADD13C,0.500000*%
%ADD14C,0.152400*%
%ADD15C,0.200000*%
G04 APERTURE END LIST*
D10*
X209725585Y76665828D02*
X209725585Y76380114D01*
X209154157Y76665828D02*
X209154157Y76380114D01*
X207654157Y75165828D02*
X208154157Y75880114D01*
X208511300Y75165828D02*
X208511300Y76665828D01*
X207939871Y76665828D01*
X207797014Y76594400D01*
X207725585Y76522971D01*
X207654157Y76380114D01*
X207654157Y76165828D01*
X207725585Y76022971D01*
X207797014Y75951542D01*
X207939871Y75880114D01*
X208511300Y75880114D01*
X207011300Y75951542D02*
X206511300Y75951542D01*
X206297014Y75165828D02*
X207011300Y75165828D01*
X207011300Y76665828D01*
X206297014Y76665828D01*
X205868442Y76665828D02*
X205368442Y75165828D01*
X204868442Y76665828D01*
X202511300Y75165828D02*
X203225585Y75165828D01*
X203225585Y76665828D01*
X202082728Y76665828D02*
X202082728Y76380114D01*
X201511300Y76665828D02*
X201511300Y76380114D01*
X236580419Y46200038D02*
X237580419Y46200038D01*
X237104228Y46200038D02*
X237104228Y46771466D01*
X236580419Y46771466D02*
X237580419Y46771466D01*
X236580419Y47247657D02*
X237580419Y47247657D01*
X236580419Y48295276D02*
X237056609Y47961942D01*
X236580419Y47723847D02*
X237580419Y47723847D01*
X237580419Y48104800D01*
X237532800Y48200038D01*
X237485180Y48247657D01*
X237389942Y48295276D01*
X237247085Y48295276D01*
X237151847Y48247657D01*
X237104228Y48200038D01*
X237056609Y48104800D01*
X237056609Y47723847D01*
X237580419Y48914323D02*
X237580419Y49104800D01*
X237532800Y49200038D01*
X237437561Y49295276D01*
X237247085Y49342895D01*
X236913752Y49342895D01*
X236723276Y49295276D01*
X236628038Y49200038D01*
X236580419Y49104800D01*
X236580419Y48914323D01*
X236628038Y48819085D01*
X236723276Y48723847D01*
X236913752Y48676228D01*
X237247085Y48676228D01*
X237437561Y48723847D01*
X237532800Y48819085D01*
X237580419Y48914323D01*
X236628038Y49723847D02*
X236580419Y49866704D01*
X236580419Y50104800D01*
X236628038Y50200038D01*
X236675657Y50247657D01*
X236770895Y50295276D01*
X236866133Y50295276D01*
X236961371Y50247657D01*
X237008990Y50200038D01*
X237056609Y50104800D01*
X237104228Y49914323D01*
X237151847Y49819085D01*
X237199466Y49771466D01*
X237294704Y49723847D01*
X237389942Y49723847D01*
X237485180Y49771466D01*
X237532800Y49819085D01*
X237580419Y49914323D01*
X237580419Y50152419D01*
X237532800Y50295276D01*
X237104228Y50723847D02*
X237104228Y51057180D01*
X236580419Y51200038D02*
X236580419Y50723847D01*
X237580419Y50723847D01*
X237580419Y51200038D01*
X236580419Y52390514D02*
X237580419Y52390514D01*
X237580419Y52628609D01*
X237532800Y52771466D01*
X237437561Y52866704D01*
X237342323Y52914323D01*
X237151847Y52961942D01*
X237008990Y52961942D01*
X236818514Y52914323D01*
X236723276Y52866704D01*
X236628038Y52771466D01*
X236580419Y52628609D01*
X236580419Y52390514D01*
X236580419Y53390514D02*
X237580419Y53390514D01*
X236866133Y53723847D01*
X237580419Y54057180D01*
X236580419Y54057180D01*
X237580419Y54438133D02*
X237580419Y55057180D01*
X237199466Y54723847D01*
X237199466Y54866704D01*
X237151847Y54961942D01*
X237104228Y55009561D01*
X237008990Y55057180D01*
X236770895Y55057180D01*
X236675657Y55009561D01*
X236628038Y54961942D01*
X236580419Y54866704D01*
X236580419Y54580990D01*
X236628038Y54485752D01*
X236675657Y54438133D01*
X236580419Y55485752D02*
X237580419Y55485752D01*
X237580419Y55723847D01*
X237532800Y55866704D01*
X237437561Y55961942D01*
X237342323Y56009561D01*
X237151847Y56057180D01*
X237008990Y56057180D01*
X236818514Y56009561D01*
X236723276Y55961942D01*
X236628038Y55866704D01*
X236580419Y55723847D01*
X236580419Y55485752D01*
X244800285Y23734685D02*
X244800285Y22734685D01*
X244800285Y23115638D02*
X244895523Y23068019D01*
X245086000Y23068019D01*
X245181238Y23115638D01*
X245228857Y23163257D01*
X245276476Y23258495D01*
X245276476Y23544209D01*
X245228857Y23639447D01*
X245181238Y23687066D01*
X245086000Y23734685D01*
X244895523Y23734685D01*
X244800285Y23687066D01*
X244419333Y23734685D02*
X244228857Y23068019D01*
X244038380Y23544209D01*
X243847904Y23068019D01*
X243657428Y23734685D01*
X243276476Y23068019D02*
X243276476Y23734685D01*
X243276476Y24068019D02*
X243324095Y24020400D01*
X243276476Y23972780D01*
X243228857Y24020400D01*
X243276476Y24068019D01*
X243276476Y23972780D01*
X242800285Y23068019D02*
X242800285Y23734685D01*
X242800285Y24068019D02*
X242847904Y24020400D01*
X242800285Y23972780D01*
X242752666Y24020400D01*
X242800285Y24068019D01*
X242800285Y23972780D01*
X241895523Y23115638D02*
X241990761Y23068019D01*
X242181238Y23068019D01*
X242276476Y23115638D01*
X242324095Y23163257D01*
X242371714Y23258495D01*
X242371714Y23544209D01*
X242324095Y23639447D01*
X242276476Y23687066D01*
X242181238Y23734685D01*
X241990761Y23734685D01*
X241895523Y23687066D01*
X245233676Y6046838D02*
X245090819Y5999219D01*
X244852723Y5999219D01*
X244757485Y6046838D01*
X244709866Y6094457D01*
X244662247Y6189695D01*
X244662247Y6284933D01*
X244709866Y6380171D01*
X244757485Y6427790D01*
X244852723Y6475409D01*
X245043200Y6523028D01*
X245138438Y6570647D01*
X245186057Y6618266D01*
X245233676Y6713504D01*
X245233676Y6808742D01*
X245186057Y6903980D01*
X245138438Y6951600D01*
X245043200Y6999219D01*
X244805104Y6999219D01*
X244662247Y6951600D01*
X243662247Y6094457D02*
X243709866Y6046838D01*
X243852723Y5999219D01*
X243947961Y5999219D01*
X244090819Y6046838D01*
X244186057Y6142076D01*
X244233676Y6237314D01*
X244281295Y6427790D01*
X244281295Y6570647D01*
X244233676Y6761123D01*
X244186057Y6856361D01*
X244090819Y6951600D01*
X243947961Y6999219D01*
X243852723Y6999219D01*
X243709866Y6951600D01*
X243662247Y6903980D01*
X242757485Y5999219D02*
X243233676Y5999219D01*
X243233676Y6999219D01*
X236292685Y22825142D02*
X236292685Y24025142D01*
X235606971Y22825142D01*
X235606971Y24025142D01*
X234806971Y24025142D02*
X234578400Y24025142D01*
X234464114Y23968000D01*
X234349828Y23853714D01*
X234292685Y23625142D01*
X234292685Y23225142D01*
X234349828Y22996571D01*
X234464114Y22882285D01*
X234578400Y22825142D01*
X234806971Y22825142D01*
X234921257Y22882285D01*
X235035542Y22996571D01*
X235092685Y23225142D01*
X235092685Y23625142D01*
X235035542Y23853714D01*
X234921257Y23968000D01*
X234806971Y24025142D01*
X233778400Y22825142D02*
X233778400Y24025142D01*
X233492685Y24025142D01*
X233321257Y23968000D01*
X233206971Y23853714D01*
X233149828Y23739428D01*
X233092685Y23510857D01*
X233092685Y23339428D01*
X233149828Y23110857D01*
X233206971Y22996571D01*
X233321257Y22882285D01*
X233492685Y22825142D01*
X233778400Y22825142D01*
X232578400Y23453714D02*
X232178400Y23453714D01*
X232006971Y22825142D02*
X232578400Y22825142D01*
X232578400Y24025142D01*
X232006971Y24025142D01*
X231549828Y23625142D02*
X230692685Y23625142D01*
X231206971Y24139428D02*
X231549828Y22596571D01*
X230806971Y23110857D02*
X231664114Y23110857D01*
X231149828Y22596571D02*
X230806971Y24139428D01*
X238663219Y48931866D02*
X239329885Y48931866D01*
X239234647Y48931866D02*
X239282266Y48979485D01*
X239329885Y49074723D01*
X239329885Y49217580D01*
X239282266Y49312819D01*
X239187028Y49360438D01*
X238663219Y49360438D01*
X239187028Y49360438D02*
X239282266Y49408057D01*
X239329885Y49503295D01*
X239329885Y49646152D01*
X239282266Y49741390D01*
X239187028Y49789009D01*
X238663219Y49789009D01*
X238663219Y50265200D02*
X239329885Y50265200D01*
X239663219Y50265200D02*
X239615600Y50217580D01*
X239567980Y50265200D01*
X239615600Y50312819D01*
X239663219Y50265200D01*
X239567980Y50265200D01*
X238710838Y51169961D02*
X238663219Y51074723D01*
X238663219Y50884247D01*
X238710838Y50789009D01*
X238758457Y50741390D01*
X238853695Y50693771D01*
X239139409Y50693771D01*
X239234647Y50741390D01*
X239282266Y50789009D01*
X239329885Y50884247D01*
X239329885Y51074723D01*
X239282266Y51169961D01*
X238663219Y51598533D02*
X239329885Y51598533D01*
X239139409Y51598533D02*
X239234647Y51646152D01*
X239282266Y51693771D01*
X239329885Y51789009D01*
X239329885Y51884247D01*
X238663219Y52360438D02*
X238710838Y52265200D01*
X238758457Y52217580D01*
X238853695Y52169961D01*
X239139409Y52169961D01*
X239234647Y52217580D01*
X239282266Y52265200D01*
X239329885Y52360438D01*
X239329885Y52503295D01*
X239282266Y52598533D01*
X239234647Y52646152D01*
X239139409Y52693771D01*
X238853695Y52693771D01*
X238758457Y52646152D01*
X238710838Y52598533D01*
X238663219Y52503295D01*
X238663219Y52360438D01*
X238710838Y53074723D02*
X238663219Y53217580D01*
X238663219Y53455676D01*
X238710838Y53550914D01*
X238758457Y53598533D01*
X238853695Y53646152D01*
X238948933Y53646152D01*
X239044171Y53598533D01*
X239091790Y53550914D01*
X239139409Y53455676D01*
X239187028Y53265200D01*
X239234647Y53169961D01*
X239282266Y53122342D01*
X239377504Y53074723D01*
X239472742Y53074723D01*
X239567980Y53122342D01*
X239615600Y53169961D01*
X239663219Y53265200D01*
X239663219Y53503295D01*
X239615600Y53646152D01*
X238663219Y54074723D02*
X239663219Y54074723D01*
X239663219Y54312819D01*
X239615600Y54455676D01*
X239520361Y54550914D01*
X239425123Y54598533D01*
X239234647Y54646152D01*
X239091790Y54646152D01*
X238901314Y54598533D01*
X238806076Y54550914D01*
X238710838Y54455676D01*
X238663219Y54312819D01*
X238663219Y54074723D01*
X214602385Y80940342D02*
X214602385Y82140342D01*
X214088100Y80940342D02*
X214088100Y81568914D01*
X214145242Y81683200D01*
X214259528Y81740342D01*
X214430957Y81740342D01*
X214545242Y81683200D01*
X214602385Y81626057D01*
X213688100Y81740342D02*
X213230957Y81740342D01*
X213516671Y82140342D02*
X213516671Y81111771D01*
X213459528Y80997485D01*
X213345242Y80940342D01*
X213230957Y80940342D01*
X213002385Y81740342D02*
X212545242Y81740342D01*
X212830957Y82140342D02*
X212830957Y81111771D01*
X212773814Y80997485D01*
X212659528Y80940342D01*
X212545242Y80940342D01*
X212145242Y81740342D02*
X212145242Y80540342D01*
X212145242Y81683200D02*
X212030957Y81740342D01*
X211802385Y81740342D01*
X211688100Y81683200D01*
X211630957Y81626057D01*
X211573814Y81511771D01*
X211573814Y81168914D01*
X211630957Y81054628D01*
X211688100Y80997485D01*
X211802385Y80940342D01*
X212030957Y80940342D01*
X212145242Y80997485D01*
X211059528Y81054628D02*
X211002385Y80997485D01*
X211059528Y80940342D01*
X211116671Y80997485D01*
X211059528Y81054628D01*
X211059528Y80940342D01*
X211059528Y81683200D02*
X211002385Y81626057D01*
X211059528Y81568914D01*
X211116671Y81626057D01*
X211059528Y81683200D01*
X211059528Y81568914D01*
X209630957Y82197485D02*
X210659528Y80654628D01*
X208373814Y82197485D02*
X209402385Y80654628D01*
X207973814Y81740342D02*
X207973814Y80540342D01*
X207973814Y81683200D02*
X207859528Y81740342D01*
X207630957Y81740342D01*
X207516671Y81683200D01*
X207459528Y81626057D01*
X207402385Y81511771D01*
X207402385Y81168914D01*
X207459528Y81054628D01*
X207516671Y80997485D01*
X207630957Y80940342D01*
X207859528Y80940342D01*
X207973814Y80997485D01*
X207002385Y81740342D02*
X206716671Y80940342D01*
X206430957Y81740342D01*
X205802385Y80940342D02*
X205916671Y80997485D01*
X205973814Y81054628D01*
X206030957Y81168914D01*
X206030957Y81511771D01*
X205973814Y81626057D01*
X205916671Y81683200D01*
X205802385Y81740342D01*
X205630957Y81740342D01*
X205516671Y81683200D01*
X205459528Y81626057D01*
X205402385Y81511771D01*
X205402385Y81168914D01*
X205459528Y81054628D01*
X205516671Y80997485D01*
X205630957Y80940342D01*
X205802385Y80940342D01*
X204945242Y80997485D02*
X204830957Y80940342D01*
X204602385Y80940342D01*
X204488100Y80997485D01*
X204430957Y81111771D01*
X204430957Y81168914D01*
X204488100Y81283200D01*
X204602385Y81340342D01*
X204773814Y81340342D01*
X204888100Y81397485D01*
X204945242Y81511771D01*
X204945242Y81568914D01*
X204888100Y81683200D01*
X204773814Y81740342D01*
X204602385Y81740342D01*
X204488100Y81683200D01*
X203916671Y81054628D02*
X203859528Y80997485D01*
X203916671Y80940342D01*
X203973814Y80997485D01*
X203916671Y81054628D01*
X203916671Y80940342D01*
X203173814Y80940342D02*
X203288100Y80997485D01*
X203345242Y81054628D01*
X203402385Y81168914D01*
X203402385Y81511771D01*
X203345242Y81626057D01*
X203288100Y81683200D01*
X203173814Y81740342D01*
X203002385Y81740342D01*
X202888100Y81683200D01*
X202830957Y81626057D01*
X202773814Y81511771D01*
X202773814Y81168914D01*
X202830957Y81054628D01*
X202888100Y80997485D01*
X203002385Y80940342D01*
X203173814Y80940342D01*
X202259528Y80940342D02*
X202259528Y81740342D01*
X202259528Y81511771D02*
X202202385Y81626057D01*
X202145242Y81683200D01*
X202030957Y81740342D01*
X201916671Y81740342D01*
X201002385Y81740342D02*
X201002385Y80768914D01*
X201059528Y80654628D01*
X201116671Y80597485D01*
X201230957Y80540342D01*
X201402385Y80540342D01*
X201516671Y80597485D01*
X201002385Y80997485D02*
X201116671Y80940342D01*
X201345242Y80940342D01*
X201459528Y80997485D01*
X201516671Y81054628D01*
X201573814Y81168914D01*
X201573814Y81511771D01*
X201516671Y81626057D01*
X201459528Y81683200D01*
X201345242Y81740342D01*
X201116671Y81740342D01*
X201002385Y81683200D01*
X199573814Y82197485D02*
X200602385Y80654628D01*
X198488100Y81054628D02*
X198545242Y80997485D01*
X198716671Y80940342D01*
X198830957Y80940342D01*
X199002385Y80997485D01*
X199116671Y81111771D01*
X199173814Y81226057D01*
X199230957Y81454628D01*
X199230957Y81626057D01*
X199173814Y81854628D01*
X199116671Y81968914D01*
X199002385Y82083200D01*
X198830957Y82140342D01*
X198716671Y82140342D01*
X198545242Y82083200D01*
X198488100Y82026057D01*
X197745242Y82140342D02*
X197516671Y82140342D01*
X197402385Y82083200D01*
X197288100Y81968914D01*
X197230957Y81740342D01*
X197230957Y81340342D01*
X197288100Y81111771D01*
X197402385Y80997485D01*
X197516671Y80940342D01*
X197745242Y80940342D01*
X197859528Y80997485D01*
X197973814Y81111771D01*
X198030957Y81340342D01*
X198030957Y81740342D01*
X197973814Y81968914D01*
X197859528Y82083200D01*
X197745242Y82140342D01*
X196773814Y82026057D02*
X196716671Y82083200D01*
X196602385Y82140342D01*
X196316671Y82140342D01*
X196202385Y82083200D01*
X196145242Y82026057D01*
X196088100Y81911771D01*
X196088100Y81797485D01*
X196145242Y81626057D01*
X196830957Y80940342D01*
X196088100Y80940342D01*
X194716671Y82197485D02*
X195745242Y80654628D01*
X193745242Y80940342D02*
X194316671Y80940342D01*
X194316671Y82140342D01*
X196167000Y-18581714D02*
X196928904Y-18867428D01*
X196167000Y-19153142D01*
X195690809Y-18867428D02*
X194928904Y-18867428D01*
X194452714Y-19248380D02*
X194452714Y-18248380D01*
X194119380Y-18962666D01*
X193786047Y-18248380D01*
X193786047Y-19248380D01*
X193357476Y-18962666D02*
X192881285Y-18962666D01*
X193452714Y-19248380D02*
X193119380Y-18248380D01*
X192786047Y-19248380D01*
X192547952Y-18248380D02*
X191881285Y-19248380D01*
X191881285Y-18248380D02*
X192547952Y-19248380D01*
X190309857Y-18248380D02*
X190500333Y-18248380D01*
X190595571Y-18296000D01*
X190643190Y-18343619D01*
X190738428Y-18486476D01*
X190786047Y-18676952D01*
X190786047Y-19057904D01*
X190738428Y-19153142D01*
X190690809Y-19200761D01*
X190595571Y-19248380D01*
X190405095Y-19248380D01*
X190309857Y-19200761D01*
X190262238Y-19153142D01*
X190214619Y-19057904D01*
X190214619Y-18819809D01*
X190262238Y-18724571D01*
X190309857Y-18676952D01*
X190405095Y-18629333D01*
X190595571Y-18629333D01*
X190690809Y-18676952D01*
X190738428Y-18724571D01*
X190786047Y-18819809D01*
X189928904Y-18248380D02*
X189595571Y-19248380D01*
X189262238Y-18248380D01*
X205689085Y-18196000D02*
X205803371Y-18138857D01*
X205974800Y-18138857D01*
X206146228Y-18196000D01*
X206260514Y-18310285D01*
X206317657Y-18424571D01*
X206374800Y-18653142D01*
X206374800Y-18824571D01*
X206317657Y-19053142D01*
X206260514Y-19167428D01*
X206146228Y-19281714D01*
X205974800Y-19338857D01*
X205860514Y-19338857D01*
X205689085Y-19281714D01*
X205631942Y-19224571D01*
X205631942Y-18824571D01*
X205860514Y-18824571D01*
X205117657Y-19338857D02*
X205117657Y-18138857D01*
X204431942Y-19338857D01*
X204431942Y-18138857D01*
X203860514Y-19338857D02*
X203860514Y-18138857D01*
X203574800Y-18138857D01*
X203403371Y-18196000D01*
X203289085Y-18310285D01*
X203231942Y-18424571D01*
X203174800Y-18653142D01*
X203174800Y-18824571D01*
X203231942Y-19053142D01*
X203289085Y-19167428D01*
X203403371Y-19281714D01*
X203574800Y-19338857D01*
X203860514Y-19338857D01*
X200958285Y-18138857D02*
X200558285Y-19338857D01*
X200158285Y-18138857D01*
X199758285Y-19338857D02*
X199758285Y-18138857D01*
X199186857Y-19338857D02*
X199186857Y-18138857D01*
X198501142Y-19338857D01*
X198501142Y-18138857D01*
X235219657Y6111942D02*
X235619657Y6683371D01*
X235905371Y6111942D02*
X235905371Y7311942D01*
X235448228Y7311942D01*
X235333942Y7254800D01*
X235276800Y7197657D01*
X235219657Y7083371D01*
X235219657Y6911942D01*
X235276800Y6797657D01*
X235333942Y6740514D01*
X235448228Y6683371D01*
X235905371Y6683371D01*
X234705371Y6740514D02*
X234305371Y6740514D01*
X234133942Y6111942D02*
X234705371Y6111942D01*
X234705371Y7311942D01*
X234133942Y7311942D01*
X233676800Y6169085D02*
X233505371Y6111942D01*
X233219657Y6111942D01*
X233105371Y6169085D01*
X233048228Y6226228D01*
X232991085Y6340514D01*
X232991085Y6454800D01*
X233048228Y6569085D01*
X233105371Y6626228D01*
X233219657Y6683371D01*
X233448228Y6740514D01*
X233562514Y6797657D01*
X233619657Y6854800D01*
X233676800Y6969085D01*
X233676800Y7083371D01*
X233619657Y7197657D01*
X233562514Y7254800D01*
X233448228Y7311942D01*
X233162514Y7311942D01*
X232991085Y7254800D01*
X232476800Y6740514D02*
X232076800Y6740514D01*
X231905371Y6111942D02*
X232476800Y6111942D01*
X232476800Y7311942D01*
X231905371Y7311942D01*
X231562514Y7311942D02*
X230876800Y7311942D01*
X231219657Y6111942D02*
X231219657Y7311942D01*
X232689285Y95685000D02*
X232117857Y95685000D01*
X232803571Y95342142D02*
X232403571Y96542142D01*
X232003571Y95342142D01*
X231603571Y95342142D02*
X231603571Y96542142D01*
X230917857Y95342142D01*
X230917857Y96542142D01*
X211573200Y78097142D02*
X211658914Y78011428D01*
X211916057Y77925714D01*
X212087485Y77925714D01*
X212344628Y78011428D01*
X212516057Y78182857D01*
X212601771Y78354285D01*
X212687485Y78697142D01*
X212687485Y78954285D01*
X212601771Y79297142D01*
X212516057Y79468571D01*
X212344628Y79640000D01*
X212087485Y79725714D01*
X211916057Y79725714D01*
X211658914Y79640000D01*
X211573200Y79554285D01*
X210458914Y79725714D02*
X210116057Y79725714D01*
X209944628Y79640000D01*
X209773200Y79468571D01*
X209687485Y79125714D01*
X209687485Y78525714D01*
X209773200Y78182857D01*
X209944628Y78011428D01*
X210116057Y77925714D01*
X210458914Y77925714D01*
X210630342Y78011428D01*
X210801771Y78182857D01*
X210887485Y78525714D01*
X210887485Y79125714D01*
X210801771Y79468571D01*
X210630342Y79640000D01*
X210458914Y79725714D01*
X209001771Y79554285D02*
X208916057Y79640000D01*
X208744628Y79725714D01*
X208316057Y79725714D01*
X208144628Y79640000D01*
X208058914Y79554285D01*
X207973200Y79382857D01*
X207973200Y79211428D01*
X208058914Y78954285D01*
X209087485Y77925714D01*
X207973200Y77925714D01*
X205830342Y77925714D02*
X205830342Y79725714D01*
X205230342Y78440000D01*
X204630342Y79725714D01*
X204630342Y77925714D01*
X203516057Y77925714D02*
X203687485Y78011428D01*
X203773200Y78097142D01*
X203858914Y78268571D01*
X203858914Y78782857D01*
X203773200Y78954285D01*
X203687485Y79040000D01*
X203516057Y79125714D01*
X203258914Y79125714D01*
X203087485Y79040000D01*
X203001771Y78954285D01*
X202916057Y78782857D01*
X202916057Y78268571D01*
X203001771Y78097142D01*
X203087485Y78011428D01*
X203258914Y77925714D01*
X203516057Y77925714D01*
X202144628Y79125714D02*
X202144628Y77925714D01*
X202144628Y78954285D02*
X202058914Y79040000D01*
X201887485Y79125714D01*
X201630342Y79125714D01*
X201458914Y79040000D01*
X201373200Y78868571D01*
X201373200Y77925714D01*
X200516057Y77925714D02*
X200516057Y79125714D01*
X200516057Y79725714D02*
X200601771Y79640000D01*
X200516057Y79554285D01*
X200430342Y79640000D01*
X200516057Y79725714D01*
X200516057Y79554285D01*
X199916057Y79125714D02*
X199230342Y79125714D01*
X199658914Y79725714D02*
X199658914Y78182857D01*
X199573200Y78011428D01*
X199401771Y77925714D01*
X199230342Y77925714D01*
X198373200Y77925714D02*
X198544628Y78011428D01*
X198630342Y78097142D01*
X198716057Y78268571D01*
X198716057Y78782857D01*
X198630342Y78954285D01*
X198544628Y79040000D01*
X198373200Y79125714D01*
X198116057Y79125714D01*
X197944628Y79040000D01*
X197858914Y78954285D01*
X197773200Y78782857D01*
X197773200Y78268571D01*
X197858914Y78097142D01*
X197944628Y78011428D01*
X198116057Y77925714D01*
X198373200Y77925714D01*
X197001771Y77925714D02*
X197001771Y79125714D01*
X197001771Y78782857D02*
X196916057Y78954285D01*
X196830342Y79040000D01*
X196658914Y79125714D01*
X196487485Y79125714D01*
X234938914Y-15194114D02*
X235938914Y-15194114D01*
X235557961Y-15194114D02*
X235605580Y-15098876D01*
X235605580Y-14908400D01*
X235557961Y-14813161D01*
X235510342Y-14765542D01*
X235415104Y-14717923D01*
X235129390Y-14717923D01*
X235034152Y-14765542D01*
X234986533Y-14813161D01*
X234938914Y-14908400D01*
X234938914Y-15098876D01*
X234986533Y-15194114D01*
X234938914Y-15575066D02*
X235605580Y-15765542D01*
X235129390Y-15956019D01*
X235605580Y-16146495D01*
X234938914Y-16336971D01*
X235605580Y-16717923D02*
X234938914Y-16717923D01*
X234605580Y-16717923D02*
X234653200Y-16670304D01*
X234700819Y-16717923D01*
X234653200Y-16765542D01*
X234605580Y-16717923D01*
X234700819Y-16717923D01*
X235605580Y-17194114D02*
X234938914Y-17194114D01*
X234605580Y-17194114D02*
X234653200Y-17146495D01*
X234700819Y-17194114D01*
X234653200Y-17241733D01*
X234605580Y-17194114D01*
X234700819Y-17194114D01*
X235557961Y-18098876D02*
X235605580Y-18003638D01*
X235605580Y-17813161D01*
X235557961Y-17717923D01*
X235510342Y-17670304D01*
X235415104Y-17622685D01*
X235129390Y-17622685D01*
X235034152Y-17670304D01*
X234986533Y-17717923D01*
X234938914Y-17813161D01*
X234938914Y-18003638D01*
X234986533Y-18098876D01*
X231471600Y66197219D02*
X231471600Y67197219D01*
X231233504Y67197219D01*
X231090647Y67149600D01*
X230995409Y67054361D01*
X230947790Y66959123D01*
X230900171Y66768647D01*
X230900171Y66625790D01*
X230947790Y66435314D01*
X230995409Y66340076D01*
X231090647Y66244838D01*
X231233504Y66197219D01*
X231471600Y66197219D01*
X230471600Y66197219D02*
X230471600Y67197219D01*
X229804933Y67197219D02*
X229614457Y67197219D01*
X229519219Y67149600D01*
X229423980Y67054361D01*
X229376361Y66863885D01*
X229376361Y66530552D01*
X229423980Y66340076D01*
X229519219Y66244838D01*
X229614457Y66197219D01*
X229804933Y66197219D01*
X229900171Y66244838D01*
X229995409Y66340076D01*
X230043028Y66530552D01*
X230043028Y66863885D01*
X229995409Y67054361D01*
X229900171Y67149600D01*
X229804933Y67197219D01*
X228423980Y66197219D02*
X228995409Y66197219D01*
X228709695Y66197219D02*
X228709695Y67197219D01*
X228804933Y67054361D01*
X228900171Y66959123D01*
X228995409Y66911504D01*
X224488285Y66533733D02*
X224012095Y66533733D01*
X224583523Y66248019D02*
X224250190Y67248019D01*
X223916857Y66248019D01*
X223393047Y67248019D02*
X223297809Y67248019D01*
X223202571Y67200400D01*
X223154952Y67152780D01*
X223107333Y67057542D01*
X223059714Y66867066D01*
X223059714Y66628971D01*
X223107333Y66438495D01*
X223154952Y66343257D01*
X223202571Y66295638D01*
X223297809Y66248019D01*
X223393047Y66248019D01*
X223488285Y66295638D01*
X223535904Y66343257D01*
X223583523Y66438495D01*
X223631142Y66628971D01*
X223631142Y66867066D01*
X223583523Y67057542D01*
X223535904Y67152780D01*
X223488285Y67200400D01*
X223393047Y67248019D01*
X236943876Y92791019D02*
X236753400Y92791019D01*
X236658161Y92838638D01*
X236610542Y92886257D01*
X236515304Y93029114D01*
X236467685Y93219590D01*
X236467685Y93600542D01*
X236515304Y93695780D01*
X236562923Y93743400D01*
X236658161Y93791019D01*
X236848638Y93791019D01*
X236943876Y93743400D01*
X236991495Y93695780D01*
X237039114Y93600542D01*
X237039114Y93362447D01*
X236991495Y93267209D01*
X236943876Y93219590D01*
X236848638Y93171971D01*
X236658161Y93171971D01*
X236562923Y93219590D01*
X236515304Y93267209D01*
X236467685Y93362447D01*
X232940076Y93178333D02*
X232463885Y93178333D01*
X233035314Y92892619D02*
X232701980Y93892619D01*
X232368647Y92892619D01*
X232035314Y92892619D02*
X232035314Y93892619D01*
X231463885Y92892619D01*
X231463885Y93892619D01*
X231035314Y93178333D02*
X230559123Y93178333D01*
X231130552Y92892619D02*
X230797219Y93892619D01*
X230463885Y92892619D01*
X245233676Y4419533D02*
X244662247Y4419533D01*
X244947961Y3419533D02*
X244947961Y4419533D01*
X244424152Y4419533D02*
X243757485Y3419533D01*
X243757485Y4419533D02*
X244424152Y3419533D01*
X242852723Y3419533D02*
X243424152Y3419533D01*
X243138438Y3419533D02*
X243138438Y4419533D01*
X243233676Y4276675D01*
X243328914Y4181437D01*
X243424152Y4133818D01*
X244757486Y887471D02*
X245090819Y1363661D01*
X245328914Y887471D02*
X245328914Y1887471D01*
X244947962Y1887471D01*
X244852724Y1839852D01*
X244805105Y1792232D01*
X244757486Y1696994D01*
X244757486Y1554137D01*
X244805105Y1458899D01*
X244852724Y1411280D01*
X244947962Y1363661D01*
X245328914Y1363661D01*
X244424152Y1887471D02*
X243757486Y887471D01*
X243757486Y1887471D02*
X244424152Y887471D01*
X243186057Y1887471D02*
X243090819Y1887471D01*
X242995581Y1839852D01*
X242947962Y1792232D01*
X242900343Y1696994D01*
X242852724Y1506518D01*
X242852724Y1268423D01*
X242900343Y1077947D01*
X242947962Y982709D01*
X242995581Y935090D01*
X243090819Y887471D01*
X243186057Y887471D01*
X243281295Y935090D01*
X243328914Y982709D01*
X243376533Y1077947D01*
X243424152Y1268423D01*
X243424152Y1506518D01*
X243376533Y1696994D01*
X243328914Y1792232D01*
X243281295Y1839852D01*
X243186057Y1887471D01*
X219763423Y101461142D02*
X219815804Y101408761D01*
X219972947Y101356380D01*
X220077709Y101356380D01*
X220234852Y101408761D01*
X220339614Y101513523D01*
X220391995Y101618285D01*
X220444376Y101827809D01*
X220444376Y101984952D01*
X220391995Y102194476D01*
X220339614Y102299238D01*
X220234852Y102404000D01*
X220077709Y102456380D01*
X219972947Y102456380D01*
X219815804Y102404000D01*
X219763423Y102351619D01*
X219082471Y102456380D02*
X218872947Y102456380D01*
X218768185Y102404000D01*
X218663423Y102299238D01*
X218611042Y102089714D01*
X218611042Y101723047D01*
X218663423Y101513523D01*
X218768185Y101408761D01*
X218872947Y101356380D01*
X219082471Y101356380D01*
X219187233Y101408761D01*
X219291995Y101513523D01*
X219344376Y101723047D01*
X219344376Y102089714D01*
X219291995Y102299238D01*
X219187233Y102404000D01*
X219082471Y102456380D01*
X218191995Y102351619D02*
X218139614Y102404000D01*
X218034852Y102456380D01*
X217772947Y102456380D01*
X217668185Y102404000D01*
X217615804Y102351619D01*
X217563423Y102246857D01*
X217563423Y102142095D01*
X217615804Y101984952D01*
X218244376Y101356380D01*
X217563423Y101356380D01*
X215625328Y101356380D02*
X215991995Y101880190D01*
X216253900Y101356380D02*
X216253900Y102456380D01*
X215834852Y102456380D01*
X215730090Y102404000D01*
X215677709Y102351619D01*
X215625328Y102246857D01*
X215625328Y102089714D01*
X215677709Y101984952D01*
X215730090Y101932571D01*
X215834852Y101880190D01*
X216253900Y101880190D01*
X215153900Y101932571D02*
X214787233Y101932571D01*
X214630090Y101356380D02*
X215153900Y101356380D01*
X215153900Y102456380D01*
X214630090Y102456380D01*
X214315804Y102456380D02*
X213949138Y101356380D01*
X213582471Y102456380D01*
X211853900Y101356380D02*
X212377709Y101356380D01*
X212377709Y102456380D01*
X229575942Y87222114D02*
X230175942Y88079257D01*
X230604514Y87222114D02*
X230604514Y89022114D01*
X229918800Y89022114D01*
X229747371Y88936400D01*
X229661657Y88850685D01*
X229575942Y88679257D01*
X229575942Y88422114D01*
X229661657Y88250685D01*
X229747371Y88164971D01*
X229918800Y88079257D01*
X230604514Y88079257D01*
X228204514Y88164971D02*
X228804514Y88164971D01*
X228804514Y87222114D02*
X228804514Y89022114D01*
X227947371Y89022114D01*
X227261657Y87222114D02*
X227261657Y89022114D01*
X226661657Y87736400D01*
X226061657Y89022114D01*
X226061657Y87222114D01*
X225118800Y87222114D02*
X224775942Y87222114D01*
X224604514Y87307828D01*
X224518800Y87393542D01*
X224347371Y87650685D01*
X224261657Y87993542D01*
X224261657Y88679257D01*
X224347371Y88850685D01*
X224433085Y88936400D01*
X224604514Y89022114D01*
X224947371Y89022114D01*
X225118800Y88936400D01*
X225204514Y88850685D01*
X225290228Y88679257D01*
X225290228Y88250685D01*
X225204514Y88079257D01*
X225118800Y87993542D01*
X224947371Y87907828D01*
X224604514Y87907828D01*
X224433085Y87993542D01*
X224347371Y88079257D01*
X224261657Y88250685D01*
X223661657Y89022114D02*
X222461657Y87222114D01*
X222461657Y89022114D02*
X223661657Y87222114D01*
X221002142Y-18779714D02*
X221002142Y-19351142D01*
X220430714Y-19408285D01*
X220487857Y-19351142D01*
X220545000Y-19236857D01*
X220545000Y-18951142D01*
X220487857Y-18836857D01*
X220430714Y-18779714D01*
X220316428Y-18722571D01*
X220030714Y-18722571D01*
X219916428Y-18779714D01*
X219859285Y-18836857D01*
X219802142Y-18951142D01*
X219802142Y-19236857D01*
X219859285Y-19351142D01*
X219916428Y-19408285D01*
X221002142Y-18379714D02*
X219802142Y-17979714D01*
X221002142Y-17579714D01*
X219802142Y-16265428D02*
X221002142Y-16265428D01*
X219802142Y-15694000D02*
X221002142Y-15694000D01*
X219802142Y-15008285D01*
X221002142Y-15008285D01*
X219802142Y-14436857D02*
X221002142Y-14436857D01*
X221002142Y-13979714D01*
X220945000Y-13865428D01*
X220887857Y-13808285D01*
X220773571Y-13751142D01*
X220602142Y-13751142D01*
X220487857Y-13808285D01*
X220430714Y-13865428D01*
X220373571Y-13979714D01*
X220373571Y-14436857D01*
X221002142Y-13236857D02*
X220030714Y-13236857D01*
X219916428Y-13179714D01*
X219859285Y-13122571D01*
X219802142Y-13008285D01*
X219802142Y-12779714D01*
X219859285Y-12665428D01*
X219916428Y-12608285D01*
X220030714Y-12551142D01*
X221002142Y-12551142D01*
X221002142Y-12151142D02*
X221002142Y-11465428D01*
X219802142Y-11808285D02*
X221002142Y-11808285D01*
X229666400Y68494342D02*
X230237828Y68494342D01*
X230237828Y69694342D01*
X229037828Y69694342D02*
X228809257Y69694342D01*
X228694971Y69637200D01*
X228580685Y69522914D01*
X228523542Y69294342D01*
X228523542Y68894342D01*
X228580685Y68665771D01*
X228694971Y68551485D01*
X228809257Y68494342D01*
X229037828Y68494342D01*
X229152114Y68551485D01*
X229266400Y68665771D01*
X229323542Y68894342D01*
X229323542Y69294342D01*
X229266400Y69522914D01*
X229152114Y69637200D01*
X229037828Y69694342D01*
X227323542Y68494342D02*
X227723542Y69065771D01*
X228009257Y68494342D02*
X228009257Y69694342D01*
X227552114Y69694342D01*
X227437828Y69637200D01*
X227380685Y69580057D01*
X227323542Y69465771D01*
X227323542Y69294342D01*
X227380685Y69180057D01*
X227437828Y69122914D01*
X227552114Y69065771D01*
X228009257Y69065771D01*
X226866400Y68837200D02*
X226294971Y68837200D01*
X226980685Y68494342D02*
X226580685Y69694342D01*
X226180685Y68494342D01*
X225894971Y69694342D02*
X225609257Y68494342D01*
X225380685Y69351485D01*
X225152114Y68494342D01*
X224866400Y69694342D01*
X224466400Y68837200D02*
X223894971Y68837200D01*
X224580685Y68494342D02*
X224180685Y69694342D01*
X223780685Y68494342D01*
X223380685Y68494342D02*
X223380685Y69694342D01*
X222694971Y68494342D01*
X222694971Y69694342D01*
X245281295Y8539214D02*
X245138438Y8491595D01*
X244900343Y8491595D01*
X244805105Y8539214D01*
X244757486Y8586833D01*
X244709867Y8682071D01*
X244709867Y8777309D01*
X244757486Y8872547D01*
X244805105Y8920166D01*
X244900343Y8967785D01*
X245090819Y9015404D01*
X245186057Y9063023D01*
X245233676Y9110642D01*
X245281295Y9205880D01*
X245281295Y9301118D01*
X245233676Y9396356D01*
X245186057Y9443976D01*
X245090819Y9491595D01*
X244852724Y9491595D01*
X244709867Y9443976D01*
X244281295Y8491595D02*
X244281295Y9491595D01*
X244043200Y9491595D01*
X243900343Y9443976D01*
X243805105Y9348737D01*
X243757486Y9253499D01*
X243709867Y9063023D01*
X243709867Y8920166D01*
X243757486Y8729690D01*
X243805105Y8634452D01*
X243900343Y8539214D01*
X244043200Y8491595D01*
X244281295Y8491595D01*
X243328914Y8777309D02*
X242852724Y8777309D01*
X243424152Y8491595D02*
X243090819Y9491595D01*
X242757486Y8491595D01*
X244947961Y-5799200D02*
X245043199Y-5751580D01*
X245186057Y-5751580D01*
X245328914Y-5799200D01*
X245424152Y-5894438D01*
X245471771Y-5989676D01*
X245519390Y-6180152D01*
X245519390Y-6323009D01*
X245471771Y-6513485D01*
X245424152Y-6608723D01*
X245328914Y-6703961D01*
X245186057Y-6751580D01*
X245090818Y-6751580D01*
X244947961Y-6703961D01*
X244900342Y-6656342D01*
X244900342Y-6323009D01*
X245090818Y-6323009D01*
X244471771Y-6751580D02*
X244471771Y-5751580D01*
X243900342Y-6751580D01*
X243900342Y-5751580D01*
X243424152Y-6751580D02*
X243424152Y-5751580D01*
X243186057Y-5751580D01*
X243043199Y-5799200D01*
X242947961Y-5894438D01*
X242900342Y-5989676D01*
X242852723Y-6180152D01*
X242852723Y-6323009D01*
X242900342Y-6513485D01*
X242947961Y-6608723D01*
X243043199Y-6703961D01*
X243186057Y-6751580D01*
X243424152Y-6751580D01*
X188537790Y69618266D02*
X187585409Y69618266D01*
X188728266Y69046838D02*
X188061600Y71046838D01*
X187394933Y69046838D01*
X244947962Y-773180D02*
X244614628Y-1773180D01*
X244281295Y-773180D01*
X243947962Y-1773180D02*
X243947962Y-773180D01*
X243947962Y-1249371D02*
X243376533Y-1249371D01*
X243376533Y-1773180D02*
X243376533Y-773180D01*
X242900343Y-1773180D02*
X242900343Y-773180D01*
X244328914Y-3168714D02*
X243709867Y-3168714D01*
X244043200Y-3549667D01*
X243900343Y-3549667D01*
X243805105Y-3597286D01*
X243757486Y-3644905D01*
X243709867Y-3740143D01*
X243709867Y-3978238D01*
X243757486Y-4073476D01*
X243805105Y-4121095D01*
X243900343Y-4168714D01*
X244186057Y-4168714D01*
X244281295Y-4121095D01*
X244328914Y-4073476D01*
X243424152Y-3168714D02*
X243090819Y-4168714D01*
X242757486Y-3168714D01*
D11*
%TO.C,J6*%
X244047000Y21804400D02*
X241547000Y21804400D01*
X241547000Y21804400D02*
X241547000Y20754400D01*
X241547000Y20754400D02*
X240557000Y20754400D01*
X244047000Y15584400D02*
X241547000Y15584400D01*
X241547000Y15584400D02*
X241547000Y16634400D01*
X246017000Y20634400D02*
X246017000Y16754400D01*
%TO.C,SW2*%
X232476800Y21700800D02*
G75*
G03*
X234476800Y21700800I1000000J0D01*
G01*
X230826800Y21700800D02*
X232476800Y21700800D01*
X230826800Y13960800D02*
X230826800Y21700800D01*
X236126800Y13960800D02*
X230826800Y13960800D01*
X236126800Y21700800D02*
X236126800Y13960800D01*
X234476800Y21700800D02*
X236126800Y21700800D01*
%TO.C,R23*%
X215525533Y27277600D02*
X215868067Y27277600D01*
X215525533Y28297600D02*
X215868067Y28297600D01*
%TO.C,R21*%
X216528467Y3710400D02*
X216185933Y3710400D01*
X216528467Y2690400D02*
X216185933Y2690400D01*
%TO.C,R19*%
X215728733Y22553200D02*
X216071267Y22553200D01*
X215728733Y23573200D02*
X216071267Y23573200D01*
%TO.C,R17*%
X216477667Y8485600D02*
X216135133Y8485600D01*
X216477667Y7465600D02*
X216135133Y7465600D01*
%TO.C,C7*%
X187890333Y37543200D02*
X188232867Y37543200D01*
X187890333Y36523200D02*
X188232867Y36523200D01*
%TO.C,C6*%
X187636333Y62841600D02*
X187978867Y62841600D01*
X187636333Y61821600D02*
X187978867Y61821600D01*
D12*
%TO.C,U2*%
X188850000Y-8267600D02*
X188850000Y-6667600D01*
X192150000Y-8267600D02*
X192150000Y-6667600D01*
X190100000Y-8517600D02*
X190900000Y-8517600D01*
D11*
%TO.C,J4*%
X218481600Y-4589600D02*
X219531600Y-4589600D01*
X219531600Y-5639600D02*
X219531600Y-4589600D01*
X210131600Y-10689600D02*
X210131600Y-19489600D01*
X210131600Y-19489600D02*
X219331600Y-19489600D01*
X212831600Y-4789600D02*
X210131600Y-4789600D01*
X210131600Y-4789600D02*
X210131600Y-6689600D01*
X219331600Y-19489600D02*
X219331600Y-4789600D01*
X219331600Y-4789600D02*
X216731600Y-4789600D01*
%TO.C,SW3*%
X234852800Y4490400D02*
X232172800Y4490400D01*
X232172800Y-1749600D02*
X234852800Y-1749600D01*
X236632800Y-1599600D02*
X236632800Y4340400D01*
X230392800Y-1599600D02*
X230392800Y4340400D01*
X234927014Y1370400D02*
G75*
G03*
X234927014Y1370400I-1414214J0D01*
G01*
%TO.C,J7*%
X207574800Y-18000000D02*
X207174800Y-18000000D01*
X207574800Y-17360000D02*
X207574800Y-18000000D01*
X201032800Y-13692000D02*
X201427800Y-14088000D01*
X198386800Y-11046000D02*
X198766800Y-11426000D01*
X200781800Y-13974000D02*
X201161800Y-14354000D01*
X198120800Y-11312000D02*
X198515800Y-11708000D01*
X206322800Y-13981000D02*
X206428800Y-14088000D01*
X203386800Y-11046000D02*
X203493800Y-11153000D01*
X206056800Y-14247000D02*
X206162800Y-14354000D01*
X203120800Y-11312000D02*
X203227800Y-11419000D01*
X197214800Y-8640000D02*
X197214800Y-17760000D01*
X207334800Y-8640000D02*
X207334800Y-17760000D01*
X207334800Y-17760000D02*
X197214800Y-17760000D01*
X207334800Y-8640000D02*
X197214800Y-8640000D01*
X207334800Y-16200000D02*
X197214800Y-16200000D01*
X207334800Y-17300000D02*
X197214800Y-17300000D01*
X201954800Y-12700000D02*
G75*
G03*
X201954800Y-12700000I-2180000J0D01*
G01*
X206954800Y-12700000D02*
G75*
G03*
X206954800Y-12700000I-2180000J0D01*
G01*
D10*
%TO.C,J15*%
X230866000Y57334200D02*
X230866000Y45384200D01*
X242316000Y45384200D02*
X230866000Y45384200D01*
X242316000Y57334200D02*
X230866000Y57334200D01*
X240516000Y56134200D02*
X240516000Y46634200D01*
X242316000Y57334200D02*
X242316000Y56884200D01*
X242066000Y56634200D02*
X241066000Y56634200D01*
X242066000Y46134200D02*
X241066000Y46134200D01*
X242316000Y45884200D02*
X242316000Y45384200D01*
X242816000Y56884200D02*
X246166000Y56884200D01*
X246666000Y56384200D02*
X246666000Y46384200D01*
X246166000Y45884200D02*
X242816000Y45884200D01*
X246666000Y46384200D02*
G75*
G02*
X246166000Y45884200I-500000J0D01*
G01*
X246166000Y56884200D02*
G75*
G02*
X246666000Y56384200I0J-500000D01*
G01*
X240566000Y56134200D02*
G75*
G02*
X241066000Y56634200I500000J0D01*
G01*
X242316000Y56884200D02*
G75*
G02*
X242066000Y56634200I-250000J0D01*
G01*
X241066000Y46134200D02*
G75*
G02*
X240566000Y46634200I0J500000D01*
G01*
X242066000Y46134200D02*
G75*
G02*
X242316000Y45884200I0J-250000D01*
G01*
D11*
%TO.C,R15*%
X219712000Y49257133D02*
X219712000Y49599667D01*
X218692000Y49257133D02*
X218692000Y49599667D01*
%TO.C,D1*%
X200420800Y-5451600D02*
X196520800Y-5451600D01*
X200420800Y-7451600D02*
X196520800Y-7451600D01*
X200420800Y-5451600D02*
X200420800Y-7451600D01*
%TO.C,C5*%
X228987533Y60149200D02*
X229330067Y60149200D01*
X228987533Y59129200D02*
X229330067Y59129200D01*
%TO.C,R5*%
X224207800Y49399933D02*
X224207800Y49742467D01*
X223187800Y49399933D02*
X223187800Y49742467D01*
%TO.C,R3*%
X212823533Y64412400D02*
X213166067Y64412400D01*
X212823533Y65432400D02*
X213166067Y65432400D01*
%TO.C,R1*%
X212823533Y68552600D02*
X213166067Y68552600D01*
X212823533Y69572600D02*
X213166067Y69572600D01*
%TO.C,C1*%
X202673133Y-5992400D02*
X203015667Y-5992400D01*
X202673133Y-7012400D02*
X203015667Y-7012400D01*
%TO.C,R11*%
X200793533Y70660800D02*
X201136067Y70660800D01*
X200793533Y71680800D02*
X201136067Y71680800D01*
%TO.C,R10*%
X193596800Y-7753533D02*
X193596800Y-8096067D01*
X194616800Y-7753533D02*
X194616800Y-8096067D01*
%TO.C,R9*%
X206876467Y-6199600D02*
X206533933Y-6199600D01*
X206876467Y-5179600D02*
X206533933Y-5179600D01*
%TO.C,C4*%
X186942000Y-7537267D02*
X186942000Y-7194733D01*
X187962000Y-7537267D02*
X187962000Y-7194733D01*
%TO.C,C3*%
X188588467Y861600D02*
X188245933Y861600D01*
X188588467Y1881600D02*
X188245933Y1881600D01*
%TO.C,C2*%
X188486867Y5027200D02*
X188144333Y5027200D01*
X188486867Y6047200D02*
X188144333Y6047200D01*
D10*
%TO.C,X1*%
X185217600Y41241200D02*
X185217600Y59241200D01*
X210717600Y41241200D02*
X210717600Y59241200D01*
X185217600Y41241200D02*
X210717600Y41241200D01*
X185217600Y59241200D02*
X210717600Y59241200D01*
X191217600Y41241200D02*
X191217600Y59241200D01*
D13*
X191647581Y60147200D02*
G75*
G03*
X191647581Y60147200I-283981J0D01*
G01*
D14*
%TO.C,IC1*%
X202183600Y65884800D02*
X202089600Y65884800D01*
X199433600Y65884800D02*
X199339600Y65884800D01*
X199339600Y64264800D02*
X199433600Y64264800D01*
X202089600Y64264800D02*
X202183600Y64264800D01*
X200239600Y64264800D02*
X200333600Y64264800D01*
X201189600Y64264800D02*
X201283600Y64264800D01*
X201283600Y65884800D02*
X200239600Y65884800D01*
X202183600Y64264800D02*
X202183600Y65884800D01*
X199339600Y65884800D02*
X199339600Y64264800D01*
D12*
%TO.C,EC1*%
X198187400Y88315800D02*
G75*
G03*
X198187400Y88315800I-143600J0D01*
G01*
D14*
X200837400Y87757200D02*
X197231400Y87757200D01*
X197231400Y92481200D02*
X200837400Y92481200D01*
D11*
%TO.C,JP1*%
X227917200Y65751200D02*
X227917200Y67751200D01*
X225117200Y65751200D02*
X227917200Y65751200D01*
X225117200Y67751200D02*
X225117200Y65751200D01*
X227917200Y67751200D02*
X225117200Y67751200D01*
D15*
%TO.C,U1*%
X219049600Y94248000D02*
X219049600Y94048000D01*
X235049600Y94248000D02*
X219049600Y94248000D01*
X235049600Y94048000D02*
X235049600Y94248000D01*
X235049600Y92048000D02*
X235049600Y92448000D01*
X235049600Y90048000D02*
X235049600Y90448000D01*
X235049600Y88048000D02*
X235049600Y88448000D01*
X235049600Y86048000D02*
X235049600Y86448000D01*
X235049600Y84048000D02*
X235049600Y84448000D01*
X235049600Y82048000D02*
X235049600Y82448000D01*
X235049600Y80048000D02*
X235049600Y80448000D01*
X235049600Y78248000D02*
X235049600Y78448000D01*
X219049600Y92048000D02*
X219049600Y92448000D01*
X219049600Y78448000D02*
X219049600Y78248000D01*
X218049600Y78448000D02*
X219049600Y78448000D01*
X219049600Y80448000D02*
X219049600Y80048000D01*
X219049600Y82448000D02*
X219049600Y82048000D01*
X219049600Y84048000D02*
X219049600Y84448000D01*
X219049600Y86048000D02*
X219049600Y86448000D01*
X219049600Y88048000D02*
X219049600Y88448000D01*
X219049600Y90048000D02*
X219049600Y90448000D01*
X219049600Y78248000D02*
X235049600Y78248000D01*
D11*
%TO.C,J11*%
X232521200Y-18839400D02*
X228641200Y-18839400D01*
X227471200Y-14369400D02*
X228521200Y-14369400D01*
X227471200Y-16869400D02*
X227471200Y-14369400D01*
X232641200Y-14369400D02*
X232641200Y-13379400D01*
X233691200Y-14369400D02*
X232641200Y-14369400D01*
X233691200Y-16869400D02*
X233691200Y-14369400D01*
%TO.C,SW1*%
X194744214Y70204400D02*
G75*
G03*
X194744214Y70204400I-1414214J0D01*
G01*
X190210000Y67234400D02*
X190210000Y73174400D01*
X196450000Y67234400D02*
X196450000Y73174400D01*
X191990000Y67084400D02*
X194670000Y67084400D01*
X194670000Y73324400D02*
X191990000Y73324400D01*
%TO.C,J6*%
D10*
X243766933Y14924019D02*
X243766933Y14209733D01*
X243814552Y14066876D01*
X243909790Y13971638D01*
X244052647Y13924019D01*
X244147885Y13924019D01*
X242862171Y14924019D02*
X243052647Y14924019D01*
X243147885Y14876400D01*
X243195504Y14828780D01*
X243290742Y14685923D01*
X243338361Y14495447D01*
X243338361Y14114495D01*
X243290742Y14019257D01*
X243243123Y13971638D01*
X243147885Y13924019D01*
X242957409Y13924019D01*
X242862171Y13971638D01*
X242814552Y14019257D01*
X242766933Y14114495D01*
X242766933Y14352590D01*
X242814552Y14447828D01*
X242862171Y14495447D01*
X242957409Y14543066D01*
X243147885Y14543066D01*
X243243123Y14495447D01*
X243290742Y14447828D01*
X243338361Y14352590D01*
%TO.C,SW2*%
X234759333Y12447638D02*
X234616476Y12400019D01*
X234378380Y12400019D01*
X234283142Y12447638D01*
X234235523Y12495257D01*
X234187904Y12590495D01*
X234187904Y12685733D01*
X234235523Y12780971D01*
X234283142Y12828590D01*
X234378380Y12876209D01*
X234568857Y12923828D01*
X234664095Y12971447D01*
X234711714Y13019066D01*
X234759333Y13114304D01*
X234759333Y13209542D01*
X234711714Y13304780D01*
X234664095Y13352400D01*
X234568857Y13400019D01*
X234330761Y13400019D01*
X234187904Y13352400D01*
X233854571Y13400019D02*
X233616476Y12400019D01*
X233426000Y13114304D01*
X233235523Y12400019D01*
X232997428Y13400019D01*
X232664095Y13304780D02*
X232616476Y13352400D01*
X232521238Y13400019D01*
X232283142Y13400019D01*
X232187904Y13352400D01*
X232140285Y13304780D01*
X232092666Y13209542D01*
X232092666Y13114304D01*
X232140285Y12971447D01*
X232711714Y12400019D01*
X232092666Y12400019D01*
%TO.C,R23*%
X216339657Y28851619D02*
X216672990Y29327809D01*
X216911085Y28851619D02*
X216911085Y29851619D01*
X216530133Y29851619D01*
X216434895Y29804000D01*
X216387276Y29756380D01*
X216339657Y29661142D01*
X216339657Y29518285D01*
X216387276Y29423047D01*
X216434895Y29375428D01*
X216530133Y29327809D01*
X216911085Y29327809D01*
X215958704Y29756380D02*
X215911085Y29804000D01*
X215815847Y29851619D01*
X215577752Y29851619D01*
X215482514Y29804000D01*
X215434895Y29756380D01*
X215387276Y29661142D01*
X215387276Y29565904D01*
X215434895Y29423047D01*
X216006323Y28851619D01*
X215387276Y28851619D01*
X215053942Y29851619D02*
X214434895Y29851619D01*
X214768228Y29470666D01*
X214625371Y29470666D01*
X214530133Y29423047D01*
X214482514Y29375428D01*
X214434895Y29280190D01*
X214434895Y29042095D01*
X214482514Y28946857D01*
X214530133Y28899238D01*
X214625371Y28851619D01*
X214911085Y28851619D01*
X215006323Y28899238D01*
X215053942Y28946857D01*
%TO.C,R21*%
X217000057Y4322819D02*
X217333390Y4799009D01*
X217571485Y4322819D02*
X217571485Y5322819D01*
X217190533Y5322819D01*
X217095295Y5275200D01*
X217047676Y5227580D01*
X217000057Y5132342D01*
X217000057Y4989485D01*
X217047676Y4894247D01*
X217095295Y4846628D01*
X217190533Y4799009D01*
X217571485Y4799009D01*
X216619104Y5227580D02*
X216571485Y5275200D01*
X216476247Y5322819D01*
X216238152Y5322819D01*
X216142914Y5275200D01*
X216095295Y5227580D01*
X216047676Y5132342D01*
X216047676Y5037104D01*
X216095295Y4894247D01*
X216666723Y4322819D01*
X216047676Y4322819D01*
X215095295Y4322819D02*
X215666723Y4322819D01*
X215381009Y4322819D02*
X215381009Y5322819D01*
X215476247Y5179961D01*
X215571485Y5084723D01*
X215666723Y5037104D01*
%TO.C,R19*%
X216542857Y24127219D02*
X216876190Y24603409D01*
X217114285Y24127219D02*
X217114285Y25127219D01*
X216733333Y25127219D01*
X216638095Y25079600D01*
X216590476Y25031980D01*
X216542857Y24936742D01*
X216542857Y24793885D01*
X216590476Y24698647D01*
X216638095Y24651028D01*
X216733333Y24603409D01*
X217114285Y24603409D01*
X215590476Y24127219D02*
X216161904Y24127219D01*
X215876190Y24127219D02*
X215876190Y25127219D01*
X215971428Y24984361D01*
X216066666Y24889123D01*
X216161904Y24841504D01*
X215114285Y24127219D02*
X214923809Y24127219D01*
X214828571Y24174838D01*
X214780952Y24222457D01*
X214685714Y24365314D01*
X214638095Y24555790D01*
X214638095Y24936742D01*
X214685714Y25031980D01*
X214733333Y25079600D01*
X214828571Y25127219D01*
X215019047Y25127219D01*
X215114285Y25079600D01*
X215161904Y25031980D01*
X215209523Y24936742D01*
X215209523Y24698647D01*
X215161904Y24603409D01*
X215114285Y24555790D01*
X215019047Y24508171D01*
X214828571Y24508171D01*
X214733333Y24555790D01*
X214685714Y24603409D01*
X214638095Y24698647D01*
%TO.C,R17*%
X216746057Y9047219D02*
X217079390Y9523409D01*
X217317485Y9047219D02*
X217317485Y10047219D01*
X216936533Y10047219D01*
X216841295Y9999600D01*
X216793676Y9951980D01*
X216746057Y9856742D01*
X216746057Y9713885D01*
X216793676Y9618647D01*
X216841295Y9571028D01*
X216936533Y9523409D01*
X217317485Y9523409D01*
X215793676Y9047219D02*
X216365104Y9047219D01*
X216079390Y9047219D02*
X216079390Y10047219D01*
X216174628Y9904361D01*
X216269866Y9809123D01*
X216365104Y9761504D01*
X215460342Y10047219D02*
X214793676Y10047219D01*
X215222247Y9047219D01*
%TO.C,C7*%
X188279066Y38504857D02*
X188326685Y38457238D01*
X188469542Y38409619D01*
X188564780Y38409619D01*
X188707638Y38457238D01*
X188802876Y38552476D01*
X188850495Y38647714D01*
X188898114Y38838190D01*
X188898114Y38981047D01*
X188850495Y39171523D01*
X188802876Y39266761D01*
X188707638Y39362000D01*
X188564780Y39409619D01*
X188469542Y39409619D01*
X188326685Y39362000D01*
X188279066Y39314380D01*
X187945733Y39409619D02*
X187279066Y39409619D01*
X187707638Y38409619D01*
%TO.C,C6*%
X187872666Y63549257D02*
X187920285Y63501638D01*
X188063142Y63454019D01*
X188158380Y63454019D01*
X188301238Y63501638D01*
X188396476Y63596876D01*
X188444095Y63692114D01*
X188491714Y63882590D01*
X188491714Y64025447D01*
X188444095Y64215923D01*
X188396476Y64311161D01*
X188301238Y64406400D01*
X188158380Y64454019D01*
X188063142Y64454019D01*
X187920285Y64406400D01*
X187872666Y64358780D01*
X187015523Y64454019D02*
X187206000Y64454019D01*
X187301238Y64406400D01*
X187348857Y64358780D01*
X187444095Y64215923D01*
X187491714Y64025447D01*
X187491714Y63644495D01*
X187444095Y63549257D01*
X187396476Y63501638D01*
X187301238Y63454019D01*
X187110761Y63454019D01*
X187015523Y63501638D01*
X186967904Y63549257D01*
X186920285Y63644495D01*
X186920285Y63882590D01*
X186967904Y63977828D01*
X187015523Y64025447D01*
X187110761Y64073066D01*
X187301238Y64073066D01*
X187396476Y64025447D01*
X187444095Y63977828D01*
X187491714Y63882590D01*
%TO.C,U2*%
X191231204Y-3981580D02*
X191231204Y-4791104D01*
X191183585Y-4886342D01*
X191135966Y-4933961D01*
X191040728Y-4981580D01*
X190850252Y-4981580D01*
X190755014Y-4933961D01*
X190707395Y-4886342D01*
X190659776Y-4791104D01*
X190659776Y-3981580D01*
X190231204Y-4076819D02*
X190183585Y-4029200D01*
X190088347Y-3981580D01*
X189850252Y-3981580D01*
X189755014Y-4029200D01*
X189707395Y-4076819D01*
X189659776Y-4172057D01*
X189659776Y-4267295D01*
X189707395Y-4410152D01*
X190278823Y-4981580D01*
X189659776Y-4981580D01*
%TO.C,J4*%
X211915333Y-17740380D02*
X211915333Y-18454666D01*
X211962952Y-18597523D01*
X212058190Y-18692761D01*
X212201047Y-18740380D01*
X212296285Y-18740380D01*
X211010571Y-18073714D02*
X211010571Y-18740380D01*
X211248666Y-17692761D02*
X211486761Y-18407047D01*
X210867714Y-18407047D01*
%TO.C,SW3*%
X234759333Y-3960761D02*
X234616476Y-4008380D01*
X234378380Y-4008380D01*
X234283142Y-3960761D01*
X234235523Y-3913142D01*
X234187904Y-3817904D01*
X234187904Y-3722666D01*
X234235523Y-3627428D01*
X234283142Y-3579809D01*
X234378380Y-3532190D01*
X234568857Y-3484571D01*
X234664095Y-3436952D01*
X234711714Y-3389333D01*
X234759333Y-3294095D01*
X234759333Y-3198857D01*
X234711714Y-3103619D01*
X234664095Y-3056000D01*
X234568857Y-3008380D01*
X234330761Y-3008380D01*
X234187904Y-3056000D01*
X233854571Y-3008380D02*
X233616476Y-4008380D01*
X233426000Y-3294095D01*
X233235523Y-4008380D01*
X232997428Y-3008380D01*
X232711714Y-3008380D02*
X232092666Y-3008380D01*
X232426000Y-3389333D01*
X232283142Y-3389333D01*
X232187904Y-3436952D01*
X232140285Y-3484571D01*
X232092666Y-3579809D01*
X232092666Y-3817904D01*
X232140285Y-3913142D01*
X232187904Y-3960761D01*
X232283142Y-4008380D01*
X232568857Y-4008380D01*
X232664095Y-3960761D01*
X232711714Y-3913142D01*
%TO.C,J7*%
X202568133Y-9155180D02*
X202568133Y-9869466D01*
X202615752Y-10012323D01*
X202710990Y-10107561D01*
X202853847Y-10155180D01*
X202949085Y-10155180D01*
X202187180Y-9155180D02*
X201520514Y-9155180D01*
X201949085Y-10155180D01*
%TO.C,J15*%
X240433123Y58916819D02*
X240433123Y58202533D01*
X240480742Y58059676D01*
X240575980Y57964438D01*
X240718838Y57916819D01*
X240814076Y57916819D01*
X239433123Y57916819D02*
X240004552Y57916819D01*
X239718838Y57916819D02*
X239718838Y58916819D01*
X239814076Y58773961D01*
X239909314Y58678723D01*
X240004552Y58631104D01*
X238528361Y58916819D02*
X239004552Y58916819D01*
X239052171Y58440628D01*
X239004552Y58488247D01*
X238909314Y58535866D01*
X238671219Y58535866D01*
X238575980Y58488247D01*
X238528361Y58440628D01*
X238480742Y58345390D01*
X238480742Y58107295D01*
X238528361Y58012057D01*
X238575980Y57964438D01*
X238671219Y57916819D01*
X238909314Y57916819D01*
X239004552Y57964438D01*
X239052171Y58012057D01*
%TO.C,R15*%
X219844857Y51617619D02*
X220178190Y52093809D01*
X220416285Y51617619D02*
X220416285Y52617619D01*
X220035333Y52617619D01*
X219940095Y52570000D01*
X219892476Y52522380D01*
X219844857Y52427142D01*
X219844857Y52284285D01*
X219892476Y52189047D01*
X219940095Y52141428D01*
X220035333Y52093809D01*
X220416285Y52093809D01*
X218892476Y51617619D02*
X219463904Y51617619D01*
X219178190Y51617619D02*
X219178190Y52617619D01*
X219273428Y52474761D01*
X219368666Y52379523D01*
X219463904Y52331904D01*
X217987714Y52617619D02*
X218463904Y52617619D01*
X218511523Y52141428D01*
X218463904Y52189047D01*
X218368666Y52236666D01*
X218130571Y52236666D01*
X218035333Y52189047D01*
X217987714Y52141428D01*
X217940095Y52046190D01*
X217940095Y51808095D01*
X217987714Y51712857D01*
X218035333Y51665238D01*
X218130571Y51617619D01*
X218368666Y51617619D01*
X218463904Y51665238D01*
X218511523Y51712857D01*
%TO.C,D1*%
X198908895Y-4973580D02*
X198908895Y-3973580D01*
X198670800Y-3973580D01*
X198527942Y-4021200D01*
X198432704Y-4116438D01*
X198385085Y-4211676D01*
X198337466Y-4402152D01*
X198337466Y-4545009D01*
X198385085Y-4735485D01*
X198432704Y-4830723D01*
X198527942Y-4925961D01*
X198670800Y-4973580D01*
X198908895Y-4973580D01*
X197385085Y-4973580D02*
X197956514Y-4973580D01*
X197670800Y-4973580D02*
X197670800Y-3973580D01*
X197766038Y-4116438D01*
X197861276Y-4211676D01*
X197956514Y-4259295D01*
%TO.C,C5*%
X229376266Y60755257D02*
X229423885Y60707638D01*
X229566742Y60660019D01*
X229661980Y60660019D01*
X229804838Y60707638D01*
X229900076Y60802876D01*
X229947695Y60898114D01*
X229995314Y61088590D01*
X229995314Y61231447D01*
X229947695Y61421923D01*
X229900076Y61517161D01*
X229804838Y61612400D01*
X229661980Y61660019D01*
X229566742Y61660019D01*
X229423885Y61612400D01*
X229376266Y61564780D01*
X228471504Y61660019D02*
X228947695Y61660019D01*
X228995314Y61183828D01*
X228947695Y61231447D01*
X228852457Y61279066D01*
X228614361Y61279066D01*
X228519123Y61231447D01*
X228471504Y61183828D01*
X228423885Y61088590D01*
X228423885Y60850495D01*
X228471504Y60755257D01*
X228519123Y60707638D01*
X228614361Y60660019D01*
X228852457Y60660019D01*
X228947695Y60707638D01*
X228995314Y60755257D01*
%TO.C,R5*%
X223737466Y51719219D02*
X224070800Y52195409D01*
X224308895Y51719219D02*
X224308895Y52719219D01*
X223927942Y52719219D01*
X223832704Y52671600D01*
X223785085Y52623980D01*
X223737466Y52528742D01*
X223737466Y52385885D01*
X223785085Y52290647D01*
X223832704Y52243028D01*
X223927942Y52195409D01*
X224308895Y52195409D01*
X222832704Y52719219D02*
X223308895Y52719219D01*
X223356514Y52243028D01*
X223308895Y52290647D01*
X223213657Y52338266D01*
X222975561Y52338266D01*
X222880323Y52290647D01*
X222832704Y52243028D01*
X222785085Y52147790D01*
X222785085Y51909695D01*
X222832704Y51814457D01*
X222880323Y51766838D01*
X222975561Y51719219D01*
X223213657Y51719219D01*
X223308895Y51766838D01*
X223356514Y51814457D01*
%TO.C,R3*%
X213272666Y65892419D02*
X213606000Y66368609D01*
X213844095Y65892419D02*
X213844095Y66892419D01*
X213463142Y66892419D01*
X213367904Y66844800D01*
X213320285Y66797180D01*
X213272666Y66701942D01*
X213272666Y66559085D01*
X213320285Y66463847D01*
X213367904Y66416228D01*
X213463142Y66368609D01*
X213844095Y66368609D01*
X212939333Y66892419D02*
X212320285Y66892419D01*
X212653619Y66511466D01*
X212510761Y66511466D01*
X212415523Y66463847D01*
X212367904Y66416228D01*
X212320285Y66320990D01*
X212320285Y66082895D01*
X212367904Y65987657D01*
X212415523Y65940038D01*
X212510761Y65892419D01*
X212796476Y65892419D01*
X212891714Y65940038D01*
X212939333Y65987657D01*
%TO.C,R1*%
X213120266Y70108819D02*
X213453600Y70585009D01*
X213691695Y70108819D02*
X213691695Y71108819D01*
X213310742Y71108819D01*
X213215504Y71061200D01*
X213167885Y71013580D01*
X213120266Y70918342D01*
X213120266Y70775485D01*
X213167885Y70680247D01*
X213215504Y70632628D01*
X213310742Y70585009D01*
X213691695Y70585009D01*
X212167885Y70108819D02*
X212739314Y70108819D01*
X212453600Y70108819D02*
X212453600Y71108819D01*
X212548838Y70965961D01*
X212644076Y70870723D01*
X212739314Y70823104D01*
%TO.C,C1*%
X203061866Y-5233942D02*
X203109485Y-5281561D01*
X203252342Y-5329180D01*
X203347580Y-5329180D01*
X203490438Y-5281561D01*
X203585676Y-5186323D01*
X203633295Y-5091085D01*
X203680914Y-4900609D01*
X203680914Y-4757752D01*
X203633295Y-4567276D01*
X203585676Y-4472038D01*
X203490438Y-4376800D01*
X203347580Y-4329180D01*
X203252342Y-4329180D01*
X203109485Y-4376800D01*
X203061866Y-4424419D01*
X202109485Y-5329180D02*
X202680914Y-5329180D01*
X202395200Y-5329180D02*
X202395200Y-4329180D01*
X202490438Y-4472038D01*
X202585676Y-4567276D01*
X202680914Y-4614895D01*
%TO.C,R11*%
X201683857Y72293219D02*
X202017190Y72769409D01*
X202255285Y72293219D02*
X202255285Y73293219D01*
X201874333Y73293219D01*
X201779095Y73245600D01*
X201731476Y73197980D01*
X201683857Y73102742D01*
X201683857Y72959885D01*
X201731476Y72864647D01*
X201779095Y72817028D01*
X201874333Y72769409D01*
X202255285Y72769409D01*
X200731476Y72293219D02*
X201302904Y72293219D01*
X201017190Y72293219D02*
X201017190Y73293219D01*
X201112428Y73150361D01*
X201207666Y73055123D01*
X201302904Y73007504D01*
X199779095Y72293219D02*
X200350523Y72293219D01*
X200064809Y72293219D02*
X200064809Y73293219D01*
X200160047Y73150361D01*
X200255285Y73055123D01*
X200350523Y73007504D01*
%TO.C,R10*%
X194698857Y-5989580D02*
X195032190Y-5513390D01*
X195270285Y-5989580D02*
X195270285Y-4989580D01*
X194889333Y-4989580D01*
X194794095Y-5037200D01*
X194746476Y-5084819D01*
X194698857Y-5180057D01*
X194698857Y-5322914D01*
X194746476Y-5418152D01*
X194794095Y-5465771D01*
X194889333Y-5513390D01*
X195270285Y-5513390D01*
X193746476Y-5989580D02*
X194317904Y-5989580D01*
X194032190Y-5989580D02*
X194032190Y-4989580D01*
X194127428Y-5132438D01*
X194222666Y-5227676D01*
X194317904Y-5275295D01*
X193127428Y-4989580D02*
X193032190Y-4989580D01*
X192936952Y-5037200D01*
X192889333Y-5084819D01*
X192841714Y-5180057D01*
X192794095Y-5370533D01*
X192794095Y-5608628D01*
X192841714Y-5799104D01*
X192889333Y-5894342D01*
X192936952Y-5941961D01*
X193032190Y-5989580D01*
X193127428Y-5989580D01*
X193222666Y-5941961D01*
X193270285Y-5894342D01*
X193317904Y-5799104D01*
X193365523Y-5608628D01*
X193365523Y-5370533D01*
X193317904Y-5180057D01*
X193270285Y-5084819D01*
X193222666Y-5037200D01*
X193127428Y-4989580D01*
%TO.C,R9*%
X206871866Y-4617980D02*
X207205200Y-4141790D01*
X207443295Y-4617980D02*
X207443295Y-3617980D01*
X207062342Y-3617980D01*
X206967104Y-3665600D01*
X206919485Y-3713219D01*
X206871866Y-3808457D01*
X206871866Y-3951314D01*
X206919485Y-4046552D01*
X206967104Y-4094171D01*
X207062342Y-4141790D01*
X207443295Y-4141790D01*
X206395676Y-4617980D02*
X206205200Y-4617980D01*
X206109961Y-4570361D01*
X206062342Y-4522742D01*
X205967104Y-4379885D01*
X205919485Y-4189409D01*
X205919485Y-3808457D01*
X205967104Y-3713219D01*
X206014723Y-3665600D01*
X206109961Y-3617980D01*
X206300438Y-3617980D01*
X206395676Y-3665600D01*
X206443295Y-3713219D01*
X206490914Y-3808457D01*
X206490914Y-4046552D01*
X206443295Y-4141790D01*
X206395676Y-4189409D01*
X206300438Y-4237028D01*
X206109961Y-4237028D01*
X206014723Y-4189409D01*
X205967104Y-4141790D01*
X205919485Y-4046552D01*
%TO.C,C4*%
X187745666Y-5208542D02*
X187793285Y-5256161D01*
X187936142Y-5303780D01*
X188031380Y-5303780D01*
X188174238Y-5256161D01*
X188269476Y-5160923D01*
X188317095Y-5065685D01*
X188364714Y-4875209D01*
X188364714Y-4732352D01*
X188317095Y-4541876D01*
X188269476Y-4446638D01*
X188174238Y-4351400D01*
X188031380Y-4303780D01*
X187936142Y-4303780D01*
X187793285Y-4351400D01*
X187745666Y-4399019D01*
X186888523Y-4637114D02*
X186888523Y-5303780D01*
X187126619Y-4256161D02*
X187364714Y-4970447D01*
X186745666Y-4970447D01*
%TO.C,C3*%
X188710866Y2411457D02*
X188758485Y2363838D01*
X188901342Y2316219D01*
X188996580Y2316219D01*
X189139438Y2363838D01*
X189234676Y2459076D01*
X189282295Y2554314D01*
X189329914Y2744790D01*
X189329914Y2887647D01*
X189282295Y3078123D01*
X189234676Y3173361D01*
X189139438Y3268600D01*
X188996580Y3316219D01*
X188901342Y3316219D01*
X188758485Y3268600D01*
X188710866Y3220980D01*
X188377533Y3316219D02*
X187758485Y3316219D01*
X188091819Y2935266D01*
X187948961Y2935266D01*
X187853723Y2887647D01*
X187806104Y2840028D01*
X187758485Y2744790D01*
X187758485Y2506695D01*
X187806104Y2411457D01*
X187853723Y2363838D01*
X187948961Y2316219D01*
X188234676Y2316219D01*
X188329914Y2363838D01*
X188377533Y2411457D01*
%TO.C,C2*%
X188482266Y6704057D02*
X188529885Y6656438D01*
X188672742Y6608819D01*
X188767980Y6608819D01*
X188910838Y6656438D01*
X189006076Y6751676D01*
X189053695Y6846914D01*
X189101314Y7037390D01*
X189101314Y7180247D01*
X189053695Y7370723D01*
X189006076Y7465961D01*
X188910838Y7561200D01*
X188767980Y7608819D01*
X188672742Y7608819D01*
X188529885Y7561200D01*
X188482266Y7513580D01*
X188101314Y7513580D02*
X188053695Y7561200D01*
X187958457Y7608819D01*
X187720361Y7608819D01*
X187625123Y7561200D01*
X187577504Y7513580D01*
X187529885Y7418342D01*
X187529885Y7323104D01*
X187577504Y7180247D01*
X188148933Y6608819D01*
X187529885Y6608819D01*
%TO.C,X1*%
X188667923Y58002419D02*
X188001257Y57002419D01*
X188001257Y58002419D02*
X188667923Y57002419D01*
X187096495Y57002419D02*
X187667923Y57002419D01*
X187382209Y57002419D02*
X187382209Y58002419D01*
X187477447Y57859561D01*
X187572685Y57764323D01*
X187667923Y57716704D01*
X187990171Y54626780D02*
X187990171Y54293447D01*
X188513980Y54150590D02*
X188513980Y54626780D01*
X187513980Y54626780D01*
X187513980Y54150590D01*
X188466361Y53769638D02*
X188513980Y53626780D01*
X188513980Y53388685D01*
X188466361Y53293447D01*
X188418742Y53245828D01*
X188323504Y53198209D01*
X188228266Y53198209D01*
X188133028Y53245828D01*
X188085409Y53293447D01*
X188037790Y53388685D01*
X187990171Y53579161D01*
X187942552Y53674400D01*
X187894933Y53722019D01*
X187799695Y53769638D01*
X187704457Y53769638D01*
X187609219Y53722019D01*
X187561600Y53674400D01*
X187513980Y53579161D01*
X187513980Y53341066D01*
X187561600Y53198209D01*
X188513980Y52769638D02*
X187513980Y52769638D01*
X187513980Y52388685D01*
X187561600Y52293447D01*
X187609219Y52245828D01*
X187704457Y52198209D01*
X187847314Y52198209D01*
X187942552Y52245828D01*
X187990171Y52293447D01*
X188037790Y52388685D01*
X188037790Y52769638D01*
X187513980Y51864876D02*
X187513980Y51245828D01*
X187894933Y51579161D01*
X187894933Y51436304D01*
X187942552Y51341066D01*
X187990171Y51293447D01*
X188085409Y51245828D01*
X188323504Y51245828D01*
X188418742Y51293447D01*
X188466361Y51341066D01*
X188513980Y51436304D01*
X188513980Y51722019D01*
X188466361Y51817257D01*
X188418742Y51864876D01*
X187609219Y50864876D02*
X187561600Y50817257D01*
X187513980Y50722019D01*
X187513980Y50483923D01*
X187561600Y50388685D01*
X187609219Y50341066D01*
X187704457Y50293447D01*
X187799695Y50293447D01*
X187942552Y50341066D01*
X188513980Y50912495D01*
X188513980Y50293447D01*
X188133028Y49864876D02*
X188133028Y49102971D01*
X187513980Y48722019D02*
X188513980Y48483923D01*
X187799695Y48293447D01*
X188513980Y48102971D01*
X187513980Y47864876D01*
X188513980Y46912495D02*
X188037790Y47245828D01*
X188513980Y47483923D02*
X187513980Y47483923D01*
X187513980Y47102971D01*
X187561600Y47007733D01*
X187609219Y46960114D01*
X187704457Y46912495D01*
X187847314Y46912495D01*
X187942552Y46960114D01*
X187990171Y47007733D01*
X188037790Y47102971D01*
X188037790Y47483923D01*
X187513980Y46293447D02*
X187513980Y46102971D01*
X187561600Y46007733D01*
X187656838Y45912495D01*
X187847314Y45864876D01*
X188180647Y45864876D01*
X188371123Y45912495D01*
X188466361Y46007733D01*
X188513980Y46102971D01*
X188513980Y46293447D01*
X188466361Y46388685D01*
X188371123Y46483923D01*
X188180647Y46531542D01*
X187847314Y46531542D01*
X187656838Y46483923D01*
X187561600Y46388685D01*
X187513980Y46293447D01*
X187513980Y45245828D02*
X187513980Y45055352D01*
X187561600Y44960114D01*
X187656838Y44864876D01*
X187847314Y44817257D01*
X188180647Y44817257D01*
X188371123Y44864876D01*
X188466361Y44960114D01*
X188513980Y45055352D01*
X188513980Y45245828D01*
X188466361Y45341066D01*
X188371123Y45436304D01*
X188180647Y45483923D01*
X187847314Y45483923D01*
X187656838Y45436304D01*
X187561600Y45341066D01*
X187513980Y45245828D01*
X188513980Y44388685D02*
X187513980Y44388685D01*
X188228266Y44055352D01*
X187513980Y43722019D01*
X188513980Y43722019D01*
%TO.C,IC1*%
X201779576Y67713219D02*
X201779576Y68713219D01*
X200731957Y67808457D02*
X200779576Y67760838D01*
X200922433Y67713219D01*
X201017671Y67713219D01*
X201160528Y67760838D01*
X201255766Y67856076D01*
X201303385Y67951314D01*
X201351004Y68141790D01*
X201351004Y68284647D01*
X201303385Y68475123D01*
X201255766Y68570361D01*
X201160528Y68665600D01*
X201017671Y68713219D01*
X200922433Y68713219D01*
X200779576Y68665600D01*
X200731957Y68617980D01*
X199779576Y67713219D02*
X200351004Y67713219D01*
X200065290Y67713219D02*
X200065290Y68713219D01*
X200160528Y68570361D01*
X200255766Y68475123D01*
X200351004Y68427504D01*
%TO.C,EC1*%
X200125347Y93687828D02*
X199792014Y93687828D01*
X199649157Y93164019D02*
X200125347Y93164019D01*
X200125347Y94164019D01*
X199649157Y94164019D01*
X198649157Y93259257D02*
X198696776Y93211638D01*
X198839633Y93164019D01*
X198934871Y93164019D01*
X199077728Y93211638D01*
X199172966Y93306876D01*
X199220585Y93402114D01*
X199268204Y93592590D01*
X199268204Y93735447D01*
X199220585Y93925923D01*
X199172966Y94021161D01*
X199077728Y94116400D01*
X198934871Y94164019D01*
X198839633Y94164019D01*
X198696776Y94116400D01*
X198649157Y94068780D01*
X197696776Y93164019D02*
X198268204Y93164019D01*
X197982490Y93164019D02*
X197982490Y94164019D01*
X198077728Y94021161D01*
X198172966Y93925923D01*
X198268204Y93878304D01*
%TO.C,JP1*%
X227452133Y65114419D02*
X227452133Y64400133D01*
X227499752Y64257276D01*
X227594990Y64162038D01*
X227737847Y64114419D01*
X227833085Y64114419D01*
X226975942Y64114419D02*
X226975942Y65114419D01*
X226594990Y65114419D01*
X226499752Y65066800D01*
X226452133Y65019180D01*
X226404514Y64923942D01*
X226404514Y64781085D01*
X226452133Y64685847D01*
X226499752Y64638228D01*
X226594990Y64590609D01*
X226975942Y64590609D01*
X225452133Y64114419D02*
X226023561Y64114419D01*
X225737847Y64114419D02*
X225737847Y65114419D01*
X225833085Y64971561D01*
X225928323Y64876323D01*
X226023561Y64828704D01*
%TO.C,U1*%
X228041104Y77560419D02*
X228041104Y76750895D01*
X227993485Y76655657D01*
X227945866Y76608038D01*
X227850628Y76560419D01*
X227660152Y76560419D01*
X227564914Y76608038D01*
X227517295Y76655657D01*
X227469676Y76750895D01*
X227469676Y77560419D01*
X226469676Y76560419D02*
X227041104Y76560419D01*
X226755390Y76560419D02*
X226755390Y77560419D01*
X226850628Y77417561D01*
X226945866Y77322323D01*
X227041104Y77274704D01*
%TO.C,J11*%
X231339923Y-11898380D02*
X231339923Y-12612666D01*
X231387542Y-12755523D01*
X231482780Y-12850761D01*
X231625638Y-12898380D01*
X231720876Y-12898380D01*
X230339923Y-12898380D02*
X230911352Y-12898380D01*
X230625638Y-12898380D02*
X230625638Y-11898380D01*
X230720876Y-12041238D01*
X230816114Y-12136476D01*
X230911352Y-12184095D01*
X229387542Y-12898380D02*
X229958971Y-12898380D01*
X229673257Y-12898380D02*
X229673257Y-11898380D01*
X229768495Y-12041238D01*
X229863733Y-12136476D01*
X229958971Y-12184095D01*
%TO.C,SW1*%
X194576533Y65025638D02*
X194433676Y64978019D01*
X194195580Y64978019D01*
X194100342Y65025638D01*
X194052723Y65073257D01*
X194005104Y65168495D01*
X194005104Y65263733D01*
X194052723Y65358971D01*
X194100342Y65406590D01*
X194195580Y65454209D01*
X194386057Y65501828D01*
X194481295Y65549447D01*
X194528914Y65597066D01*
X194576533Y65692304D01*
X194576533Y65787542D01*
X194528914Y65882780D01*
X194481295Y65930400D01*
X194386057Y65978019D01*
X194147961Y65978019D01*
X194005104Y65930400D01*
X193671771Y65978019D02*
X193433676Y64978019D01*
X193243200Y65692304D01*
X193052723Y64978019D01*
X192814628Y65978019D01*
X191909866Y64978019D02*
X192481295Y64978019D01*
X192195580Y64978019D02*
X192195580Y65978019D01*
X192290819Y65835161D01*
X192386057Y65739923D01*
X192481295Y65692304D01*
%TD*%
M02*
