%TF.GenerationSoftware,KiCad,Pcbnew,5.1.6-c6e7f7d~87~ubuntu18.04.1*%
%TF.CreationDate,2021-09-22T20:52:25-04:00*%
%TF.ProjectId,remote,72656d6f-7465-42e6-9b69-6361645f7063,rev?*%
%TF.SameCoordinates,Original*%
%TF.FileFunction,Profile,NP*%
%FSLAX46Y46*%
G04 Gerber Fmt 4.6, Leading zero omitted, Abs format (unit mm)*
G04 Created by KiCad (PCBNEW 5.1.6-c6e7f7d~87~ubuntu18.04.1) date 2021-09-22 20:52:25*
%MOMM*%
%LPD*%
G01*
G04 APERTURE LIST*
%TA.AperFunction,Profile*%
%ADD10C,0.050000*%
%TD*%
G04 APERTURE END LIST*
D10*
X27442000Y-30130000D02*
G75*
G03*
X27442000Y-30130000I-1500000J0D01*
G01*
X23472000Y-30030000D02*
G75*
G03*
X23472000Y-30030000I-1500000J0D01*
G01*
X19472000Y-30030000D02*
G75*
G03*
X19472000Y-30030000I-1500000J0D01*
G01*
X31442000Y-30130000D02*
G75*
G03*
X31442000Y-30130000I-1500000J0D01*
G01*
X43442000Y-14040000D02*
G75*
G03*
X43442000Y-14040000I-1500000J0D01*
G01*
X11142000Y-14070000D02*
G75*
G03*
X11142000Y-14070000I-1500000J0D01*
G01*
X11142000Y-22070000D02*
G75*
G03*
X11142000Y-22070000I-1500000J0D01*
G01*
X31442000Y-14040000D02*
G75*
G03*
X31442000Y-14040000I-1500000J0D01*
G01*
X27442000Y-14040000D02*
G75*
G03*
X27442000Y-14040000I-1500000J0D01*
G01*
X11142000Y-18070000D02*
G75*
G03*
X11142000Y-18070000I-1500000J0D01*
G01*
X15442000Y-14040000D02*
G75*
G03*
X15442000Y-14040000I-1500000J0D01*
G01*
X19442000Y-14040000D02*
G75*
G03*
X19442000Y-14040000I-1500000J0D01*
G01*
X11172000Y-26060000D02*
G75*
G03*
X11172000Y-26060000I-1500000J0D01*
G01*
X23442000Y-14040000D02*
G75*
G03*
X23442000Y-14040000I-1500000J0D01*
G01*
X39442000Y-14040000D02*
G75*
G03*
X39442000Y-14040000I-1500000J0D01*
G01*
X35442000Y-14040000D02*
G75*
G03*
X35442000Y-14040000I-1500000J0D01*
G01*
X23472000Y-26030000D02*
G75*
G03*
X23472000Y-26030000I-1500000J0D01*
G01*
X15472000Y-26030000D02*
G75*
G03*
X15472000Y-26030000I-1500000J0D01*
G01*
X23442000Y-18040000D02*
G75*
G03*
X23442000Y-18040000I-1500000J0D01*
G01*
X15442000Y-22040000D02*
G75*
G03*
X15442000Y-22040000I-1500000J0D01*
G01*
X31442000Y-22040000D02*
G75*
G03*
X31442000Y-22040000I-1500000J0D01*
G01*
X39442000Y-22040000D02*
G75*
G03*
X39442000Y-22040000I-1500000J0D01*
G01*
X35442000Y-26040000D02*
G75*
G03*
X35442000Y-26040000I-1500000J0D01*
G01*
X23442000Y-22040000D02*
G75*
G03*
X23442000Y-22040000I-1500000J0D01*
G01*
X27442000Y-22040000D02*
G75*
G03*
X27442000Y-22040000I-1500000J0D01*
G01*
X31442000Y-26040000D02*
G75*
G03*
X31442000Y-26040000I-1500000J0D01*
G01*
X43442000Y-26040000D02*
G75*
G03*
X43442000Y-26040000I-1500000J0D01*
G01*
X35442000Y-22040000D02*
G75*
G03*
X35442000Y-22040000I-1500000J0D01*
G01*
X31442000Y-18040000D02*
G75*
G03*
X31442000Y-18040000I-1500000J0D01*
G01*
X39442000Y-18040000D02*
G75*
G03*
X39442000Y-18040000I-1500000J0D01*
G01*
X43442000Y-22040000D02*
G75*
G03*
X43442000Y-22040000I-1500000J0D01*
G01*
X19442000Y-22040000D02*
G75*
G03*
X19442000Y-22040000I-1500000J0D01*
G01*
X35442000Y-18040000D02*
G75*
G03*
X35442000Y-18040000I-1500000J0D01*
G01*
X27442000Y-18040000D02*
G75*
G03*
X27442000Y-18040000I-1500000J0D01*
G01*
X19442000Y-18040000D02*
G75*
G03*
X19442000Y-18040000I-1500000J0D01*
G01*
X39442000Y-26040000D02*
G75*
G03*
X39442000Y-26040000I-1500000J0D01*
G01*
X15442000Y-18040000D02*
G75*
G03*
X15442000Y-18040000I-1500000J0D01*
G01*
X27442000Y-26040000D02*
G75*
G03*
X27442000Y-26040000I-1500000J0D01*
G01*
X43442000Y-18040000D02*
G75*
G03*
X43442000Y-18040000I-1500000J0D01*
G01*
X19442000Y-26040000D02*
G75*
G03*
X19442000Y-26040000I-1500000J0D01*
G01*
X52012264Y-3019948D02*
X52012264Y-90030052D01*
X2000Y-3019684D02*
X2052Y-90029736D01*
X31157000Y-6391244D02*
X21487000Y-6393756D01*
X33728244Y-3818756D02*
G75*
G02*
X31157000Y-6390000I-2571244J0D01*
G01*
X31157000Y-1247512D02*
G75*
G02*
X33728244Y-3818756I0J-2571244D01*
G01*
X21487000Y-1248756D02*
X31157000Y-1248756D01*
X21487000Y-6393756D02*
G75*
G02*
X18915756Y-3822512I0J2571244D01*
G01*
X18915756Y-3820000D02*
G75*
G02*
X21487000Y-1248756I2571244J0D01*
G01*
X2000Y-3019684D02*
G75*
G02*
X3022264Y264I3020264J-316D01*
G01*
X52012264Y-90030052D02*
G75*
G02*
X48992000Y-93050000I-3020264J316D01*
G01*
X52012264Y-3019948D02*
G75*
G03*
X48992000Y0I-3020264J-316D01*
G01*
X3022000Y-93050000D02*
G75*
G02*
X2052Y-90029736I316J3020264D01*
G01*
X48992000Y0D02*
X3022264Y264D01*
X48992000Y-93050000D02*
X3022000Y-93050000D01*
M02*
