(module ssd1306 (layer F.Cu) (tedit 61E4B1CA)
  (descr "Through hole straight socket strip, 1x04, 2.54mm pitch, single row (from Kicad 4.0.7), script generated")
  (tags "Through hole socket strip THT 1x04 2.54mm single row")
  (fp_text reference REF** (at -0.04 -2.69) (layer F.SilkS)
    (effects (font (size 1 1) (thickness 0.15)))
  )
  (fp_text value ssd1306 (at 0 10.39) (layer F.Fab)
    (effects (font (size 1 1) (thickness 0.15)))
  )
  (fp_line (start -5.08 1.43) (end -5.08 -0.475) (layer F.Fab) (width 0.1))
  (fp_line (start -5.08 -0.475) (end -4.445 -1.11) (layer F.Fab) (width 0.1))
  (fp_line (start -4.445 -1.11) (end 5.08 -1.11) (layer F.Fab) (width 0.1))
  (fp_line (start 5.08 -1.11) (end 5.08 1.43) (layer F.Fab) (width 0.1))
  (fp_line (start 5.08 1.43) (end -5.08 1.43) (layer F.Fab) (width 0.1))
  (fp_line (start -2.54 1.49) (end -2.54 -1.17) (layer F.SilkS) (width 0.12))
  (fp_line (start -2.54 1.49) (end 5.14 1.49) (layer F.SilkS) (width 0.12))
  (fp_line (start 5.14 1.49) (end 5.14 -1.17) (layer F.SilkS) (width 0.12))
  (fp_line (start -2.54 -1.17) (end 5.14 -1.17) (layer F.SilkS) (width 0.12))
  (fp_line (start -5.14 -1.17) (end -3.81 -1.17) (layer F.SilkS) (width 0.12))
  (fp_line (start -5.14 0.16) (end -5.14 -1.17) (layer F.SilkS) (width 0.12))
  (fp_line (start -5.61 1.96) (end -5.61 -1.59) (layer F.CrtYd) (width 0.05))
  (fp_line (start -5.61 -1.59) (end 5.59 -1.59) (layer F.CrtYd) (width 0.05))
  (fp_line (start 5.59 -1.59) (end 5.59 1.96) (layer F.CrtYd) (width 0.05))
  (fp_line (start 5.59 1.96) (end -5.61 1.96) (layer F.CrtYd) (width 0.05))
  (fp_line (start -12.5 -1.17) (end 12.5 -1.17) (layer F.SilkS) (width 0.12))
  (fp_line (start 12.5 -1.17) (end 12.5 24.83) (layer F.SilkS) (width 0.12))
  (fp_line (start -12.5 -1.17) (end -12.5 24.83) (layer F.SilkS) (width 0.12))
  (fp_line (start -12.5 24.83) (end 12.5 24.83) (layer F.SilkS) (width 0.12))
  (fp_circle (center 10.5 1.16) (end 12 1.16) (layer F.SilkS) (width 0.12))
  (fp_circle (center -10.5 1.16) (end -9 1.16) (layer F.SilkS) (width 0.12))
  (fp_text user %R (at 0 0.16 180) (layer F.Fab)
    (effects (font (size 1 1) (thickness 0.15)))
  )
  (fp_line (start 12.5 3.16) (end -12.5 3.16) (layer F.SilkS) (width 0.12))
  (fp_line (start 0 0) (end 0 1) (layer F.SilkS) (width 0.12))
  (fp_line (start 12.5 18.16) (end -12.5 18.16) (layer F.SilkS) (width 0.12))
  (pad 4 thru_hole oval (at 3.81 0.16 90) (size 1.7 1.7) (drill 1) (layers *.Cu *.Mask))
  (pad 3 thru_hole oval (at 1.27 0.16 90) (size 1.7 1.7) (drill 1) (layers *.Cu *.Mask))
  (pad 2 thru_hole oval (at -1.27 0.16 90) (size 1.7 1.7) (drill 1) (layers *.Cu *.Mask))
  (pad 1 thru_hole rect (at -3.81 0.16 90) (size 1.7 1.7) (drill 1) (layers *.Cu *.Mask))
  (model ${KICAD6_3DMODEL_DIR}/Connector_PinSocket_2.54mm.3dshapes/PinSocket_1x04_P2.54mm_Vertical.wrl
    (at (xyz 0 0 0))
    (scale (xyz 1 1 1))
    (rotate (xyz 0 0 0))
  )
)
