"Id";"Designator";"Package";"Quantity";"Designation";"Supplier and ref";
1;"H6,H5,H4,H3,H2";"MountingHole_3.5mm";5;"MountingHole";;;
2;"J6,J11";"JST_SH_SM04B-SRSS-TB_1x04-1MP_P1.00mm_Horizontal";2;"Conn_01x04_Female";;;
3;"J2";"PinHeader_1x07_P2.54mm_Vertical";1;"Conn_01x07_Female";;;
4;"SW2";"sd2010_dip";1;"SW_Coded_SH-7010";;;
5;"R23,R21,R19,R17,R5";"R_0603_1608Metric_Pad1.05x0.95mm_HandSolder";5;"4.7K";;;
6;"R22,R20,R18,R16,R6";"R_Axial_DIN0309_L9.0mm_D3.2mm_P12.70mm_Horizontal";5;"4.7K";;;
7;"C7,C1,C4,C3";"C_0603_1608Metric_Pad1.05x0.95mm_HandSolder";4;"10u";;;
8;"C6,C2";"C_0603_1608Metric_Pad1.05x0.95mm_HandSolder";2;"0.1u";;;
9;"U2";"SOT23-5";1;"VREG_SOT23-5";;;
10;"J4";"BarrelJack_Horizontal";1;"Barrel_Jack_MountingPin";;;
11;"R14";"R_Axial_DIN0309_L9.0mm_D3.2mm_P12.70mm_Horizontal";1;"500";;;
12;"SW3,SW1";"SW_TH_Tactile_Omron_B3F-10xx";2;"SW_Push_Dual";;;
13;"J7";"TerminalBlock_Phoenix_PT-1,5-2-5.0-H_1x02_P5.00mm_Horizontal";1;"Screw_Terminal_01x02";;;
14;"H10,H9,H8,H7";"MountingHole_2.2mm_M2";4;"MountingHole";;;
15;"J15";"DM3D-SF_outline";1;"Micro_SD_Card";;;
16;"R4,R2";"R_Axial_DIN0309_L9.0mm_D3.2mm_P12.70mm_Horizontal";2;"R";;;
17;"R15";"R_0603_1608Metric_Pad1.05x0.95mm_HandSolder";1;"500";;;
18;"D1";"D_SOD-123";1;"DIODE";;;
19;"J1";"PinSocket_1x04_P2.54mm_Vertical_no_silk";1;"Conn_01x04_Female";;;
20;"TP4,TP3,TP2,TP1";"TestPoint_Pad_1.0x1.0mm_no_silk";4;"TestPoint";;;
21;"C5";"C_0603_1608Metric_Pad1.05x0.95mm_HandSolder";1;"1u";;;
22;"J17";"PinSocket_1x05_P2.54mm_Vertical";1;"Conn_01x05_Female";;;
23;"J14,J13,J12,J3";"PinSocket_1x14_P2.54mm_Vertical";4;"Conn_01x14_Female";;;
24;"R3,R1";"R_0603_1608Metric_Pad1.05x0.95mm_HandSolder";2;"R";;;
25;"R11";"R_0603_1608Metric_Pad1.05x0.95mm_HandSolder";1;"10K";;;
26;"R10,R9";"R_0603_1608Metric_Pad1.05x0.95mm_HandSolder";2;"100k";;;
27;"X1";"ESP32-WROOM";1;"ESP32_WROOM32";;;
28;"IC1";"SOT23-5L";1;"74AHC1G125";;;
29;"EC1";"SOIC8";1;"ATECC108";;;
30;"J5";"PinSocket_1x01_P2.54mm_Vertical";1;"Conn_01x01_Female";;;
31;"JP1";"SolderJumper-2_P1.3mm_Open_TrianglePad1.0x1.5mm";1;"Jumper_NO_Small";;;
32;"U1";"RFM95";1;"RFM95HW";;;
33;"H1";"MountingHole_3.7mm";1;"MountingHole";;;
34;"J10";"PinSocket_1x04_P2.54mm_Vertical";1;"ssd1306";;;
35;"J8";"PinSocket_1x07_P2.54mm_Vertical";1;"SCD30";;;
