EESchema Schematic File Version 4
EELAYER 30 0
EELAYER END
$Descr A4 11693 8268
encoding utf-8
Sheet 1 1
Title ""
Date ""
Rev ""
Comp ""
Comment1 ""
Comment2 ""
Comment3 ""
Comment4 ""
$EndDescr
$Comp
L Device:R R1
U 1 1 5F989DB1
P 775 6275
F 0 "R1" H 845 6321 50  0000 L CNN
F 1 "4.7K" H 845 6230 50  0000 L CNN
F 2 "Resistor_THT:R_Axial_DIN0309_L9.0mm_D3.2mm_P12.70mm_Horizontal" V 705 6275 50  0001 C CNN
F 3 "~" H 775 6275 50  0001 C CNN
	1    775  6275
	1    0    0    -1  
$EndComp
Text GLabel 1150 6450 0    50   Input ~ 0
SCL
$Comp
L power:+3V3 #PWR04
U 1 1 5F98B87C
P 775 6125
F 0 "#PWR04" H 775 5975 50  0001 C CNN
F 1 "+3V3" H 790 6298 50  0000 C CNN
F 2 "" H 775 6125 50  0001 C CNN
F 3 "" H 775 6125 50  0001 C CNN
	1    775  6125
	1    0    0    -1  
$EndComp
$Comp
L Device:R R2
U 1 1 5F98BC9A
P 1150 6300
F 0 "R2" H 1220 6346 50  0000 L CNN
F 1 "4.7K" H 1220 6255 50  0000 L CNN
F 2 "Resistor_THT:R_Axial_DIN0309_L9.0mm_D3.2mm_P12.70mm_Horizontal" V 1080 6300 50  0001 C CNN
F 3 "~" H 1150 6300 50  0001 C CNN
	1    1150 6300
	1    0    0    -1  
$EndComp
$Comp
L power:+3V3 #PWR06
U 1 1 5F98C06B
P 1150 6150
F 0 "#PWR06" H 1150 6000 50  0001 C CNN
F 1 "+3V3" H 1165 6323 50  0000 C CNN
F 2 "" H 1150 6150 50  0001 C CNN
F 3 "" H 1150 6150 50  0001 C CNN
	1    1150 6150
	1    0    0    -1  
$EndComp
Text GLabel 775  6425 0    50   Input ~ 0
SDA
Text Notes 650  5750 0    79   ~ 0
i2c pullups
$Comp
L Device:R R4
U 1 1 6028DEF2
P 5050 4950
F 0 "R4" H 5120 4996 50  0000 L CNN
F 1 "4.7K" H 5120 4905 50  0000 L CNN
F 2 "Resistor_THT:R_Axial_DIN0309_L9.0mm_D3.2mm_P12.70mm_Horizontal" V 4980 4950 50  0001 C CNN
F 3 "~" H 5050 4950 50  0001 C CNN
	1    5050 4950
	1    0    0    -1  
$EndComp
$Comp
L power:+3V3 #PWR018
U 1 1 6028E7B5
P 5050 4800
F 0 "#PWR018" H 5050 4650 50  0001 C CNN
F 1 "+3V3" H 5065 4973 50  0000 C CNN
F 2 "" H 5050 4800 50  0001 C CNN
F 3 "" H 5050 4800 50  0001 C CNN
	1    5050 4800
	1    0    0    -1  
$EndComp
Text Notes 5150 4550 0    79   ~ 0
BUTTON A
$Comp
L power:GND #PWR07
U 1 1 601B48F9
P 3400 6700
F 0 "#PWR07" H 3400 6450 50  0001 C CNN
F 1 "GND" H 3405 6527 50  0000 C CNN
F 2 "" H 3400 6700 50  0001 C CNN
F 3 "" H 3400 6700 50  0001 C CNN
	1    3400 6700
	0    1    1    0   
$EndComp
Text Notes 2925 5425 0    79   ~ 0
POWER
$Comp
L Connector:Barrel_Jack_MountingPin J4
U 1 1 607F42DF
P 3700 6800
F 0 "J4" H 3470 6672 50  0000 R CNN
F 1 "Barrel_Jack_MountingPin" V 3275 6925 50  0000 R CNN
F 2 "Connector_BarrelJack:BarrelJack_Horizontal" H 3750 6760 50  0001 C CNN
F 3 "~" H 3750 6760 50  0001 C CNN
	1    3700 6800
	-1   0    0    1   
$EndComp
Wire Wire Line
	3400 6500 3400 6700
Wire Wire Line
	3400 6500 3700 6500
Connection ~ 3400 6700
$Comp
L Adafruit_AirLift_FeatherWing-eagle-import:GND #GND0109
U 1 1 60D7FC5C
P 3600 7650
F 0 "#GND0109" H 3600 7650 50  0001 C CNN
F 1 "GND" H 3600 7529 59  0000 C CNN
F 2 "" H 3600 7650 50  0001 C CNN
F 3 "" H 3600 7650 50  0001 C CNN
	1    3600 7650
	1    0    0    -1  
$EndComp
$Comp
L Connector:Screw_Terminal_01x02 J7
U 1 1 60D7B882
P 3800 7550
F 0 "J7" H 3718 7225 50  0000 C CNN
F 1 "Screw_Terminal_01x02" H 3718 7316 50  0000 C CNN
F 2 "TerminalBlock_Phoenix:TerminalBlock_Phoenix_PT-1,5-2-5.0-H_1x02_P5.00mm_Horizontal" H 3800 7550 50  0001 C CNN
F 3 "~" H 3800 7550 50  0001 C CNN
	1    3800 7550
	1    0    0    1   
$EndComp
$Comp
L power:GND #PWR0111
U 1 1 60F802F8
P 6625 4550
F 0 "#PWR0111" H 6625 4300 50  0001 C CNN
F 1 "GND" H 6630 4377 50  0000 C CNN
F 2 "" H 6625 4550 50  0001 C CNN
F 3 "" H 6625 4550 50  0001 C CNN
	1    6625 4550
	1    0    0    -1  
$EndComp
$Comp
L power:+3V3 #PWR0112
U 1 1 60F802FE
P 6850 4650
F 0 "#PWR0112" H 6850 4500 50  0001 C CNN
F 1 "+3V3" H 6865 4823 50  0000 C CNN
F 2 "" H 6850 4650 50  0001 C CNN
F 3 "" H 6850 4650 50  0001 C CNN
	1    6850 4650
	1    0    0    -1  
$EndComp
Text GLabel 7025 4750 0    50   Input ~ 0
SDA
Text GLabel 7025 4850 0    50   Input ~ 0
SCL
Wire Wire Line
	7025 4550 6625 4550
Wire Wire Line
	7025 4650 6850 4650
$Comp
L Connector:Conn_01x04_Female J6
U 1 1 60F80308
P 7225 4650
F 0 "J6" H 7253 4626 50  0000 L CNN
F 1 "Conn_01x04_Female" V 7400 4200 50  0000 L CNN
F 2 "Connector_JST:JST_SH_SM04B-SRSS-TB_1x04-1MP_P1.00mm_Horizontal" H 7225 4650 50  0001 C CNN
F 3 "~" H 7225 4650 50  0001 C CNN
	1    7225 4650
	1    0    0    -1  
$EndComp
Text Notes 6400 4300 0    79   ~ 0
QWIIC
$Comp
L Device:R R3
U 1 1 60FBA6C0
P 5075 6025
F 0 "R3" H 5145 6071 50  0000 L CNN
F 1 "4.7K" H 5145 5980 50  0000 L CNN
F 2 "Resistor_THT:R_Axial_DIN0309_L9.0mm_D3.2mm_P12.70mm_Horizontal" V 5005 6025 50  0001 C CNN
F 3 "~" H 5075 6025 50  0001 C CNN
	1    5075 6025
	1    0    0    -1  
$EndComp
$Comp
L power:+3V3 #PWR0108
U 1 1 60FBA6C6
P 5075 5875
F 0 "#PWR0108" H 5075 5725 50  0001 C CNN
F 1 "+3V3" H 5090 6048 50  0000 C CNN
F 2 "" H 5075 5875 50  0001 C CNN
F 3 "" H 5075 5875 50  0001 C CNN
	1    5075 5875
	1    0    0    -1  
$EndComp
Text Notes 5175 5625 0    79   ~ 0
BUTTON B
Wire Wire Line
	4550 5100 5050 5100
Wire Wire Line
	4575 6175 5075 6175
$Comp
L Connector:Conn_01x03_Female J9
U 1 1 61020F33
P 2200 6750
F 0 "J9" H 2228 6776 50  0000 L CNN
F 1 "Conn_01x03_Female" H 2228 6685 50  0000 L CNN
F 2 "Connector_PinSocket_2.54mm:PinSocket_1x03_P2.54mm_Vertical" H 2200 6750 50  0001 C CNN
F 3 "~" H 2200 6750 50  0001 C CNN
	1    2200 6750
	1    0    0    -1  
$EndComp
Text Notes 1900 6450 0    79   ~ 0
DC-DC
$Comp
L device:C C1
U 1 1 610277F2
P 1800 7300
F 0 "C1" H 1685 7254 50  0000 R CNN
F 1 "10uF" H 1685 7345 50  0000 R CNN
F 2 "Capacitor_THT:CP_Radial_D5.0mm_P2.50mm" H 1838 7150 50  0001 C CNN
F 3 "" H 1800 7300 50  0001 C CNN
	1    1800 7300
	-1   0    0    1   
$EndComp
$Comp
L device:C C2
U 1 1 61051461
P 2300 7300
F 0 "C2" H 2185 7254 50  0000 R CNN
F 1 "22uF" H 2185 7345 50  0000 R CNN
F 2 "Capacitor_THT:CP_Radial_D5.0mm_P2.50mm" H 2338 7150 50  0001 C CNN
F 3 "" H 2300 7300 50  0001 C CNN
	1    2300 7300
	-1   0    0    1   
$EndComp
Text GLabel 2000 6850 0    50   UnSpc ~ 0
VOUT_DCDC
$Comp
L power:GND #PWR0101
U 1 1 6106310F
P 1450 6750
F 0 "#PWR0101" H 1450 6500 50  0001 C CNN
F 1 "GND" H 1455 6577 50  0000 C CNN
F 2 "" H 1450 6750 50  0001 C CNN
F 3 "" H 1450 6750 50  0001 C CNN
	1    1450 6750
	1    0    0    -1  
$EndComp
Wire Wire Line
	2000 6750 1450 6750
$Comp
L power:GND #PWR0102
U 1 1 61125937
P 1800 7450
F 0 "#PWR0102" H 1800 7200 50  0001 C CNN
F 1 "GND" H 1805 7277 50  0000 C CNN
F 2 "" H 1800 7450 50  0001 C CNN
F 3 "" H 1800 7450 50  0001 C CNN
	1    1800 7450
	1    0    0    -1  
$EndComp
$Comp
L power:GND #PWR0109
U 1 1 611261CE
P 2300 7450
F 0 "#PWR0109" H 2300 7200 50  0001 C CNN
F 1 "GND" H 2305 7277 50  0000 C CNN
F 2 "" H 2300 7450 50  0001 C CNN
F 3 "" H 2300 7450 50  0001 C CNN
	1    2300 7450
	1    0    0    -1  
$EndComp
Text GLabel 1800 7150 0    50   Input ~ 0
VIN_DCDC
Text GLabel 2300 7150 2    50   UnSpc ~ 0
VOUT_DCDC
$Comp
L Device:D D1
U 1 1 60F73E0C
P 3050 6050
F 0 "D1" H 3050 5833 50  0000 C CNN
F 1 "D" H 3050 5924 50  0000 C CNN
F 2 "Diode_THT:D_5W_P12.70mm_Horizontal" H 3050 6050 50  0001 C CNN
F 3 "~" H 3050 6050 50  0001 C CNN
	1    3050 6050
	-1   0    0    1   
$EndComp
Text GLabel 2000 6650 0    50   Input ~ 0
VIN_DCDC
Text GLabel 3400 6900 0    50   Input ~ 0
VIN_DCDC
Text GLabel 2900 6050 0    50   UnSpc ~ 0
VOUT_DCDC
Text Notes 2550 5700 0    47   ~ 0
diode voltage drop means we should\nadd voltage to min input voltage on DC DC\neither 3.3 or 5V DC DC should work
$Comp
L Connector:Conn_01x12_Female J12
U 1 1 61215C27
P 1550 2625
F 0 "J12" H 1578 2601 50  0000 L CNN
F 1 "Conn_01x12_Female" V 1625 1675 50  0000 L CNN
F 2 "Connector_PinSocket_2.54mm:PinSocket_1x12_P2.54mm_Vertical" H 1550 2625 50  0001 C CNN
F 3 "~" H 1550 2625 50  0001 C CNN
	1    1550 2625
	1    0    0    -1  
$EndComp
$Comp
L Connector:Conn_01x16_Female J3
U 1 1 61219D46
P 2050 2850
F 0 "J3" H 2078 2826 50  0000 L CNN
F 1 "Conn_01x16_Female" V 2125 1975 50  0000 L CNN
F 2 "Connector_PinSocket_2.54mm:PinSocket_1x16_P2.54mm_Vertical" H 2050 2850 50  0001 C CNN
F 3 "~" H 2050 2850 50  0001 C CNN
	1    2050 2850
	-1   0    0    1   
$EndComp
Text Notes 1125 1600 0    79   ~ 0
Feather M4 Express
$Comp
L Connector:Conn_01x12_Female J5
U 1 1 612D6942
P 4125 2375
F 0 "J5" H 4153 2351 50  0000 L CNN
F 1 "Conn_01x12_Female" V 4225 1475 50  0000 L CNN
F 2 "Connector_PinSocket_2.54mm:PinSocket_1x12_P2.54mm_Vertical" H 4125 2375 50  0001 C CNN
F 3 "~" H 4125 2375 50  0001 C CNN
	1    4125 2375
	1    0    0    -1  
$EndComp
$Comp
L Connector:Conn_01x16_Female J1
U 1 1 612D6948
P 4575 2700
F 0 "J1" H 4603 2676 50  0000 L CNN
F 1 "Conn_01x16_Female" V 4675 1775 50  0000 L CNN
F 2 "Connector_PinSocket_2.54mm:PinSocket_1x16_P2.54mm_Vertical" H 4575 2700 50  0001 C CNN
F 3 "~" H 4575 2700 50  0001 C CNN
	1    4575 2700
	-1   0    0    1   
$EndComp
Text Notes 3825 1475 0    79   ~ 0
Airlift Featherwing
$Comp
L Connector:Conn_01x02_Female J15
U 1 1 612A5BF6
P 1275 5225
F 0 "J15" H 1303 5201 50  0000 L CNN
F 1 "Conn_01x02_Female" H 1303 5110 50  0000 L CNN
F 2 "Connector_JST:JST_PH_S2B-PH-K_1x02_P2.00mm_Horizontal" H 1275 5225 50  0001 C CNN
F 3 "~" H 1275 5225 50  0001 C CNN
	1    1275 5225
	1    0    0    1   
$EndComp
Text Notes 925  4975 0    79   ~ 0
JST VBat Lithium Ion
$Comp
L Switch:SW_Push SW1
U 1 1 612C3561
P 5525 5100
F 0 "SW1" H 5525 5385 50  0000 C CNN
F 1 "SW_Push" H 5525 5294 50  0000 C CNN
F 2 "Button_Switch_THT:SW_Tactile_SPST_Angled_PTS645Vx58-2LFS" H 5525 5300 50  0001 C CNN
F 3 "~" H 5525 5300 50  0001 C CNN
	1    5525 5100
	1    0    0    -1  
$EndComp
Wire Wire Line
	5050 5100 5325 5100
Connection ~ 5050 5100
$Comp
L power:GND #PWR0106
U 1 1 612C4DF2
P 5725 5100
F 0 "#PWR0106" H 5725 4850 50  0001 C CNN
F 1 "GND" H 5730 4927 50  0000 C CNN
F 2 "" H 5725 5100 50  0001 C CNN
F 3 "" H 5725 5100 50  0001 C CNN
	1    5725 5100
	1    0    0    -1  
$EndComp
$Comp
L Switch:SW_Push SW2
U 1 1 612CCB02
P 5525 6175
F 0 "SW2" H 5525 6460 50  0000 C CNN
F 1 "SW_Push" H 5525 6369 50  0000 C CNN
F 2 "Button_Switch_THT:SW_Tactile_SPST_Angled_PTS645Vx58-2LFS" H 5525 6375 50  0001 C CNN
F 3 "~" H 5525 6375 50  0001 C CNN
	1    5525 6175
	1    0    0    -1  
$EndComp
$Comp
L power:GND #PWR0110
U 1 1 612CCB08
P 5725 6175
F 0 "#PWR0110" H 5725 5925 50  0001 C CNN
F 1 "GND" H 5730 6002 50  0000 C CNN
F 2 "" H 5725 6175 50  0001 C CNN
F 3 "" H 5725 6175 50  0001 C CNN
	1    5725 6175
	1    0    0    -1  
$EndComp
Wire Wire Line
	5325 6175 5075 6175
Connection ~ 5075 6175
Text GLabel 2250 3550 2    50   Input ~ 0
D4
Text GLabel 2250 3450 2    50   Input ~ 0
TX_D1
Text GLabel 2250 3350 2    50   Input ~ 0
RX_D0
Text GLabel 2250 3250 2    50   Input ~ 0
MISO
Text GLabel 2250 3150 2    50   Input ~ 0
MOSI
Text GLabel 2250 3050 2    50   Input ~ 0
SCK
Text GLabel 2250 2950 2    50   Input ~ 0
A5
Text GLabel 2250 2850 2    50   Input ~ 0
A4
Text GLabel 2250 2750 2    50   Input ~ 0
A3
Text GLabel 2250 2650 2    50   Input ~ 0
A2
Text GLabel 2250 2550 2    50   Input ~ 0
A1
Text GLabel 2250 2450 2    50   Input ~ 0
A0
Text GLabel 2250 2050 2    50   Input ~ 0
~RESET
Text GLabel 2250 2250 2    50   Input ~ 0
AREF
$Comp
L power:GND #PWR0103
U 1 1 612D0EAD
P 2550 2350
F 0 "#PWR0103" H 2550 2100 50  0001 C CNN
F 1 "GND" H 2555 2177 50  0000 C CNN
F 2 "" H 2550 2350 50  0001 C CNN
F 3 "" H 2550 2350 50  0001 C CNN
	1    2550 2350
	1    0    0    -1  
$EndComp
Wire Wire Line
	2250 2350 2550 2350
$Comp
L power:+3V3 #PWR0104
U 1 1 612DB520
P 2625 2150
F 0 "#PWR0104" H 2625 2000 50  0001 C CNN
F 1 "+3V3" V 2640 2278 50  0000 L CNN
F 2 "" H 2625 2150 50  0001 C CNN
F 3 "" H 2625 2150 50  0001 C CNN
	1    2625 2150
	1    0    0    -1  
$EndComp
Wire Wire Line
	2250 2150 2625 2150
Text GLabel 1350 2125 0    50   Input ~ 0
VBAT
Text GLabel 1350 2225 0    50   Input ~ 0
EN
Text GLabel 1350 2325 0    50   Input ~ 0
VBUS
Text GLabel 1350 2425 0    50   Input ~ 0
D13
Text GLabel 1350 2525 0    50   Input ~ 0
D12
Text GLabel 1350 2625 0    50   Input ~ 0
D11
Text GLabel 1350 2725 0    50   Input ~ 0
D10
Text GLabel 1350 2825 0    50   Input ~ 0
D9
Text GLabel 1350 2925 0    50   Input ~ 0
D6
Text GLabel 1350 3025 0    50   Input ~ 0
D5
Text GLabel 1350 3125 0    50   Input ~ 0
SCL
Text GLabel 1350 3225 0    50   Input ~ 0
SDA
Text GLabel 3925 1875 0    50   Input ~ 0
VBAT
Text GLabel 3925 1975 0    50   Input ~ 0
EN
Text GLabel 3925 2075 0    50   Input ~ 0
VBUS
Text GLabel 3925 2175 0    50   Input ~ 0
D13
Text GLabel 3925 2275 0    50   Input ~ 0
D12
Text GLabel 3925 2375 0    50   Input ~ 0
D11
Text GLabel 3925 2475 0    50   Input ~ 0
D10
Text GLabel 3925 2575 0    50   Input ~ 0
D9
Text GLabel 3925 2675 0    50   Input ~ 0
D6
Text GLabel 3925 2775 0    50   Input ~ 0
D5
Text GLabel 3925 2875 0    50   Input ~ 0
SCL
Text GLabel 3925 2975 0    50   Input ~ 0
SDA
Text GLabel 4775 3400 2    50   Input ~ 0
D4
Text GLabel 4775 3300 2    50   Input ~ 0
TX_D1
Text GLabel 4775 3200 2    50   Input ~ 0
RX_D0
Text GLabel 4775 3100 2    50   Input ~ 0
MISO
Text GLabel 4775 3000 2    50   Input ~ 0
MOSI
Text GLabel 4775 2900 2    50   Input ~ 0
SCK
Text GLabel 4775 2800 2    50   Input ~ 0
A5
Text GLabel 4775 2700 2    50   Input ~ 0
A4
Text GLabel 4775 2600 2    50   Input ~ 0
A3
Text GLabel 4775 2500 2    50   Input ~ 0
A2
Text GLabel 4775 2400 2    50   Input ~ 0
A1
Text GLabel 4775 2300 2    50   Input ~ 0
A0
Text GLabel 4775 1900 2    50   Input ~ 0
~RESET
Text GLabel 4775 2100 2    50   Input ~ 0
AREF
$Comp
L power:GND #PWR0117
U 1 1 61347A41
P 5075 2200
F 0 "#PWR0117" H 5075 1950 50  0001 C CNN
F 1 "GND" H 5080 2027 50  0000 C CNN
F 2 "" H 5075 2200 50  0001 C CNN
F 3 "" H 5075 2200 50  0001 C CNN
	1    5075 2200
	1    0    0    -1  
$EndComp
Wire Wire Line
	4775 2200 5075 2200
$Comp
L power:+3V3 #PWR0119
U 1 1 61347A48
P 5150 2000
F 0 "#PWR0119" H 5150 1850 50  0001 C CNN
F 1 "+3V3" V 5165 2128 50  0000 L CNN
F 2 "" H 5150 2000 50  0001 C CNN
F 3 "" H 5150 2000 50  0001 C CNN
	1    5150 2000
	1    0    0    -1  
$EndComp
Wire Wire Line
	4775 2000 5150 2000
Text GLabel 1075 5125 0    50   Input ~ 0
VBAT_EXT
$Comp
L power:GND #PWR0120
U 1 1 6140B58B
P 1075 5225
F 0 "#PWR0120" H 1075 4975 50  0001 C CNN
F 1 "GND" H 1080 5052 50  0000 C CNN
F 2 "" H 1075 5225 50  0001 C CNN
F 3 "" H 1075 5225 50  0001 C CNN
	1    1075 5225
	1    0    0    -1  
$EndComp
Text GLabel 3200 6050 2    50   Input ~ 0
VBUS
Text GLabel 4575 6175 0    50   Input ~ 0
A5
Text GLabel 4550 5100 0    50   Input ~ 0
A4
$Comp
L Connector:Conn_01x03_Female J8
U 1 1 614DA351
P 2925 4500
F 0 "J8" H 2953 4526 50  0000 L CNN
F 1 "Conn_01x03_Female" H 2953 4435 50  0000 L CNN
F 2 "Connector_PinSocket_2.54mm:PinSocket_1x03_P2.54mm_Vertical" H 2925 4500 50  0001 C CNN
F 3 "~" H 2925 4500 50  0001 C CNN
	1    2925 4500
	1    0    0    -1  
$EndComp
$Comp
L power:GND #PWR0105
U 1 1 614DCC4C
P 2725 4400
F 0 "#PWR0105" H 2725 4150 50  0001 C CNN
F 1 "GND" H 2730 4227 50  0000 C CNN
F 2 "" H 2725 4400 50  0001 C CNN
F 3 "" H 2725 4400 50  0001 C CNN
	1    2725 4400
	0    1    1    0   
$EndComp
Text GLabel 2725 4600 0    50   Input ~ 0
VBAT_EXT
Text GLabel 2725 4500 0    50   Input ~ 0
VBAT
Text GLabel 3600 7450 0    50   Input ~ 0
VIN_DCDC
Text Notes 2575 4250 0    79   ~ 0
SLIDE_SWITCH
Text Notes 7475 1625 0    79   ~ 0
AUX Pinout\n
$Comp
L Connector:Conn_01x08_Female J14
U 1 1 614D7099
P 8950 2550
F 0 "J14" H 8978 2526 50  0000 L CNN
F 1 "Conn_01x08_Female" H 8978 2435 50  0000 L CNN
F 2 "Connector_PinSocket_2.54mm:PinSocket_1x08_P2.54mm_Vertical" H 8950 2550 50  0001 C CNN
F 3 "~" H 8950 2550 50  0001 C CNN
	1    8950 2550
	1    0    0    -1  
$EndComp
$Comp
L power:GND #PWR0124
U 1 1 614FA1BB
P 8200 3700
F 0 "#PWR0124" H 8200 3450 50  0001 C CNN
F 1 "GND" H 8205 3527 50  0000 C CNN
F 2 "" H 8200 3700 50  0001 C CNN
F 3 "" H 8200 3700 50  0001 C CNN
	1    8200 3700
	1    0    0    -1  
$EndComp
$Comp
L power:+3V3 #PWR0125
U 1 1 614FA1C1
P 8425 3800
F 0 "#PWR0125" H 8425 3650 50  0001 C CNN
F 1 "+3V3" H 8440 3973 50  0000 C CNN
F 2 "" H 8425 3800 50  0001 C CNN
F 3 "" H 8425 3800 50  0001 C CNN
	1    8425 3800
	1    0    0    -1  
$EndComp
Text GLabel 8600 3900 0    50   Input ~ 0
SDA
Text GLabel 8600 4000 0    50   Input ~ 0
SCL
Wire Wire Line
	8600 3700 8200 3700
Wire Wire Line
	8600 3800 8425 3800
$Comp
L Connector:Conn_01x04_Female J17
U 1 1 614FA1CB
P 8800 3800
F 0 "J17" H 8828 3776 50  0000 L CNN
F 1 "Conn_01x04_Female" V 8975 3350 50  0000 L CNN
F 2 "Connector_JST:JST_SH_SM04B-SRSS-TB_1x04-1MP_P1.00mm_Horizontal" H 8800 3800 50  0001 C CNN
F 3 "~" H 8800 3800 50  0001 C CNN
	1    8800 3800
	1    0    0    -1  
$EndComp
Text Notes 7975 3450 0    79   ~ 0
QWIIC
$Comp
L power:GND #PWR0107
U 1 1 614D7D25
P 6900 5675
F 0 "#PWR0107" H 6900 5425 50  0001 C CNN
F 1 "GND" H 6905 5502 50  0000 C CNN
F 2 "" H 6900 5675 50  0001 C CNN
F 3 "" H 6900 5675 50  0001 C CNN
	1    6900 5675
	1    0    0    -1  
$EndComp
$Comp
L power:+3V3 #PWR0113
U 1 1 614D7D2B
P 7125 5775
F 0 "#PWR0113" H 7125 5625 50  0001 C CNN
F 1 "+3V3" H 7140 5948 50  0000 C CNN
F 2 "" H 7125 5775 50  0001 C CNN
F 3 "" H 7125 5775 50  0001 C CNN
	1    7125 5775
	1    0    0    -1  
$EndComp
Text GLabel 7300 5875 0    50   Input ~ 0
SDA
Text GLabel 7300 5975 0    50   Input ~ 0
SCL
Wire Wire Line
	7300 5675 6900 5675
Wire Wire Line
	7300 5775 7125 5775
$Comp
L Connector:Conn_01x04_Female J2
U 1 1 614D7D35
P 7500 5775
F 0 "J2" H 7528 5751 50  0000 L CNN
F 1 "Conn_01x04_Female" V 7675 5325 50  0000 L CNN
F 2 "Connector_JST:JST_SH_SM04B-SRSS-TB_1x04-1MP_P1.00mm_Horizontal" H 7500 5775 50  0001 C CNN
F 3 "~" H 7500 5775 50  0001 C CNN
	1    7500 5775
	1    0    0    -1  
$EndComp
Text Notes 6675 5425 0    79   ~ 0
QWIIC
$EndSCHEMATC
