%TF.GenerationSoftware,KiCad,Pcbnew,5.1.6-c6e7f7d~87~ubuntu18.04.1*%
%TF.CreationDate,2021-07-21T15:50:48-04:00*%
%TF.ProjectId,remote,72656d6f-7465-42e6-9b69-6361645f7063,rev?*%
%TF.SameCoordinates,Original*%
%TF.FileFunction,Paste,Bot*%
%TF.FilePolarity,Positive*%
%FSLAX46Y46*%
G04 Gerber Fmt 4.6, Leading zero omitted, Abs format (unit mm)*
G04 Created by KiCad (PCBNEW 5.1.6-c6e7f7d~87~ubuntu18.04.1) date 2021-07-21 15:50:48*
%MOMM*%
%LPD*%
G01*
G04 APERTURE LIST*
%ADD10R,1.550000X1.000000*%
%ADD11R,1.500000X1.500000*%
%ADD12R,1.750000X0.700000*%
%ADD13R,1.400000X0.800000*%
%ADD14R,1.000000X1.450000*%
%ADD15R,1.500000X0.800000*%
%ADD16R,1.500000X1.300000*%
%ADD17O,2.000000X1.000000*%
G04 APERTURE END LIST*
%TO.C,J6*%
G36*
G01*
X239975000Y31700000D02*
X241225000Y31700000D01*
G75*
G02*
X241375000Y31550000I0J-150000D01*
G01*
X241375000Y31250000D01*
G75*
G02*
X241225000Y31100000I-150000J0D01*
G01*
X239975000Y31100000D01*
G75*
G02*
X239825000Y31250000I0J150000D01*
G01*
X239825000Y31550000D01*
G75*
G02*
X239975000Y31700000I150000J0D01*
G01*
G37*
G36*
G01*
X239975000Y30700000D02*
X241225000Y30700000D01*
G75*
G02*
X241375000Y30550000I0J-150000D01*
G01*
X241375000Y30250000D01*
G75*
G02*
X241225000Y30100000I-150000J0D01*
G01*
X239975000Y30100000D01*
G75*
G02*
X239825000Y30250000I0J150000D01*
G01*
X239825000Y30550000D01*
G75*
G02*
X239975000Y30700000I150000J0D01*
G01*
G37*
G36*
G01*
X239975000Y29700000D02*
X241225000Y29700000D01*
G75*
G02*
X241375000Y29550000I0J-150000D01*
G01*
X241375000Y29250000D01*
G75*
G02*
X241225000Y29100000I-150000J0D01*
G01*
X239975000Y29100000D01*
G75*
G02*
X239825000Y29250000I0J150000D01*
G01*
X239825000Y29550000D01*
G75*
G02*
X239975000Y29700000I150000J0D01*
G01*
G37*
G36*
G01*
X239975000Y28700000D02*
X241225000Y28700000D01*
G75*
G02*
X241375000Y28550000I0J-150000D01*
G01*
X241375000Y28250000D01*
G75*
G02*
X241225000Y28100000I-150000J0D01*
G01*
X239975000Y28100000D01*
G75*
G02*
X239825000Y28250000I0J150000D01*
G01*
X239825000Y28550000D01*
G75*
G02*
X239975000Y28700000I150000J0D01*
G01*
G37*
G36*
G01*
X243824999Y33300000D02*
X245125001Y33300000D01*
G75*
G02*
X245375000Y33050001I0J-249999D01*
G01*
X245375000Y32349999D01*
G75*
G02*
X245125001Y32100000I-249999J0D01*
G01*
X243824999Y32100000D01*
G75*
G02*
X243575000Y32349999I0J249999D01*
G01*
X243575000Y33050001D01*
G75*
G02*
X243824999Y33300000I249999J0D01*
G01*
G37*
G36*
G01*
X243824999Y27700000D02*
X245125001Y27700000D01*
G75*
G02*
X245375000Y27450001I0J-249999D01*
G01*
X245375000Y26749999D01*
G75*
G02*
X245125001Y26500000I-249999J0D01*
G01*
X243824999Y26500000D01*
G75*
G02*
X243575000Y26749999I0J249999D01*
G01*
X243575000Y27450001D01*
G75*
G02*
X243824999Y27700000I249999J0D01*
G01*
G37*
%TD*%
D10*
%TO.C,J15*%
X232391000Y45784200D03*
D11*
X243066000Y45734200D03*
D12*
X243191000Y48184200D03*
X243191000Y49284200D03*
X243191000Y50384200D03*
X243191000Y51484200D03*
X243191000Y52584200D03*
X243191000Y53684200D03*
X243191000Y54784200D03*
D13*
X234816000Y45384200D03*
D14*
X233966000Y57009200D03*
D15*
X235466000Y57334200D03*
D16*
X243066000Y57084200D03*
D12*
X243191000Y55884200D03*
%TD*%
%TO.C,C5*%
G36*
G01*
X234050000Y60562500D02*
X234050000Y61037500D01*
G75*
G02*
X234287500Y61275000I237500J0D01*
G01*
X234862500Y61275000D01*
G75*
G02*
X235100000Y61037500I0J-237500D01*
G01*
X235100000Y60562500D01*
G75*
G02*
X234862500Y60325000I-237500J0D01*
G01*
X234287500Y60325000D01*
G75*
G02*
X234050000Y60562500I0J237500D01*
G01*
G37*
G36*
G01*
X232300000Y60562500D02*
X232300000Y61037500D01*
G75*
G02*
X232537500Y61275000I237500J0D01*
G01*
X233112500Y61275000D01*
G75*
G02*
X233350000Y61037500I0J-237500D01*
G01*
X233350000Y60562500D01*
G75*
G02*
X233112500Y60325000I-237500J0D01*
G01*
X232537500Y60325000D01*
G75*
G02*
X232300000Y60562500I0J237500D01*
G01*
G37*
%TD*%
D17*
%TO.C,U1*%
X219049600Y79248000D03*
X219049600Y81248000D03*
X219049600Y83248000D03*
X219049600Y85248000D03*
X219049600Y87248000D03*
X219049600Y89248000D03*
X219049600Y91248000D03*
X219049600Y93248000D03*
X235049600Y93248000D03*
X235049600Y91248000D03*
X235049600Y89248000D03*
X235049600Y87248000D03*
X235049600Y85248000D03*
X235049600Y83248000D03*
X235049600Y81248000D03*
X235049600Y79248000D03*
%TD*%
M02*
