%TF.GenerationSoftware,KiCad,Pcbnew,5.1.9-73d0e3b20d~88~ubuntu18.04.1*%
%TF.CreationDate,2021-05-13T18:16:41-04:00*%
%TF.ProjectId,remote,72656d6f-7465-42e6-9b69-6361645f7063,rev?*%
%TF.SameCoordinates,Original*%
%TF.FileFunction,Paste,Bot*%
%TF.FilePolarity,Positive*%
%FSLAX46Y46*%
G04 Gerber Fmt 4.6, Leading zero omitted, Abs format (unit mm)*
G04 Created by KiCad (PCBNEW 5.1.9-73d0e3b20d~88~ubuntu18.04.1) date 2021-05-13 18:16:41*
%MOMM*%
%LPD*%
G01*
G04 APERTURE LIST*
%ADD10R,0.550000X1.200000*%
%ADD11R,1.750000X0.700000*%
%ADD12R,1.500000X1.300000*%
%ADD13R,1.500000X0.800000*%
%ADD14R,1.000000X1.450000*%
%ADD15R,1.400000X0.800000*%
%ADD16R,1.500000X1.500000*%
%ADD17R,1.550000X1.000000*%
%ADD18R,0.900000X1.200000*%
%ADD19O,0.900000X2.500000*%
%ADD20O,2.500000X0.900000*%
%ADD21R,6.000000X6.000000*%
%ADD22R,2.209800X0.609600*%
%ADD23O,2.000000X1.000000*%
G04 APERTURE END LIST*
%TO.C,J6*%
G36*
G01*
X244556999Y16494400D02*
X245857001Y16494400D01*
G75*
G02*
X246107000Y16244401I0J-249999D01*
G01*
X246107000Y15544399D01*
G75*
G02*
X245857001Y15294400I-249999J0D01*
G01*
X244556999Y15294400D01*
G75*
G02*
X244307000Y15544399I0J249999D01*
G01*
X244307000Y16244401D01*
G75*
G02*
X244556999Y16494400I249999J0D01*
G01*
G37*
G36*
G01*
X244556999Y22094400D02*
X245857001Y22094400D01*
G75*
G02*
X246107000Y21844401I0J-249999D01*
G01*
X246107000Y21144399D01*
G75*
G02*
X245857001Y20894400I-249999J0D01*
G01*
X244556999Y20894400D01*
G75*
G02*
X244307000Y21144399I0J249999D01*
G01*
X244307000Y21844401D01*
G75*
G02*
X244556999Y22094400I249999J0D01*
G01*
G37*
G36*
G01*
X240707000Y17494400D02*
X241957000Y17494400D01*
G75*
G02*
X242107000Y17344400I0J-150000D01*
G01*
X242107000Y17044400D01*
G75*
G02*
X241957000Y16894400I-150000J0D01*
G01*
X240707000Y16894400D01*
G75*
G02*
X240557000Y17044400I0J150000D01*
G01*
X240557000Y17344400D01*
G75*
G02*
X240707000Y17494400I150000J0D01*
G01*
G37*
G36*
G01*
X240707000Y18494400D02*
X241957000Y18494400D01*
G75*
G02*
X242107000Y18344400I0J-150000D01*
G01*
X242107000Y18044400D01*
G75*
G02*
X241957000Y17894400I-150000J0D01*
G01*
X240707000Y17894400D01*
G75*
G02*
X240557000Y18044400I0J150000D01*
G01*
X240557000Y18344400D01*
G75*
G02*
X240707000Y18494400I150000J0D01*
G01*
G37*
G36*
G01*
X240707000Y19494400D02*
X241957000Y19494400D01*
G75*
G02*
X242107000Y19344400I0J-150000D01*
G01*
X242107000Y19044400D01*
G75*
G02*
X241957000Y18894400I-150000J0D01*
G01*
X240707000Y18894400D01*
G75*
G02*
X240557000Y19044400I0J150000D01*
G01*
X240557000Y19344400D01*
G75*
G02*
X240707000Y19494400I150000J0D01*
G01*
G37*
G36*
G01*
X240707000Y20494400D02*
X241957000Y20494400D01*
G75*
G02*
X242107000Y20344400I0J-150000D01*
G01*
X242107000Y20044400D01*
G75*
G02*
X241957000Y19894400I-150000J0D01*
G01*
X240707000Y19894400D01*
G75*
G02*
X240557000Y20044400I0J150000D01*
G01*
X240557000Y20344400D01*
G75*
G02*
X240707000Y20494400I150000J0D01*
G01*
G37*
%TD*%
%TO.C,R23*%
G36*
G01*
X216046800Y27550100D02*
X216046800Y28025100D01*
G75*
G02*
X216284300Y28262600I237500J0D01*
G01*
X216859300Y28262600D01*
G75*
G02*
X217096800Y28025100I0J-237500D01*
G01*
X217096800Y27550100D01*
G75*
G02*
X216859300Y27312600I-237500J0D01*
G01*
X216284300Y27312600D01*
G75*
G02*
X216046800Y27550100I0J237500D01*
G01*
G37*
G36*
G01*
X214296800Y27550100D02*
X214296800Y28025100D01*
G75*
G02*
X214534300Y28262600I237500J0D01*
G01*
X215109300Y28262600D01*
G75*
G02*
X215346800Y28025100I0J-237500D01*
G01*
X215346800Y27550100D01*
G75*
G02*
X215109300Y27312600I-237500J0D01*
G01*
X214534300Y27312600D01*
G75*
G02*
X214296800Y27550100I0J237500D01*
G01*
G37*
%TD*%
%TO.C,R21*%
G36*
G01*
X216007200Y3437900D02*
X216007200Y2962900D01*
G75*
G02*
X215769700Y2725400I-237500J0D01*
G01*
X215194700Y2725400D01*
G75*
G02*
X214957200Y2962900I0J237500D01*
G01*
X214957200Y3437900D01*
G75*
G02*
X215194700Y3675400I237500J0D01*
G01*
X215769700Y3675400D01*
G75*
G02*
X216007200Y3437900I0J-237500D01*
G01*
G37*
G36*
G01*
X217757200Y3437900D02*
X217757200Y2962900D01*
G75*
G02*
X217519700Y2725400I-237500J0D01*
G01*
X216944700Y2725400D01*
G75*
G02*
X216707200Y2962900I0J237500D01*
G01*
X216707200Y3437900D01*
G75*
G02*
X216944700Y3675400I237500J0D01*
G01*
X217519700Y3675400D01*
G75*
G02*
X217757200Y3437900I0J-237500D01*
G01*
G37*
%TD*%
%TO.C,R19*%
G36*
G01*
X216250000Y22825700D02*
X216250000Y23300700D01*
G75*
G02*
X216487500Y23538200I237500J0D01*
G01*
X217062500Y23538200D01*
G75*
G02*
X217300000Y23300700I0J-237500D01*
G01*
X217300000Y22825700D01*
G75*
G02*
X217062500Y22588200I-237500J0D01*
G01*
X216487500Y22588200D01*
G75*
G02*
X216250000Y22825700I0J237500D01*
G01*
G37*
G36*
G01*
X214500000Y22825700D02*
X214500000Y23300700D01*
G75*
G02*
X214737500Y23538200I237500J0D01*
G01*
X215312500Y23538200D01*
G75*
G02*
X215550000Y23300700I0J-237500D01*
G01*
X215550000Y22825700D01*
G75*
G02*
X215312500Y22588200I-237500J0D01*
G01*
X214737500Y22588200D01*
G75*
G02*
X214500000Y22825700I0J237500D01*
G01*
G37*
%TD*%
%TO.C,R17*%
G36*
G01*
X215956400Y8213100D02*
X215956400Y7738100D01*
G75*
G02*
X215718900Y7500600I-237500J0D01*
G01*
X215143900Y7500600D01*
G75*
G02*
X214906400Y7738100I0J237500D01*
G01*
X214906400Y8213100D01*
G75*
G02*
X215143900Y8450600I237500J0D01*
G01*
X215718900Y8450600D01*
G75*
G02*
X215956400Y8213100I0J-237500D01*
G01*
G37*
G36*
G01*
X217706400Y8213100D02*
X217706400Y7738100D01*
G75*
G02*
X217468900Y7500600I-237500J0D01*
G01*
X216893900Y7500600D01*
G75*
G02*
X216656400Y7738100I0J237500D01*
G01*
X216656400Y8213100D01*
G75*
G02*
X216893900Y8450600I237500J0D01*
G01*
X217468900Y8450600D01*
G75*
G02*
X217706400Y8213100I0J-237500D01*
G01*
G37*
%TD*%
%TO.C,C7*%
G36*
G01*
X186661600Y36795700D02*
X186661600Y37270700D01*
G75*
G02*
X186899100Y37508200I237500J0D01*
G01*
X187474100Y37508200D01*
G75*
G02*
X187711600Y37270700I0J-237500D01*
G01*
X187711600Y36795700D01*
G75*
G02*
X187474100Y36558200I-237500J0D01*
G01*
X186899100Y36558200D01*
G75*
G02*
X186661600Y36795700I0J237500D01*
G01*
G37*
G36*
G01*
X188411600Y36795700D02*
X188411600Y37270700D01*
G75*
G02*
X188649100Y37508200I237500J0D01*
G01*
X189224100Y37508200D01*
G75*
G02*
X189461600Y37270700I0J-237500D01*
G01*
X189461600Y36795700D01*
G75*
G02*
X189224100Y36558200I-237500J0D01*
G01*
X188649100Y36558200D01*
G75*
G02*
X188411600Y36795700I0J237500D01*
G01*
G37*
%TD*%
%TO.C,C6*%
G36*
G01*
X186407600Y62094100D02*
X186407600Y62569100D01*
G75*
G02*
X186645100Y62806600I237500J0D01*
G01*
X187220100Y62806600D01*
G75*
G02*
X187457600Y62569100I0J-237500D01*
G01*
X187457600Y62094100D01*
G75*
G02*
X187220100Y61856600I-237500J0D01*
G01*
X186645100Y61856600D01*
G75*
G02*
X186407600Y62094100I0J237500D01*
G01*
G37*
G36*
G01*
X188157600Y62094100D02*
X188157600Y62569100D01*
G75*
G02*
X188395100Y62806600I237500J0D01*
G01*
X188970100Y62806600D01*
G75*
G02*
X189207600Y62569100I0J-237500D01*
G01*
X189207600Y62094100D01*
G75*
G02*
X188970100Y61856600I-237500J0D01*
G01*
X188395100Y61856600D01*
G75*
G02*
X188157600Y62094100I0J237500D01*
G01*
G37*
%TD*%
D10*
%TO.C,U2*%
X189550000Y-8767700D03*
X191450000Y-8767700D03*
X191450000Y-6167500D03*
X190500000Y-6167500D03*
X189550000Y-6167500D03*
%TD*%
D11*
%TO.C,J15*%
X243191000Y55884200D03*
D12*
X243066000Y57084200D03*
D13*
X235466000Y57334200D03*
D14*
X233966000Y57009200D03*
D15*
X234816000Y45384200D03*
D11*
X243191000Y54784200D03*
X243191000Y53684200D03*
X243191000Y52584200D03*
X243191000Y51484200D03*
X243191000Y50384200D03*
X243191000Y49284200D03*
X243191000Y48184200D03*
D16*
X243066000Y45734200D03*
D17*
X232391000Y45784200D03*
%TD*%
%TO.C,R15*%
G36*
G01*
X219439500Y49778400D02*
X218964500Y49778400D01*
G75*
G02*
X218727000Y50015900I0J237500D01*
G01*
X218727000Y50590900D01*
G75*
G02*
X218964500Y50828400I237500J0D01*
G01*
X219439500Y50828400D01*
G75*
G02*
X219677000Y50590900I0J-237500D01*
G01*
X219677000Y50015900D01*
G75*
G02*
X219439500Y49778400I-237500J0D01*
G01*
G37*
G36*
G01*
X219439500Y48028400D02*
X218964500Y48028400D01*
G75*
G02*
X218727000Y48265900I0J237500D01*
G01*
X218727000Y48840900D01*
G75*
G02*
X218964500Y49078400I237500J0D01*
G01*
X219439500Y49078400D01*
G75*
G02*
X219677000Y48840900I0J-237500D01*
G01*
X219677000Y48265900D01*
G75*
G02*
X219439500Y48028400I-237500J0D01*
G01*
G37*
%TD*%
D18*
%TO.C,D1*%
X196520800Y-6451600D03*
X199820800Y-6451600D03*
%TD*%
%TO.C,C5*%
G36*
G01*
X229508800Y59401700D02*
X229508800Y59876700D01*
G75*
G02*
X229746300Y60114200I237500J0D01*
G01*
X230321300Y60114200D01*
G75*
G02*
X230558800Y59876700I0J-237500D01*
G01*
X230558800Y59401700D01*
G75*
G02*
X230321300Y59164200I-237500J0D01*
G01*
X229746300Y59164200D01*
G75*
G02*
X229508800Y59401700I0J237500D01*
G01*
G37*
G36*
G01*
X227758800Y59401700D02*
X227758800Y59876700D01*
G75*
G02*
X227996300Y60114200I237500J0D01*
G01*
X228571300Y60114200D01*
G75*
G02*
X228808800Y59876700I0J-237500D01*
G01*
X228808800Y59401700D01*
G75*
G02*
X228571300Y59164200I-237500J0D01*
G01*
X227996300Y59164200D01*
G75*
G02*
X227758800Y59401700I0J237500D01*
G01*
G37*
%TD*%
%TO.C,R5*%
G36*
G01*
X223935300Y49921200D02*
X223460300Y49921200D01*
G75*
G02*
X223222800Y50158700I0J237500D01*
G01*
X223222800Y50733700D01*
G75*
G02*
X223460300Y50971200I237500J0D01*
G01*
X223935300Y50971200D01*
G75*
G02*
X224172800Y50733700I0J-237500D01*
G01*
X224172800Y50158700D01*
G75*
G02*
X223935300Y49921200I-237500J0D01*
G01*
G37*
G36*
G01*
X223935300Y48171200D02*
X223460300Y48171200D01*
G75*
G02*
X223222800Y48408700I0J237500D01*
G01*
X223222800Y48983700D01*
G75*
G02*
X223460300Y49221200I237500J0D01*
G01*
X223935300Y49221200D01*
G75*
G02*
X224172800Y48983700I0J-237500D01*
G01*
X224172800Y48408700D01*
G75*
G02*
X223935300Y48171200I-237500J0D01*
G01*
G37*
%TD*%
%TO.C,R3*%
G36*
G01*
X213344800Y64684900D02*
X213344800Y65159900D01*
G75*
G02*
X213582300Y65397400I237500J0D01*
G01*
X214157300Y65397400D01*
G75*
G02*
X214394800Y65159900I0J-237500D01*
G01*
X214394800Y64684900D01*
G75*
G02*
X214157300Y64447400I-237500J0D01*
G01*
X213582300Y64447400D01*
G75*
G02*
X213344800Y64684900I0J237500D01*
G01*
G37*
G36*
G01*
X211594800Y64684900D02*
X211594800Y65159900D01*
G75*
G02*
X211832300Y65397400I237500J0D01*
G01*
X212407300Y65397400D01*
G75*
G02*
X212644800Y65159900I0J-237500D01*
G01*
X212644800Y64684900D01*
G75*
G02*
X212407300Y64447400I-237500J0D01*
G01*
X211832300Y64447400D01*
G75*
G02*
X211594800Y64684900I0J237500D01*
G01*
G37*
%TD*%
%TO.C,R1*%
G36*
G01*
X213344800Y68825100D02*
X213344800Y69300100D01*
G75*
G02*
X213582300Y69537600I237500J0D01*
G01*
X214157300Y69537600D01*
G75*
G02*
X214394800Y69300100I0J-237500D01*
G01*
X214394800Y68825100D01*
G75*
G02*
X214157300Y68587600I-237500J0D01*
G01*
X213582300Y68587600D01*
G75*
G02*
X213344800Y68825100I0J237500D01*
G01*
G37*
G36*
G01*
X211594800Y68825100D02*
X211594800Y69300100D01*
G75*
G02*
X211832300Y69537600I237500J0D01*
G01*
X212407300Y69537600D01*
G75*
G02*
X212644800Y69300100I0J-237500D01*
G01*
X212644800Y68825100D01*
G75*
G02*
X212407300Y68587600I-237500J0D01*
G01*
X211832300Y68587600D01*
G75*
G02*
X211594800Y68825100I0J237500D01*
G01*
G37*
%TD*%
%TO.C,C1*%
G36*
G01*
X201444400Y-6739900D02*
X201444400Y-6264900D01*
G75*
G02*
X201681900Y-6027400I237500J0D01*
G01*
X202256900Y-6027400D01*
G75*
G02*
X202494400Y-6264900I0J-237500D01*
G01*
X202494400Y-6739900D01*
G75*
G02*
X202256900Y-6977400I-237500J0D01*
G01*
X201681900Y-6977400D01*
G75*
G02*
X201444400Y-6739900I0J237500D01*
G01*
G37*
G36*
G01*
X203194400Y-6739900D02*
X203194400Y-6264900D01*
G75*
G02*
X203431900Y-6027400I237500J0D01*
G01*
X204006900Y-6027400D01*
G75*
G02*
X204244400Y-6264900I0J-237500D01*
G01*
X204244400Y-6739900D01*
G75*
G02*
X204006900Y-6977400I-237500J0D01*
G01*
X203431900Y-6977400D01*
G75*
G02*
X203194400Y-6739900I0J237500D01*
G01*
G37*
%TD*%
%TO.C,R11*%
G36*
G01*
X201314800Y70933300D02*
X201314800Y71408300D01*
G75*
G02*
X201552300Y71645800I237500J0D01*
G01*
X202127300Y71645800D01*
G75*
G02*
X202364800Y71408300I0J-237500D01*
G01*
X202364800Y70933300D01*
G75*
G02*
X202127300Y70695800I-237500J0D01*
G01*
X201552300Y70695800D01*
G75*
G02*
X201314800Y70933300I0J237500D01*
G01*
G37*
G36*
G01*
X199564800Y70933300D02*
X199564800Y71408300D01*
G75*
G02*
X199802300Y71645800I237500J0D01*
G01*
X200377300Y71645800D01*
G75*
G02*
X200614800Y71408300I0J-237500D01*
G01*
X200614800Y70933300D01*
G75*
G02*
X200377300Y70695800I-237500J0D01*
G01*
X199802300Y70695800D01*
G75*
G02*
X199564800Y70933300I0J237500D01*
G01*
G37*
%TD*%
%TO.C,R10*%
G36*
G01*
X193869300Y-8274800D02*
X194344300Y-8274800D01*
G75*
G02*
X194581800Y-8512300I0J-237500D01*
G01*
X194581800Y-9087300D01*
G75*
G02*
X194344300Y-9324800I-237500J0D01*
G01*
X193869300Y-9324800D01*
G75*
G02*
X193631800Y-9087300I0J237500D01*
G01*
X193631800Y-8512300D01*
G75*
G02*
X193869300Y-8274800I237500J0D01*
G01*
G37*
G36*
G01*
X193869300Y-6524800D02*
X194344300Y-6524800D01*
G75*
G02*
X194581800Y-6762300I0J-237500D01*
G01*
X194581800Y-7337300D01*
G75*
G02*
X194344300Y-7574800I-237500J0D01*
G01*
X193869300Y-7574800D01*
G75*
G02*
X193631800Y-7337300I0J237500D01*
G01*
X193631800Y-6762300D01*
G75*
G02*
X193869300Y-6524800I237500J0D01*
G01*
G37*
%TD*%
%TO.C,R9*%
G36*
G01*
X208105200Y-5452100D02*
X208105200Y-5927100D01*
G75*
G02*
X207867700Y-6164600I-237500J0D01*
G01*
X207292700Y-6164600D01*
G75*
G02*
X207055200Y-5927100I0J237500D01*
G01*
X207055200Y-5452100D01*
G75*
G02*
X207292700Y-5214600I237500J0D01*
G01*
X207867700Y-5214600D01*
G75*
G02*
X208105200Y-5452100I0J-237500D01*
G01*
G37*
G36*
G01*
X206355200Y-5452100D02*
X206355200Y-5927100D01*
G75*
G02*
X206117700Y-6164600I-237500J0D01*
G01*
X205542700Y-6164600D01*
G75*
G02*
X205305200Y-5927100I0J237500D01*
G01*
X205305200Y-5452100D01*
G75*
G02*
X205542700Y-5214600I237500J0D01*
G01*
X206117700Y-5214600D01*
G75*
G02*
X206355200Y-5452100I0J-237500D01*
G01*
G37*
%TD*%
%TO.C,C4*%
G36*
G01*
X187689500Y-8766000D02*
X187214500Y-8766000D01*
G75*
G02*
X186977000Y-8528500I0J237500D01*
G01*
X186977000Y-7953500D01*
G75*
G02*
X187214500Y-7716000I237500J0D01*
G01*
X187689500Y-7716000D01*
G75*
G02*
X187927000Y-7953500I0J-237500D01*
G01*
X187927000Y-8528500D01*
G75*
G02*
X187689500Y-8766000I-237500J0D01*
G01*
G37*
G36*
G01*
X187689500Y-7016000D02*
X187214500Y-7016000D01*
G75*
G02*
X186977000Y-6778500I0J237500D01*
G01*
X186977000Y-6203500D01*
G75*
G02*
X187214500Y-5966000I237500J0D01*
G01*
X187689500Y-5966000D01*
G75*
G02*
X187927000Y-6203500I0J-237500D01*
G01*
X187927000Y-6778500D01*
G75*
G02*
X187689500Y-7016000I-237500J0D01*
G01*
G37*
%TD*%
%TO.C,C3*%
G36*
G01*
X189817200Y1609100D02*
X189817200Y1134100D01*
G75*
G02*
X189579700Y896600I-237500J0D01*
G01*
X189004700Y896600D01*
G75*
G02*
X188767200Y1134100I0J237500D01*
G01*
X188767200Y1609100D01*
G75*
G02*
X189004700Y1846600I237500J0D01*
G01*
X189579700Y1846600D01*
G75*
G02*
X189817200Y1609100I0J-237500D01*
G01*
G37*
G36*
G01*
X188067200Y1609100D02*
X188067200Y1134100D01*
G75*
G02*
X187829700Y896600I-237500J0D01*
G01*
X187254700Y896600D01*
G75*
G02*
X187017200Y1134100I0J237500D01*
G01*
X187017200Y1609100D01*
G75*
G02*
X187254700Y1846600I237500J0D01*
G01*
X187829700Y1846600D01*
G75*
G02*
X188067200Y1609100I0J-237500D01*
G01*
G37*
%TD*%
%TO.C,C2*%
G36*
G01*
X189715600Y5774700D02*
X189715600Y5299700D01*
G75*
G02*
X189478100Y5062200I-237500J0D01*
G01*
X188903100Y5062200D01*
G75*
G02*
X188665600Y5299700I0J237500D01*
G01*
X188665600Y5774700D01*
G75*
G02*
X188903100Y6012200I237500J0D01*
G01*
X189478100Y6012200D01*
G75*
G02*
X189715600Y5774700I0J-237500D01*
G01*
G37*
G36*
G01*
X187965600Y5774700D02*
X187965600Y5299700D01*
G75*
G02*
X187728100Y5062200I-237500J0D01*
G01*
X187153100Y5062200D01*
G75*
G02*
X186915600Y5299700I0J237500D01*
G01*
X186915600Y5774700D01*
G75*
G02*
X187153100Y6012200I237500J0D01*
G01*
X187728100Y6012200D01*
G75*
G02*
X187965600Y5774700I0J-237500D01*
G01*
G37*
%TD*%
D19*
%TO.C,X1*%
X192717600Y41241200D03*
X193987600Y41241200D03*
X195257600Y41241200D03*
X196527600Y41241200D03*
X197797600Y41241200D03*
X199067600Y41241200D03*
X200337600Y41241200D03*
X201607600Y41241200D03*
X202877600Y41241200D03*
X204147600Y41241200D03*
X205417600Y41241200D03*
X206687600Y41241200D03*
X207957600Y41241200D03*
X209227600Y41241200D03*
D20*
X210717600Y44526200D03*
X210717600Y45796200D03*
X210717600Y47066200D03*
X210717600Y48336200D03*
X210717600Y49606200D03*
X210717600Y50876200D03*
X210717600Y52146200D03*
X210717600Y53416200D03*
X210717600Y54686200D03*
X210717600Y55956200D03*
D19*
X209227600Y59241200D03*
X207957600Y59241200D03*
X206687600Y59241200D03*
X205417600Y59241200D03*
X204147600Y59241200D03*
X202877600Y59241200D03*
X201607600Y59241200D03*
X200337600Y59241200D03*
X199067600Y59241200D03*
X197797600Y59241200D03*
X196527600Y59241200D03*
X195257600Y59241200D03*
X193987600Y59241200D03*
X192717600Y59241200D03*
D21*
X200417600Y50541200D03*
%TD*%
D10*
%TO.C,IC1*%
X201711600Y63774800D03*
X200761600Y63774800D03*
X199811600Y63774800D03*
X199811600Y66374800D03*
X201711600Y66374800D03*
%TD*%
D22*
%TO.C,EC1*%
X196418200Y88214200D03*
X196418200Y89484200D03*
X196418200Y90754200D03*
X196418200Y92024200D03*
X201650600Y92024200D03*
X201650600Y90754200D03*
X201650600Y89484200D03*
X201650600Y88214200D03*
%TD*%
D23*
%TO.C,U1*%
X235049600Y79248000D03*
X235049600Y81248000D03*
X235049600Y83248000D03*
X235049600Y85248000D03*
X235049600Y87248000D03*
X235049600Y89248000D03*
X235049600Y91248000D03*
X235049600Y93248000D03*
X219049600Y93248000D03*
X219049600Y91248000D03*
X219049600Y89248000D03*
X219049600Y87248000D03*
X219049600Y85248000D03*
X219049600Y83248000D03*
X219049600Y81248000D03*
X219049600Y79248000D03*
%TD*%
%TO.C,J11*%
G36*
G01*
X228381200Y-17379399D02*
X228381200Y-18679401D01*
G75*
G02*
X228131201Y-18929400I-249999J0D01*
G01*
X227431199Y-18929400D01*
G75*
G02*
X227181200Y-18679401I0J249999D01*
G01*
X227181200Y-17379399D01*
G75*
G02*
X227431199Y-17129400I249999J0D01*
G01*
X228131201Y-17129400D01*
G75*
G02*
X228381200Y-17379399I0J-249999D01*
G01*
G37*
G36*
G01*
X233981200Y-17379399D02*
X233981200Y-18679401D01*
G75*
G02*
X233731201Y-18929400I-249999J0D01*
G01*
X233031199Y-18929400D01*
G75*
G02*
X232781200Y-18679401I0J249999D01*
G01*
X232781200Y-17379399D01*
G75*
G02*
X233031199Y-17129400I249999J0D01*
G01*
X233731201Y-17129400D01*
G75*
G02*
X233981200Y-17379399I0J-249999D01*
G01*
G37*
G36*
G01*
X229381200Y-13529400D02*
X229381200Y-14779400D01*
G75*
G02*
X229231200Y-14929400I-150000J0D01*
G01*
X228931200Y-14929400D01*
G75*
G02*
X228781200Y-14779400I0J150000D01*
G01*
X228781200Y-13529400D01*
G75*
G02*
X228931200Y-13379400I150000J0D01*
G01*
X229231200Y-13379400D01*
G75*
G02*
X229381200Y-13529400I0J-150000D01*
G01*
G37*
G36*
G01*
X230381200Y-13529400D02*
X230381200Y-14779400D01*
G75*
G02*
X230231200Y-14929400I-150000J0D01*
G01*
X229931200Y-14929400D01*
G75*
G02*
X229781200Y-14779400I0J150000D01*
G01*
X229781200Y-13529400D01*
G75*
G02*
X229931200Y-13379400I150000J0D01*
G01*
X230231200Y-13379400D01*
G75*
G02*
X230381200Y-13529400I0J-150000D01*
G01*
G37*
G36*
G01*
X231381200Y-13529400D02*
X231381200Y-14779400D01*
G75*
G02*
X231231200Y-14929400I-150000J0D01*
G01*
X230931200Y-14929400D01*
G75*
G02*
X230781200Y-14779400I0J150000D01*
G01*
X230781200Y-13529400D01*
G75*
G02*
X230931200Y-13379400I150000J0D01*
G01*
X231231200Y-13379400D01*
G75*
G02*
X231381200Y-13529400I0J-150000D01*
G01*
G37*
G36*
G01*
X232381200Y-13529400D02*
X232381200Y-14779400D01*
G75*
G02*
X232231200Y-14929400I-150000J0D01*
G01*
X231931200Y-14929400D01*
G75*
G02*
X231781200Y-14779400I0J150000D01*
G01*
X231781200Y-13529400D01*
G75*
G02*
X231931200Y-13379400I150000J0D01*
G01*
X232231200Y-13379400D01*
G75*
G02*
X232381200Y-13529400I0J-150000D01*
G01*
G37*
%TD*%
M02*
