%TF.GenerationSoftware,KiCad,Pcbnew,5.1.6-c6e7f7d~87~ubuntu18.04.1*%
%TF.CreationDate,2021-08-30T08:39:13-04:00*%
%TF.ProjectId,remote,72656d6f-7465-42e6-9b69-6361645f7063,rev?*%
%TF.SameCoordinates,Original*%
%TF.FileFunction,Legend,Top*%
%TF.FilePolarity,Positive*%
%FSLAX46Y46*%
G04 Gerber Fmt 4.6, Leading zero omitted, Abs format (unit mm)*
G04 Created by KiCad (PCBNEW 5.1.6-c6e7f7d~87~ubuntu18.04.1) date 2021-08-30 08:39:13*
%MOMM*%
%LPD*%
G01*
G04 APERTURE LIST*
%ADD10C,0.150000*%
%ADD11C,0.120000*%
G04 APERTURE END LIST*
D10*
X205485714Y29635714D02*
X205085714Y29635714D01*
X205085714Y29007142D02*
X205085714Y30207142D01*
X205657142Y30207142D01*
X206285714Y29007142D02*
X206171428Y29064285D01*
X206114285Y29121428D01*
X206057142Y29235714D01*
X206057142Y29578571D01*
X206114285Y29692857D01*
X206171428Y29750000D01*
X206285714Y29807142D01*
X206457142Y29807142D01*
X206571428Y29750000D01*
X206628571Y29692857D01*
X206685714Y29578571D01*
X206685714Y29235714D01*
X206628571Y29121428D01*
X206571428Y29064285D01*
X206457142Y29007142D01*
X206285714Y29007142D01*
X207200000Y29007142D02*
X207200000Y29807142D01*
X207200000Y29578571D02*
X207257142Y29692857D01*
X207314285Y29750000D01*
X207428571Y29807142D01*
X207542857Y29807142D01*
X209371428Y29807142D02*
X209371428Y29007142D01*
X208857142Y29807142D02*
X208857142Y29178571D01*
X208914285Y29064285D01*
X209028571Y29007142D01*
X209200000Y29007142D01*
X209314285Y29064285D01*
X209371428Y29121428D01*
X209885714Y29064285D02*
X210000000Y29007142D01*
X210228571Y29007142D01*
X210342857Y29064285D01*
X210400000Y29178571D01*
X210400000Y29235714D01*
X210342857Y29350000D01*
X210228571Y29407142D01*
X210057142Y29407142D01*
X209942857Y29464285D01*
X209885714Y29578571D01*
X209885714Y29635714D01*
X209942857Y29750000D01*
X210057142Y29807142D01*
X210228571Y29807142D01*
X210342857Y29750000D01*
X211428571Y29007142D02*
X211428571Y29635714D01*
X211371428Y29750000D01*
X211257142Y29807142D01*
X211028571Y29807142D01*
X210914285Y29750000D01*
X211428571Y29064285D02*
X211314285Y29007142D01*
X211028571Y29007142D01*
X210914285Y29064285D01*
X210857142Y29178571D01*
X210857142Y29292857D01*
X210914285Y29407142D01*
X211028571Y29464285D01*
X211314285Y29464285D01*
X211428571Y29521428D01*
X212514285Y29807142D02*
X212514285Y28835714D01*
X212457142Y28721428D01*
X212400000Y28664285D01*
X212285714Y28607142D01*
X212114285Y28607142D01*
X212000000Y28664285D01*
X212514285Y29064285D02*
X212400000Y29007142D01*
X212171428Y29007142D01*
X212057142Y29064285D01*
X212000000Y29121428D01*
X211942857Y29235714D01*
X211942857Y29578571D01*
X212000000Y29692857D01*
X212057142Y29750000D01*
X212171428Y29807142D01*
X212400000Y29807142D01*
X212514285Y29750000D01*
X213542857Y29064285D02*
X213428571Y29007142D01*
X213200000Y29007142D01*
X213085714Y29064285D01*
X213028571Y29178571D01*
X213028571Y29635714D01*
X213085714Y29750000D01*
X213200000Y29807142D01*
X213428571Y29807142D01*
X213542857Y29750000D01*
X213600000Y29635714D01*
X213600000Y29521428D01*
X213028571Y29407142D01*
X216000000Y29007142D02*
X215942857Y29007142D01*
X215828571Y29064285D01*
X215657142Y29235714D01*
X215371428Y29578571D01*
X215257142Y29750000D01*
X215200000Y29921428D01*
X215200000Y30035714D01*
X215257142Y30150000D01*
X215371428Y30207142D01*
X215428571Y30207142D01*
X215542857Y30150000D01*
X215600000Y30035714D01*
X215600000Y29978571D01*
X215542857Y29864285D01*
X215485714Y29807142D01*
X215142857Y29578571D01*
X215085714Y29521428D01*
X215028571Y29407142D01*
X215028571Y29235714D01*
X215085714Y29121428D01*
X215142857Y29064285D01*
X215257142Y29007142D01*
X215428571Y29007142D01*
X215542857Y29064285D01*
X215600000Y29121428D01*
X215771428Y29350000D01*
X215828571Y29521428D01*
X215828571Y29635714D01*
X217942857Y29064285D02*
X217828571Y29007142D01*
X217600000Y29007142D01*
X217485714Y29064285D01*
X217428571Y29121428D01*
X217371428Y29235714D01*
X217371428Y29578571D01*
X217428571Y29692857D01*
X217485714Y29750000D01*
X217600000Y29807142D01*
X217828571Y29807142D01*
X217942857Y29750000D01*
X218971428Y29007142D02*
X218971428Y29635714D01*
X218914285Y29750000D01*
X218800000Y29807142D01*
X218571428Y29807142D01*
X218457142Y29750000D01*
X218971428Y29064285D02*
X218857142Y29007142D01*
X218571428Y29007142D01*
X218457142Y29064285D01*
X218400000Y29178571D01*
X218400000Y29292857D01*
X218457142Y29407142D01*
X218571428Y29464285D01*
X218857142Y29464285D01*
X218971428Y29521428D01*
X219714285Y29007142D02*
X219600000Y29064285D01*
X219542857Y29178571D01*
X219542857Y30207142D01*
X220171428Y29007142D02*
X220171428Y29807142D01*
X220171428Y30207142D02*
X220114285Y30150000D01*
X220171428Y30092857D01*
X220228571Y30150000D01*
X220171428Y30207142D01*
X220171428Y30092857D01*
X220742857Y29007142D02*
X220742857Y30207142D01*
X220742857Y29750000D02*
X220857142Y29807142D01*
X221085714Y29807142D01*
X221200000Y29750000D01*
X221257142Y29692857D01*
X221314285Y29578571D01*
X221314285Y29235714D01*
X221257142Y29121428D01*
X221200000Y29064285D01*
X221085714Y29007142D01*
X220857142Y29007142D01*
X220742857Y29064285D01*
X221828571Y29007142D02*
X221828571Y29807142D01*
X221828571Y29578571D02*
X221885714Y29692857D01*
X221942857Y29750000D01*
X222057142Y29807142D01*
X222171428Y29807142D01*
X223085714Y29007142D02*
X223085714Y29635714D01*
X223028571Y29750000D01*
X222914285Y29807142D01*
X222685714Y29807142D01*
X222571428Y29750000D01*
X223085714Y29064285D02*
X222971428Y29007142D01*
X222685714Y29007142D01*
X222571428Y29064285D01*
X222514285Y29178571D01*
X222514285Y29292857D01*
X222571428Y29407142D01*
X222685714Y29464285D01*
X222971428Y29464285D01*
X223085714Y29521428D01*
X223485714Y29807142D02*
X223942857Y29807142D01*
X223657142Y30207142D02*
X223657142Y29178571D01*
X223714285Y29064285D01*
X223828571Y29007142D01*
X223942857Y29007142D01*
X224342857Y29007142D02*
X224342857Y29807142D01*
X224342857Y30207142D02*
X224285714Y30150000D01*
X224342857Y30092857D01*
X224400000Y30150000D01*
X224342857Y30207142D01*
X224342857Y30092857D01*
X225085714Y29007142D02*
X224971428Y29064285D01*
X224914285Y29121428D01*
X224857142Y29235714D01*
X224857142Y29578571D01*
X224914285Y29692857D01*
X224971428Y29750000D01*
X225085714Y29807142D01*
X225257142Y29807142D01*
X225371428Y29750000D01*
X225428571Y29692857D01*
X225485714Y29578571D01*
X225485714Y29235714D01*
X225428571Y29121428D01*
X225371428Y29064285D01*
X225257142Y29007142D01*
X225085714Y29007142D01*
X226000000Y29807142D02*
X226000000Y29007142D01*
X226000000Y29692857D02*
X226057142Y29750000D01*
X226171428Y29807142D01*
X226342857Y29807142D01*
X226457142Y29750000D01*
X226514285Y29635714D01*
X226514285Y29007142D01*
X207428571Y27857142D02*
X207428571Y26885714D01*
X207371428Y26771428D01*
X207314285Y26714285D01*
X207200000Y26657142D01*
X207028571Y26657142D01*
X206914285Y26714285D01*
X207428571Y27114285D02*
X207314285Y27057142D01*
X207085714Y27057142D01*
X206971428Y27114285D01*
X206914285Y27171428D01*
X206857142Y27285714D01*
X206857142Y27628571D01*
X206914285Y27742857D01*
X206971428Y27800000D01*
X207085714Y27857142D01*
X207314285Y27857142D01*
X207428571Y27800000D01*
X208514285Y27857142D02*
X208514285Y27057142D01*
X208000000Y27857142D02*
X208000000Y27228571D01*
X208057142Y27114285D01*
X208171428Y27057142D01*
X208342857Y27057142D01*
X208457142Y27114285D01*
X208514285Y27171428D01*
X209085714Y27057142D02*
X209085714Y27857142D01*
X209085714Y28257142D02*
X209028571Y28200000D01*
X209085714Y28142857D01*
X209142857Y28200000D01*
X209085714Y28257142D01*
X209085714Y28142857D01*
X210171428Y27057142D02*
X210171428Y28257142D01*
X210171428Y27114285D02*
X210057142Y27057142D01*
X209828571Y27057142D01*
X209714285Y27114285D01*
X209657142Y27171428D01*
X209600000Y27285714D01*
X209600000Y27628571D01*
X209657142Y27742857D01*
X209714285Y27800000D01*
X209828571Y27857142D01*
X210057142Y27857142D01*
X210171428Y27800000D01*
X211200000Y27114285D02*
X211085714Y27057142D01*
X210857142Y27057142D01*
X210742857Y27114285D01*
X210685714Y27228571D01*
X210685714Y27685714D01*
X210742857Y27800000D01*
X210857142Y27857142D01*
X211085714Y27857142D01*
X211200000Y27800000D01*
X211257142Y27685714D01*
X211257142Y27571428D01*
X210685714Y27457142D01*
X211714285Y27114285D02*
X211828571Y27057142D01*
X212057142Y27057142D01*
X212171428Y27114285D01*
X212228571Y27228571D01*
X212228571Y27285714D01*
X212171428Y27400000D01*
X212057142Y27457142D01*
X211885714Y27457142D01*
X211771428Y27514285D01*
X211714285Y27628571D01*
X211714285Y27685714D01*
X211771428Y27800000D01*
X211885714Y27857142D01*
X212057142Y27857142D01*
X212171428Y27800000D01*
X212800000Y27114285D02*
X212800000Y27057142D01*
X212742857Y26942857D01*
X212685714Y26885714D01*
X214228571Y27857142D02*
X214228571Y26657142D01*
X214228571Y27800000D02*
X214342857Y27857142D01*
X214571428Y27857142D01*
X214685714Y27800000D01*
X214742857Y27742857D01*
X214800000Y27628571D01*
X214800000Y27285714D01*
X214742857Y27171428D01*
X214685714Y27114285D01*
X214571428Y27057142D01*
X214342857Y27057142D01*
X214228571Y27114285D01*
X215485714Y27057142D02*
X215371428Y27114285D01*
X215314285Y27228571D01*
X215314285Y28257142D01*
X216400000Y27114285D02*
X216285714Y27057142D01*
X216057142Y27057142D01*
X215942857Y27114285D01*
X215885714Y27228571D01*
X215885714Y27685714D01*
X215942857Y27800000D01*
X216057142Y27857142D01*
X216285714Y27857142D01*
X216400000Y27800000D01*
X216457142Y27685714D01*
X216457142Y27571428D01*
X215885714Y27457142D01*
X217485714Y27057142D02*
X217485714Y27685714D01*
X217428571Y27800000D01*
X217314285Y27857142D01*
X217085714Y27857142D01*
X216971428Y27800000D01*
X217485714Y27114285D02*
X217371428Y27057142D01*
X217085714Y27057142D01*
X216971428Y27114285D01*
X216914285Y27228571D01*
X216914285Y27342857D01*
X216971428Y27457142D01*
X217085714Y27514285D01*
X217371428Y27514285D01*
X217485714Y27571428D01*
X218000000Y27114285D02*
X218114285Y27057142D01*
X218342857Y27057142D01*
X218457142Y27114285D01*
X218514285Y27228571D01*
X218514285Y27285714D01*
X218457142Y27400000D01*
X218342857Y27457142D01*
X218171428Y27457142D01*
X218057142Y27514285D01*
X218000000Y27628571D01*
X218000000Y27685714D01*
X218057142Y27800000D01*
X218171428Y27857142D01*
X218342857Y27857142D01*
X218457142Y27800000D01*
X219485714Y27114285D02*
X219371428Y27057142D01*
X219142857Y27057142D01*
X219028571Y27114285D01*
X218971428Y27228571D01*
X218971428Y27685714D01*
X219028571Y27800000D01*
X219142857Y27857142D01*
X219371428Y27857142D01*
X219485714Y27800000D01*
X219542857Y27685714D01*
X219542857Y27571428D01*
X218971428Y27457142D01*
X220857142Y27857142D02*
X221142857Y27057142D01*
X221428571Y27857142D01*
X221885714Y27057142D02*
X221885714Y27857142D01*
X221885714Y28257142D02*
X221828571Y28200000D01*
X221885714Y28142857D01*
X221942857Y28200000D01*
X221885714Y28257142D01*
X221885714Y28142857D01*
X222400000Y27114285D02*
X222514285Y27057142D01*
X222742857Y27057142D01*
X222857142Y27114285D01*
X222914285Y27228571D01*
X222914285Y27285714D01*
X222857142Y27400000D01*
X222742857Y27457142D01*
X222571428Y27457142D01*
X222457142Y27514285D01*
X222400000Y27628571D01*
X222400000Y27685714D01*
X222457142Y27800000D01*
X222571428Y27857142D01*
X222742857Y27857142D01*
X222857142Y27800000D01*
X223428571Y27057142D02*
X223428571Y27857142D01*
X223428571Y28257142D02*
X223371428Y28200000D01*
X223428571Y28142857D01*
X223485714Y28200000D01*
X223428571Y28257142D01*
X223428571Y28142857D01*
X223828571Y27857142D02*
X224285714Y27857142D01*
X224000000Y28257142D02*
X224000000Y27228571D01*
X224057142Y27114285D01*
X224171428Y27057142D01*
X224285714Y27057142D01*
X224685714Y27171428D02*
X224742857Y27114285D01*
X224685714Y27057142D01*
X224628571Y27114285D01*
X224685714Y27171428D01*
X224685714Y27057142D01*
X224685714Y27800000D02*
X224742857Y27742857D01*
X224685714Y27685714D01*
X224628571Y27742857D01*
X224685714Y27800000D01*
X224685714Y27685714D01*
X205571428Y25107142D02*
X205571428Y26307142D01*
X206085714Y25107142D02*
X206085714Y25735714D01*
X206028571Y25850000D01*
X205914285Y25907142D01*
X205742857Y25907142D01*
X205628571Y25850000D01*
X205571428Y25792857D01*
X206485714Y25907142D02*
X206942857Y25907142D01*
X206657142Y26307142D02*
X206657142Y25278571D01*
X206714285Y25164285D01*
X206828571Y25107142D01*
X206942857Y25107142D01*
X207171428Y25907142D02*
X207628571Y25907142D01*
X207342857Y26307142D02*
X207342857Y25278571D01*
X207400000Y25164285D01*
X207514285Y25107142D01*
X207628571Y25107142D01*
X208028571Y25907142D02*
X208028571Y24707142D01*
X208028571Y25850000D02*
X208142857Y25907142D01*
X208371428Y25907142D01*
X208485714Y25850000D01*
X208542857Y25792857D01*
X208600000Y25678571D01*
X208600000Y25335714D01*
X208542857Y25221428D01*
X208485714Y25164285D01*
X208371428Y25107142D01*
X208142857Y25107142D01*
X208028571Y25164285D01*
X209114285Y25221428D02*
X209171428Y25164285D01*
X209114285Y25107142D01*
X209057142Y25164285D01*
X209114285Y25221428D01*
X209114285Y25107142D01*
X209114285Y25850000D02*
X209171428Y25792857D01*
X209114285Y25735714D01*
X209057142Y25792857D01*
X209114285Y25850000D01*
X209114285Y25735714D01*
X210542857Y26364285D02*
X209514285Y24821428D01*
X211800000Y26364285D02*
X210771428Y24821428D01*
X212200000Y25907142D02*
X212200000Y24707142D01*
X212200000Y25850000D02*
X212314285Y25907142D01*
X212542857Y25907142D01*
X212657142Y25850000D01*
X212714285Y25792857D01*
X212771428Y25678571D01*
X212771428Y25335714D01*
X212714285Y25221428D01*
X212657142Y25164285D01*
X212542857Y25107142D01*
X212314285Y25107142D01*
X212200000Y25164285D01*
X213171428Y25907142D02*
X213457142Y25107142D01*
X213742857Y25907142D01*
X214371428Y25107142D02*
X214257142Y25164285D01*
X214200000Y25221428D01*
X214142857Y25335714D01*
X214142857Y25678571D01*
X214200000Y25792857D01*
X214257142Y25850000D01*
X214371428Y25907142D01*
X214542857Y25907142D01*
X214657142Y25850000D01*
X214714285Y25792857D01*
X214771428Y25678571D01*
X214771428Y25335714D01*
X214714285Y25221428D01*
X214657142Y25164285D01*
X214542857Y25107142D01*
X214371428Y25107142D01*
X215228571Y25164285D02*
X215342857Y25107142D01*
X215571428Y25107142D01*
X215685714Y25164285D01*
X215742857Y25278571D01*
X215742857Y25335714D01*
X215685714Y25450000D01*
X215571428Y25507142D01*
X215400000Y25507142D01*
X215285714Y25564285D01*
X215228571Y25678571D01*
X215228571Y25735714D01*
X215285714Y25850000D01*
X215400000Y25907142D01*
X215571428Y25907142D01*
X215685714Y25850000D01*
X216257142Y25221428D02*
X216314285Y25164285D01*
X216257142Y25107142D01*
X216200000Y25164285D01*
X216257142Y25221428D01*
X216257142Y25107142D01*
X217000000Y25107142D02*
X216885714Y25164285D01*
X216828571Y25221428D01*
X216771428Y25335714D01*
X216771428Y25678571D01*
X216828571Y25792857D01*
X216885714Y25850000D01*
X217000000Y25907142D01*
X217171428Y25907142D01*
X217285714Y25850000D01*
X217342857Y25792857D01*
X217400000Y25678571D01*
X217400000Y25335714D01*
X217342857Y25221428D01*
X217285714Y25164285D01*
X217171428Y25107142D01*
X217000000Y25107142D01*
X217914285Y25107142D02*
X217914285Y25907142D01*
X217914285Y25678571D02*
X217971428Y25792857D01*
X218028571Y25850000D01*
X218142857Y25907142D01*
X218257142Y25907142D01*
X219171428Y25907142D02*
X219171428Y24935714D01*
X219114285Y24821428D01*
X219057142Y24764285D01*
X218942857Y24707142D01*
X218771428Y24707142D01*
X218657142Y24764285D01*
X219171428Y25164285D02*
X219057142Y25107142D01*
X218828571Y25107142D01*
X218714285Y25164285D01*
X218657142Y25221428D01*
X218600000Y25335714D01*
X218600000Y25678571D01*
X218657142Y25792857D01*
X218714285Y25850000D01*
X218828571Y25907142D01*
X219057142Y25907142D01*
X219171428Y25850000D01*
X220600000Y26364285D02*
X219571428Y24821428D01*
X221514285Y25164285D02*
X221400000Y25107142D01*
X221171428Y25107142D01*
X221057142Y25164285D01*
X221000000Y25221428D01*
X220942857Y25335714D01*
X220942857Y25678571D01*
X221000000Y25792857D01*
X221057142Y25850000D01*
X221171428Y25907142D01*
X221400000Y25907142D01*
X221514285Y25850000D01*
X222200000Y25107142D02*
X222085714Y25164285D01*
X222028571Y25221428D01*
X221971428Y25335714D01*
X221971428Y25678571D01*
X222028571Y25792857D01*
X222085714Y25850000D01*
X222200000Y25907142D01*
X222371428Y25907142D01*
X222485714Y25850000D01*
X222542857Y25792857D01*
X222600000Y25678571D01*
X222600000Y25335714D01*
X222542857Y25221428D01*
X222485714Y25164285D01*
X222371428Y25107142D01*
X222200000Y25107142D01*
X223057142Y26192857D02*
X223114285Y26250000D01*
X223228571Y26307142D01*
X223514285Y26307142D01*
X223628571Y26250000D01*
X223685714Y26192857D01*
X223742857Y26078571D01*
X223742857Y25964285D01*
X223685714Y25792857D01*
X223000000Y25107142D01*
X223742857Y25107142D01*
X225114285Y26364285D02*
X224085714Y24821428D01*
X226028571Y25907142D02*
X226028571Y24707142D01*
X226028571Y25164285D02*
X225914285Y25107142D01*
X225685714Y25107142D01*
X225571428Y25164285D01*
X225514285Y25221428D01*
X225457142Y25335714D01*
X225457142Y25678571D01*
X225514285Y25792857D01*
X225571428Y25850000D01*
X225685714Y25907142D01*
X225914285Y25907142D01*
X226028571Y25850000D01*
D11*
X228169200Y86298400D02*
X228169200Y80000000D01*
D10*
X217439994Y60102381D02*
X217439994Y60578571D01*
X217725708Y60007143D02*
X216725708Y60340476D01*
X217725708Y60673809D01*
X217059042Y61435714D02*
X217725708Y61435714D01*
X216678089Y61197619D02*
X217392375Y60959524D01*
X217392375Y61578571D01*
X206652380Y72795238D02*
X207652380Y73128572D01*
X206652380Y73461905D01*
X207128571Y74128572D02*
X207176190Y74271429D01*
X207223809Y74319048D01*
X207319047Y74366667D01*
X207461904Y74366667D01*
X207557142Y74319048D01*
X207604761Y74271429D01*
X207652380Y74176191D01*
X207652380Y73795238D01*
X206652380Y73795238D01*
X206652380Y74128572D01*
X206700000Y74223810D01*
X206747619Y74271429D01*
X206842857Y74319048D01*
X206938095Y74319048D01*
X207033333Y74271429D01*
X207080952Y74223810D01*
X207128571Y74128572D01*
X207128571Y73795238D01*
X207366666Y74747619D02*
X207366666Y75223810D01*
X207652380Y74652381D02*
X206652380Y74985715D01*
X207652380Y75319048D01*
X206652380Y75509524D02*
X206652380Y76080953D01*
X207652380Y75795238D02*
X206652380Y75795238D01*
X209674025Y74461904D02*
X209674025Y74795238D01*
X210197834Y74938095D02*
X210197834Y74461904D01*
X209197834Y74461904D01*
X209197834Y74938095D01*
X210197834Y75366666D02*
X209197834Y75366666D01*
X210197834Y75938095D01*
X209197834Y75938095D01*
X211743288Y72414285D02*
X212743288Y72747619D01*
X211743288Y73080952D01*
X212219479Y73747619D02*
X212267098Y73890476D01*
X212314717Y73938095D01*
X212409955Y73985714D01*
X212552812Y73985714D01*
X212648050Y73938095D01*
X212695669Y73890476D01*
X212743288Y73795238D01*
X212743288Y73414285D01*
X211743288Y73414285D01*
X211743288Y73747619D01*
X211790908Y73842857D01*
X211838527Y73890476D01*
X211933765Y73938095D01*
X212029003Y73938095D01*
X212124241Y73890476D01*
X212171860Y73842857D01*
X212219479Y73747619D01*
X212219479Y73414285D01*
X211743288Y74414285D02*
X212552812Y74414285D01*
X212648050Y74461904D01*
X212695669Y74509523D01*
X212743288Y74604761D01*
X212743288Y74795238D01*
X212695669Y74890476D01*
X212648050Y74938095D01*
X212552812Y74985714D01*
X211743288Y74985714D01*
X212695669Y75414285D02*
X212743288Y75557142D01*
X212743288Y75795238D01*
X212695669Y75890476D01*
X212648050Y75938095D01*
X212552812Y75985714D01*
X212457574Y75985714D01*
X212362336Y75938095D01*
X212314717Y75890476D01*
X212267098Y75795238D01*
X212219479Y75604761D01*
X212171860Y75509523D01*
X212124241Y75461904D01*
X212029003Y75414285D01*
X211933765Y75414285D01*
X211838527Y75461904D01*
X211790908Y75509523D01*
X211743288Y75604761D01*
X211743288Y75842857D01*
X211790908Y75985714D01*
X215288742Y73509524D02*
X214288742Y73509524D01*
X214288742Y73747619D01*
X214336362Y73890476D01*
X214431600Y73985714D01*
X214526838Y74033333D01*
X214717314Y74080952D01*
X214860171Y74080952D01*
X215050647Y74033333D01*
X215145885Y73985714D01*
X215241123Y73890476D01*
X215288742Y73747619D01*
X215288742Y73509524D01*
X215288742Y75033333D02*
X215288742Y74461905D01*
X215288742Y74747619D02*
X214288742Y74747619D01*
X214431600Y74652381D01*
X214526838Y74557143D01*
X214574457Y74461905D01*
X214288742Y75366667D02*
X214288742Y75985714D01*
X214669695Y75652381D01*
X214669695Y75795238D01*
X214717314Y75890476D01*
X214764933Y75938095D01*
X214860171Y75985714D01*
X215098266Y75985714D01*
X215193504Y75938095D01*
X215241123Y75890476D01*
X215288742Y75795238D01*
X215288742Y75509524D01*
X215241123Y75414286D01*
X215193504Y75366667D01*
X217834196Y73509524D02*
X216834196Y73509524D01*
X216834196Y73747619D01*
X216881816Y73890476D01*
X216977054Y73985714D01*
X217072292Y74033333D01*
X217262768Y74080952D01*
X217405625Y74080952D01*
X217596101Y74033333D01*
X217691339Y73985714D01*
X217786577Y73890476D01*
X217834196Y73747619D01*
X217834196Y73509524D01*
X217834196Y75033333D02*
X217834196Y74461905D01*
X217834196Y74747619D02*
X216834196Y74747619D01*
X216977054Y74652381D01*
X217072292Y74557143D01*
X217119911Y74461905D01*
X216929435Y75414286D02*
X216881816Y75461905D01*
X216834196Y75557143D01*
X216834196Y75795238D01*
X216881816Y75890476D01*
X216929435Y75938095D01*
X217024673Y75985714D01*
X217119911Y75985714D01*
X217262768Y75938095D01*
X217834196Y75366667D01*
X217834196Y75985714D01*
X220379650Y73509524D02*
X219379650Y73509524D01*
X219379650Y73747619D01*
X219427270Y73890476D01*
X219522508Y73985714D01*
X219617746Y74033333D01*
X219808222Y74080952D01*
X219951079Y74080952D01*
X220141555Y74033333D01*
X220236793Y73985714D01*
X220332031Y73890476D01*
X220379650Y73747619D01*
X220379650Y73509524D01*
X220379650Y75033333D02*
X220379650Y74461905D01*
X220379650Y74747619D02*
X219379650Y74747619D01*
X219522508Y74652381D01*
X219617746Y74557143D01*
X219665365Y74461905D01*
X220379650Y75985714D02*
X220379650Y75414286D01*
X220379650Y75700000D02*
X219379650Y75700000D01*
X219522508Y75604762D01*
X219617746Y75509524D01*
X219665365Y75414286D01*
X222925104Y73509524D02*
X221925104Y73509524D01*
X221925104Y73747619D01*
X221972724Y73890476D01*
X222067962Y73985714D01*
X222163200Y74033333D01*
X222353676Y74080952D01*
X222496533Y74080952D01*
X222687009Y74033333D01*
X222782247Y73985714D01*
X222877485Y73890476D01*
X222925104Y73747619D01*
X222925104Y73509524D01*
X222925104Y75033333D02*
X222925104Y74461905D01*
X222925104Y74747619D02*
X221925104Y74747619D01*
X222067962Y74652381D01*
X222163200Y74557143D01*
X222210819Y74461905D01*
X221925104Y75652381D02*
X221925104Y75747619D01*
X221972724Y75842857D01*
X222020343Y75890476D01*
X222115581Y75938095D01*
X222306057Y75985714D01*
X222544152Y75985714D01*
X222734628Y75938095D01*
X222829866Y75890476D01*
X222877485Y75842857D01*
X222925104Y75747619D01*
X222925104Y75652381D01*
X222877485Y75557143D01*
X222829866Y75509524D01*
X222734628Y75461905D01*
X222544152Y75414286D01*
X222306057Y75414286D01*
X222115581Y75461905D01*
X222020343Y75509524D01*
X221972724Y75557143D01*
X221925104Y75652381D01*
X225470558Y74461904D02*
X224470558Y74461904D01*
X224470558Y74700000D01*
X224518178Y74842857D01*
X224613416Y74938095D01*
X224708654Y74985714D01*
X224899130Y75033333D01*
X225041987Y75033333D01*
X225232463Y74985714D01*
X225327701Y74938095D01*
X225422939Y74842857D01*
X225470558Y74700000D01*
X225470558Y74461904D01*
X225470558Y75509523D02*
X225470558Y75700000D01*
X225422939Y75795238D01*
X225375320Y75842857D01*
X225232463Y75938095D01*
X225041987Y75985714D01*
X224661035Y75985714D01*
X224565797Y75938095D01*
X224518178Y75890476D01*
X224470558Y75795238D01*
X224470558Y75604761D01*
X224518178Y75509523D01*
X224565797Y75461904D01*
X224661035Y75414285D01*
X224899130Y75414285D01*
X224994368Y75461904D01*
X225041987Y75509523D01*
X225089606Y75604761D01*
X225089606Y75795238D01*
X225041987Y75890476D01*
X224994368Y75938095D01*
X224899130Y75985714D01*
X228016012Y74461904D02*
X227016012Y74461904D01*
X227016012Y74700000D01*
X227063632Y74842857D01*
X227158870Y74938095D01*
X227254108Y74985714D01*
X227444584Y75033333D01*
X227587441Y75033333D01*
X227777917Y74985714D01*
X227873155Y74938095D01*
X227968393Y74842857D01*
X228016012Y74700000D01*
X228016012Y74461904D01*
X227016012Y75890476D02*
X227016012Y75700000D01*
X227063632Y75604761D01*
X227111251Y75557142D01*
X227254108Y75461904D01*
X227444584Y75414285D01*
X227825536Y75414285D01*
X227920774Y75461904D01*
X227968393Y75509523D01*
X228016012Y75604761D01*
X228016012Y75795238D01*
X227968393Y75890476D01*
X227920774Y75938095D01*
X227825536Y75985714D01*
X227587441Y75985714D01*
X227492203Y75938095D01*
X227444584Y75890476D01*
X227396965Y75795238D01*
X227396965Y75604761D01*
X227444584Y75509523D01*
X227492203Y75461904D01*
X227587441Y75414285D01*
X230561466Y74461904D02*
X229561466Y74461904D01*
X229561466Y74700000D01*
X229609086Y74842857D01*
X229704324Y74938095D01*
X229799562Y74985714D01*
X229990038Y75033333D01*
X230132895Y75033333D01*
X230323371Y74985714D01*
X230418609Y74938095D01*
X230513847Y74842857D01*
X230561466Y74700000D01*
X230561466Y74461904D01*
X229561466Y75938095D02*
X229561466Y75461904D01*
X230037657Y75414285D01*
X229990038Y75461904D01*
X229942419Y75557142D01*
X229942419Y75795238D01*
X229990038Y75890476D01*
X230037657Y75938095D01*
X230132895Y75985714D01*
X230370990Y75985714D01*
X230466228Y75938095D01*
X230513847Y75890476D01*
X230561466Y75795238D01*
X230561466Y75557142D01*
X230513847Y75461904D01*
X230466228Y75414285D01*
X204242857Y45410714D02*
X204071428Y45067857D01*
X205014285Y43610714D02*
X205014285Y45410714D01*
X205442857Y45410714D01*
X205700000Y45325000D01*
X205871428Y45153571D01*
X205957142Y44982142D01*
X206042857Y44639285D01*
X206042857Y44382142D01*
X205957142Y44039285D01*
X205871428Y43867857D01*
X205700000Y43696428D01*
X205442857Y43610714D01*
X205014285Y43610714D01*
X206728571Y44125000D02*
X207585714Y44125000D01*
X206557142Y43610714D02*
X207157142Y45410714D01*
X207757142Y43610714D01*
X208100000Y45410714D02*
X209128571Y45410714D01*
X208614285Y43610714D02*
X208614285Y45410714D01*
X209642857Y44125000D02*
X210500000Y44125000D01*
X209471428Y43610714D02*
X210071428Y45410714D01*
X210671428Y43610714D01*
X211357142Y45410714D02*
X211185714Y45067857D01*
X214100000Y44553571D02*
X213500000Y44553571D01*
X213500000Y43610714D02*
X213500000Y45410714D01*
X214357142Y45410714D01*
X215042857Y44553571D02*
X215642857Y44553571D01*
X215900000Y43610714D02*
X215042857Y43610714D01*
X215042857Y45410714D01*
X215900000Y45410714D01*
X216585714Y44125000D02*
X217442857Y44125000D01*
X216414285Y43610714D02*
X217014285Y45410714D01*
X217614285Y43610714D01*
X217957142Y45410714D02*
X218985714Y45410714D01*
X218471428Y43610714D02*
X218471428Y45410714D01*
X219585714Y43610714D02*
X219585714Y45410714D01*
X219585714Y44553571D02*
X220614285Y44553571D01*
X220614285Y43610714D02*
X220614285Y45410714D01*
X221471428Y44553571D02*
X222071428Y44553571D01*
X222328571Y43610714D02*
X221471428Y43610714D01*
X221471428Y45410714D01*
X222328571Y45410714D01*
X224128571Y43610714D02*
X223528571Y44467857D01*
X223100000Y43610714D02*
X223100000Y45410714D01*
X223785714Y45410714D01*
X223957142Y45325000D01*
X224042857Y45239285D01*
X224128571Y45067857D01*
X224128571Y44810714D01*
X224042857Y44639285D01*
X223957142Y44553571D01*
X223785714Y44467857D01*
X223100000Y44467857D01*
X224728571Y45410714D02*
X225157142Y43610714D01*
X225500000Y44896428D01*
X225842857Y43610714D01*
X226271428Y45410714D01*
X226957142Y43610714D02*
X226957142Y45410714D01*
X227814285Y43610714D02*
X227814285Y45410714D01*
X228842857Y43610714D01*
X228842857Y45410714D01*
X230642857Y45325000D02*
X230471428Y45410714D01*
X230214285Y45410714D01*
X229957142Y45325000D01*
X229785714Y45153571D01*
X229700000Y44982142D01*
X229614285Y44639285D01*
X229614285Y44382142D01*
X229700000Y44039285D01*
X229785714Y43867857D01*
X229957142Y43696428D01*
X230214285Y43610714D01*
X230385714Y43610714D01*
X230642857Y43696428D01*
X230728571Y43782142D01*
X230728571Y44382142D01*
X230385714Y44382142D01*
X202571428Y40075000D02*
X202485714Y40160714D01*
X202314285Y40417857D01*
X202228571Y40589285D01*
X202142857Y40846428D01*
X202057142Y41275000D01*
X202057142Y41617857D01*
X202142857Y42046428D01*
X202228571Y42303571D01*
X202314285Y42475000D01*
X202485714Y42732142D01*
X202571428Y42817857D01*
X203257142Y41703571D02*
X203857142Y41703571D01*
X204114285Y40760714D02*
X203257142Y40760714D01*
X203257142Y42560714D01*
X204114285Y42560714D01*
X204885714Y40932142D02*
X204971428Y40846428D01*
X204885714Y40760714D01*
X204800000Y40846428D01*
X204885714Y40932142D01*
X204885714Y40760714D01*
X206685714Y42475000D02*
X206514285Y42560714D01*
X206257142Y42560714D01*
X206000000Y42475000D01*
X205828571Y42303571D01*
X205742857Y42132142D01*
X205657142Y41789285D01*
X205657142Y41532142D01*
X205742857Y41189285D01*
X205828571Y41017857D01*
X206000000Y40846428D01*
X206257142Y40760714D01*
X206428571Y40760714D01*
X206685714Y40846428D01*
X206771428Y40932142D01*
X206771428Y41532142D01*
X206428571Y41532142D01*
X207542857Y40932142D02*
X207628571Y40846428D01*
X207542857Y40760714D01*
X207457142Y40846428D01*
X207542857Y40932142D01*
X207542857Y40760714D01*
X209685714Y41275000D02*
X210542857Y41275000D01*
X209514285Y40760714D02*
X210114285Y42560714D01*
X210714285Y40760714D01*
X211314285Y40760714D02*
X211314285Y42560714D01*
X213200000Y40760714D02*
X212600000Y41617857D01*
X212171428Y40760714D02*
X212171428Y42560714D01*
X212857142Y42560714D01*
X213028571Y42475000D01*
X213114285Y42389285D01*
X213200000Y42217857D01*
X213200000Y41960714D01*
X213114285Y41789285D01*
X213028571Y41703571D01*
X212857142Y41617857D01*
X212171428Y41617857D01*
X214828571Y40760714D02*
X213971428Y40760714D01*
X213971428Y42560714D01*
X215428571Y40760714D02*
X215428571Y42560714D01*
X216885714Y41703571D02*
X216285714Y41703571D01*
X216285714Y40760714D02*
X216285714Y42560714D01*
X217142857Y42560714D01*
X217571428Y42560714D02*
X218600000Y42560714D01*
X218085714Y40760714D02*
X218085714Y42560714D01*
X221857142Y42646428D02*
X220314285Y40332142D01*
X223828571Y41703571D02*
X224428571Y41703571D01*
X224685714Y40760714D02*
X223828571Y40760714D01*
X223828571Y42560714D01*
X224685714Y42560714D01*
X225371428Y40846428D02*
X225628571Y40760714D01*
X226057142Y40760714D01*
X226228571Y40846428D01*
X226314285Y40932142D01*
X226400000Y41103571D01*
X226400000Y41275000D01*
X226314285Y41446428D01*
X226228571Y41532142D01*
X226057142Y41617857D01*
X225714285Y41703571D01*
X225542857Y41789285D01*
X225457142Y41875000D01*
X225371428Y42046428D01*
X225371428Y42217857D01*
X225457142Y42389285D01*
X225542857Y42475000D01*
X225714285Y42560714D01*
X226142857Y42560714D01*
X226400000Y42475000D01*
X227171428Y40760714D02*
X227171428Y42560714D01*
X227857142Y42560714D01*
X228028571Y42475000D01*
X228114285Y42389285D01*
X228200000Y42217857D01*
X228200000Y41960714D01*
X228114285Y41789285D01*
X228028571Y41703571D01*
X227857142Y41617857D01*
X227171428Y41617857D01*
X228800000Y42560714D02*
X229914285Y42560714D01*
X229314285Y41875000D01*
X229571428Y41875000D01*
X229742857Y41789285D01*
X229828571Y41703571D01*
X229914285Y41532142D01*
X229914285Y41103571D01*
X229828571Y40932142D01*
X229742857Y40846428D01*
X229571428Y40760714D01*
X229057142Y40760714D01*
X228885714Y40846428D01*
X228800000Y40932142D01*
X230600000Y42389285D02*
X230685714Y42475000D01*
X230857142Y42560714D01*
X231285714Y42560714D01*
X231457142Y42475000D01*
X231542857Y42389285D01*
X231628571Y42217857D01*
X231628571Y42046428D01*
X231542857Y41789285D01*
X230514285Y40760714D01*
X231628571Y40760714D01*
X232228571Y40075000D02*
X232314285Y40160714D01*
X232485714Y40417857D01*
X232571428Y40589285D01*
X232657142Y40846428D01*
X232742857Y41275000D01*
X232742857Y41617857D01*
X232657142Y42046428D01*
X232571428Y42303571D01*
X232485714Y42475000D01*
X232314285Y42732142D01*
X232228571Y42817857D01*
X225365706Y60150000D02*
X224365706Y60150000D01*
X225079992Y60483333D01*
X224365706Y60816667D01*
X225365706Y60816667D01*
X224365706Y61483333D02*
X224365706Y61673809D01*
X224413326Y61769048D01*
X224508564Y61864286D01*
X224699040Y61911905D01*
X225032373Y61911905D01*
X225222849Y61864286D01*
X225318087Y61769048D01*
X225365706Y61673809D01*
X225365706Y61483333D01*
X225318087Y61388095D01*
X225222849Y61292857D01*
X225032373Y61245238D01*
X224699040Y61245238D01*
X224508564Y61292857D01*
X224413326Y61388095D01*
X224365706Y61483333D01*
X225318087Y62292857D02*
X225365706Y62435714D01*
X225365706Y62673809D01*
X225318087Y62769048D01*
X225270468Y62816667D01*
X225175230Y62864286D01*
X225079992Y62864286D01*
X224984754Y62816667D01*
X224937135Y62769048D01*
X224889516Y62673809D01*
X224841897Y62483333D01*
X224794278Y62388095D01*
X224746659Y62340476D01*
X224651421Y62292857D01*
X224556183Y62292857D01*
X224460945Y62340476D01*
X224413326Y62388095D01*
X224365706Y62483333D01*
X224365706Y62721429D01*
X224413326Y62864286D01*
X225365706Y63292857D02*
X224365706Y63292857D01*
X234552380Y60888095D02*
X234790476Y60888095D01*
X234695238Y60649999D02*
X234790476Y60888095D01*
X234695238Y61126190D01*
X234980952Y60745237D02*
X234790476Y60888095D01*
X234980952Y61030952D01*
X232005704Y60007143D02*
X232005704Y60578571D01*
X233005704Y60292857D02*
X232005704Y60292857D01*
X232005704Y60816667D02*
X233005704Y61483333D01*
X232005704Y61483333D02*
X233005704Y60816667D01*
X230459038Y60721428D02*
X229982848Y60388095D01*
X230459038Y60149999D02*
X229459038Y60149999D01*
X229459038Y60530952D01*
X229506658Y60626190D01*
X229554277Y60673809D01*
X229649515Y60721428D01*
X229792372Y60721428D01*
X229887610Y60673809D01*
X229935229Y60626190D01*
X229982848Y60530952D01*
X229982848Y60149999D01*
X229459038Y61054761D02*
X230459038Y61721428D01*
X229459038Y61721428D02*
X230459038Y61054761D01*
X227912372Y60150000D02*
X226912372Y60150000D01*
X227626658Y60483333D01*
X226912372Y60816667D01*
X227912372Y60816667D01*
X227912372Y61292857D02*
X226912372Y61292857D01*
X227864753Y61721429D02*
X227912372Y61864286D01*
X227912372Y62102381D01*
X227864753Y62197619D01*
X227817134Y62245238D01*
X227721896Y62292857D01*
X227626658Y62292857D01*
X227531420Y62245238D01*
X227483801Y62197619D01*
X227436182Y62102381D01*
X227388563Y61911905D01*
X227340944Y61816667D01*
X227293325Y61769048D01*
X227198087Y61721429D01*
X227102849Y61721429D01*
X227007611Y61769048D01*
X226959992Y61816667D01*
X226912372Y61911905D01*
X226912372Y62150000D01*
X226959992Y62292857D01*
X226912372Y62911905D02*
X226912372Y63102381D01*
X226959992Y63197619D01*
X227055230Y63292857D01*
X227245706Y63340476D01*
X227579039Y63340476D01*
X227769515Y63292857D01*
X227864753Y63197619D01*
X227912372Y63102381D01*
X227912372Y62911905D01*
X227864753Y62816667D01*
X227769515Y62721429D01*
X227579039Y62673809D01*
X227245706Y62673809D01*
X227055230Y62721429D01*
X226959992Y62816667D01*
X226912372Y62911905D01*
X222771421Y60102380D02*
X222819040Y60245237D01*
X222819040Y60483333D01*
X222771421Y60578571D01*
X222723802Y60626190D01*
X222628564Y60673809D01*
X222533326Y60673809D01*
X222438088Y60626190D01*
X222390469Y60578571D01*
X222342850Y60483333D01*
X222295231Y60292856D01*
X222247612Y60197618D01*
X222199993Y60149999D01*
X222104755Y60102380D01*
X222009517Y60102380D01*
X221914279Y60149999D01*
X221866660Y60197618D01*
X221819040Y60292856D01*
X221819040Y60530952D01*
X221866660Y60673809D01*
X222723802Y61673809D02*
X222771421Y61626190D01*
X222819040Y61483333D01*
X222819040Y61388095D01*
X222771421Y61245237D01*
X222676183Y61149999D01*
X222580945Y61102380D01*
X222390469Y61054761D01*
X222247612Y61054761D01*
X222057136Y61102380D01*
X221961898Y61149999D01*
X221866660Y61245237D01*
X221819040Y61388095D01*
X221819040Y61483333D01*
X221866660Y61626190D01*
X221914279Y61673809D01*
X222819040Y62102380D02*
X221819040Y62102380D01*
X222819040Y62673809D02*
X222247612Y62245237D01*
X221819040Y62673809D02*
X222390469Y62102380D01*
X219986660Y60102381D02*
X219986660Y60578571D01*
X220272374Y60007143D02*
X219272374Y60340476D01*
X220272374Y60673809D01*
X219272374Y61483333D02*
X219272374Y61007143D01*
X219748565Y60959524D01*
X219700946Y61007143D01*
X219653327Y61102381D01*
X219653327Y61340476D01*
X219700946Y61435714D01*
X219748565Y61483333D01*
X219843803Y61530952D01*
X220081898Y61530952D01*
X220177136Y61483333D01*
X220224755Y61435714D01*
X220272374Y61340476D01*
X220272374Y61102381D01*
X220224755Y61007143D01*
X220177136Y60959524D01*
X214893328Y60102381D02*
X214893328Y60578571D01*
X215179042Y60007143D02*
X214179042Y60340476D01*
X215179042Y60673809D01*
X214179042Y60911905D02*
X214179042Y61530952D01*
X214559995Y61197619D01*
X214559995Y61340476D01*
X214607614Y61435714D01*
X214655233Y61483333D01*
X214750471Y61530952D01*
X214988566Y61530952D01*
X215083804Y61483333D01*
X215131423Y61435714D01*
X215179042Y61340476D01*
X215179042Y61054762D01*
X215131423Y60959524D01*
X215083804Y60911905D01*
X212346662Y60102381D02*
X212346662Y60578571D01*
X212632376Y60007143D02*
X211632376Y60340476D01*
X212632376Y60673809D01*
X211727615Y60959524D02*
X211679996Y61007143D01*
X211632376Y61102381D01*
X211632376Y61340476D01*
X211679996Y61435714D01*
X211727615Y61483333D01*
X211822853Y61530952D01*
X211918091Y61530952D01*
X212060948Y61483333D01*
X212632376Y60911905D01*
X212632376Y61530952D01*
X209799996Y60102381D02*
X209799996Y60578571D01*
X210085710Y60007143D02*
X209085710Y60340476D01*
X210085710Y60673809D01*
X210085710Y61530952D02*
X210085710Y60959524D01*
X210085710Y61245238D02*
X209085710Y61245238D01*
X209228568Y61150000D01*
X209323806Y61054762D01*
X209371425Y60959524D01*
X207253330Y60102381D02*
X207253330Y60578571D01*
X207539044Y60007143D02*
X206539044Y60340476D01*
X207539044Y60673809D01*
X206539044Y61197619D02*
X206539044Y61292857D01*
X206586664Y61388095D01*
X206634283Y61435714D01*
X206729521Y61483333D01*
X206919997Y61530952D01*
X207158092Y61530952D01*
X207348568Y61483333D01*
X207443806Y61435714D01*
X207491425Y61388095D01*
X207539044Y61292857D01*
X207539044Y61197619D01*
X207491425Y61102381D01*
X207443806Y61054762D01*
X207348568Y61007143D01*
X207158092Y60959524D01*
X206919997Y60959524D01*
X206729521Y61007143D01*
X206634283Y61054762D01*
X206586664Y61102381D01*
X206539044Y61197619D01*
X204039998Y60673809D02*
X203992378Y60578571D01*
X203992378Y60435714D01*
X204039998Y60292856D01*
X204135236Y60197618D01*
X204230474Y60149999D01*
X204420950Y60102380D01*
X204563807Y60102380D01*
X204754283Y60149999D01*
X204849521Y60197618D01*
X204944759Y60292856D01*
X204992378Y60435714D01*
X204992378Y60530952D01*
X204944759Y60673809D01*
X204897140Y60721428D01*
X204563807Y60721428D01*
X204563807Y60530952D01*
X204992378Y61149999D02*
X203992378Y61149999D01*
X204992378Y61721428D01*
X203992378Y61721428D01*
X204992378Y62197618D02*
X203992378Y62197618D01*
X203992378Y62435714D01*
X204039998Y62578571D01*
X204135236Y62673809D01*
X204230474Y62721428D01*
X204420950Y62769047D01*
X204563807Y62769047D01*
X204754283Y62721428D01*
X204849521Y62673809D01*
X204944759Y62578571D01*
X204992378Y62435714D01*
X204992378Y62197618D01*
X202159998Y60102381D02*
X202159998Y60578571D01*
X202445712Y60007143D02*
X201445712Y60340476D01*
X202445712Y60673809D01*
X202445712Y61578571D02*
X201969522Y61245238D01*
X202445712Y61007143D02*
X201445712Y61007143D01*
X201445712Y61388095D01*
X201493332Y61483333D01*
X201540951Y61530952D01*
X201636189Y61578571D01*
X201779046Y61578571D01*
X201874284Y61530952D01*
X201921903Y61483333D01*
X201969522Y61388095D01*
X201969522Y61007143D01*
X201921903Y62007143D02*
X201921903Y62340476D01*
X202445712Y62483333D02*
X202445712Y62007143D01*
X201445712Y62007143D01*
X201445712Y62483333D01*
X201921903Y63245238D02*
X201921903Y62911905D01*
X202445712Y62911905D02*
X201445712Y62911905D01*
X201445712Y63388095D01*
X198899046Y60054761D02*
X198899046Y60673809D01*
X199279999Y60340476D01*
X199279999Y60483333D01*
X199327618Y60578571D01*
X199375237Y60626190D01*
X199470475Y60673809D01*
X199708570Y60673809D01*
X199803808Y60626190D01*
X199851427Y60578571D01*
X199899046Y60483333D01*
X199899046Y60197618D01*
X199851427Y60102380D01*
X199803808Y60054761D01*
X198899046Y60959523D02*
X199899046Y61292857D01*
X198899046Y61626190D01*
X198899046Y61864285D02*
X198899046Y62483333D01*
X199279999Y62149999D01*
X199279999Y62292857D01*
X199327618Y62388095D01*
X199375237Y62435714D01*
X199470475Y62483333D01*
X199708570Y62483333D01*
X199803808Y62435714D01*
X199851427Y62388095D01*
X199899046Y62292857D01*
X199899046Y62007142D01*
X199851427Y61911904D01*
X199803808Y61864285D01*
X197352380Y60721428D02*
X196876190Y60388095D01*
X197352380Y60150000D02*
X196352380Y60150000D01*
X196352380Y60530952D01*
X196400000Y60626190D01*
X196447619Y60673809D01*
X196542857Y60721428D01*
X196685714Y60721428D01*
X196780952Y60673809D01*
X196828571Y60626190D01*
X196876190Y60530952D01*
X196876190Y60150000D01*
X197304761Y61102381D02*
X197352380Y61245238D01*
X197352380Y61483333D01*
X197304761Y61578571D01*
X197257142Y61626190D01*
X197161904Y61673809D01*
X197066666Y61673809D01*
X196971428Y61626190D01*
X196923809Y61578571D01*
X196876190Y61483333D01*
X196828571Y61292857D01*
X196780952Y61197619D01*
X196733333Y61150000D01*
X196638095Y61102381D01*
X196542857Y61102381D01*
X196447619Y61150000D01*
X196400000Y61197619D01*
X196352380Y61292857D01*
X196352380Y61530952D01*
X196400000Y61673809D01*
X196352380Y61959524D02*
X196352380Y62530952D01*
X197352380Y62245238D02*
X196352380Y62245238D01*
X235604761Y73557143D02*
X235652380Y73700000D01*
X235652380Y73938095D01*
X235604761Y74033333D01*
X235557142Y74080952D01*
X235461904Y74128571D01*
X235366666Y74128571D01*
X235271428Y74080952D01*
X235223809Y74033333D01*
X235176190Y73938095D01*
X235128571Y73747619D01*
X235080952Y73652381D01*
X235033333Y73604762D01*
X234938095Y73557143D01*
X234842857Y73557143D01*
X234747619Y73604762D01*
X234700000Y73652381D01*
X234652380Y73747619D01*
X234652380Y73985714D01*
X234700000Y74128571D01*
X235652380Y74557143D02*
X234652380Y74557143D01*
X234652380Y74795238D01*
X234700000Y74938095D01*
X234795238Y75033333D01*
X234890476Y75080952D01*
X235080952Y75128571D01*
X235223809Y75128571D01*
X235414285Y75080952D01*
X235509523Y75033333D01*
X235604761Y74938095D01*
X235652380Y74795238D01*
X235652380Y74557143D01*
X235366666Y75509524D02*
X235366666Y75985714D01*
X235652380Y75414286D02*
X234652380Y75747619D01*
X235652380Y76080952D01*
X233059301Y73604761D02*
X233106920Y73747618D01*
X233106920Y73985714D01*
X233059301Y74080952D01*
X233011682Y74128571D01*
X232916444Y74176190D01*
X232821206Y74176190D01*
X232725968Y74128571D01*
X232678349Y74080952D01*
X232630730Y73985714D01*
X232583111Y73795238D01*
X232535492Y73699999D01*
X232487873Y73652380D01*
X232392635Y73604761D01*
X232297397Y73604761D01*
X232202159Y73652380D01*
X232154540Y73699999D01*
X232106920Y73795238D01*
X232106920Y74033333D01*
X232154540Y74176190D01*
X233011682Y75176190D02*
X233059301Y75128571D01*
X233106920Y74985714D01*
X233106920Y74890476D01*
X233059301Y74747618D01*
X232964063Y74652380D01*
X232868825Y74604761D01*
X232678349Y74557142D01*
X232535492Y74557142D01*
X232345016Y74604761D01*
X232249778Y74652380D01*
X232154540Y74747618D01*
X232106920Y74890476D01*
X232106920Y74985714D01*
X232154540Y75128571D01*
X232202159Y75176190D01*
X233106920Y76080952D02*
X233106920Y75604761D01*
X232106920Y75604761D01*
D11*
X228250000Y67500000D02*
X228250000Y61000000D01*
X203500000Y67000000D02*
X203500000Y61000000D01*
D10*
X199464285Y67500000D02*
X199378571Y67585714D01*
X199207142Y67842857D01*
X199121428Y68014285D01*
X199035714Y68271428D01*
X198950000Y68700000D01*
X198950000Y69042857D01*
X199035714Y69471428D01*
X199121428Y69728571D01*
X199207142Y69900000D01*
X199378571Y70157142D01*
X199464285Y70242857D01*
X200492857Y69985714D02*
X200835714Y69985714D01*
X201007142Y69900000D01*
X201178571Y69728571D01*
X201264285Y69385714D01*
X201264285Y68785714D01*
X201178571Y68442857D01*
X201007142Y68271428D01*
X200835714Y68185714D01*
X200492857Y68185714D01*
X200321428Y68271428D01*
X200150000Y68442857D01*
X200064285Y68785714D01*
X200064285Y69385714D01*
X200150000Y69728571D01*
X200321428Y69900000D01*
X200492857Y69985714D01*
X202035714Y68185714D02*
X202035714Y69985714D01*
X202721428Y69985714D01*
X202892857Y69900000D01*
X202978571Y69814285D01*
X203064285Y69642857D01*
X203064285Y69385714D01*
X202978571Y69214285D01*
X202892857Y69128571D01*
X202721428Y69042857D01*
X202035714Y69042857D01*
X203578571Y69985714D02*
X204607142Y69985714D01*
X204092857Y68185714D02*
X204092857Y69985714D01*
X205207142Y68185714D02*
X205207142Y69985714D01*
X206407142Y69985714D02*
X206750000Y69985714D01*
X206921428Y69900000D01*
X207092857Y69728571D01*
X207178571Y69385714D01*
X207178571Y68785714D01*
X207092857Y68442857D01*
X206921428Y68271428D01*
X206750000Y68185714D01*
X206407142Y68185714D01*
X206235714Y68271428D01*
X206064285Y68442857D01*
X205978571Y68785714D01*
X205978571Y69385714D01*
X206064285Y69728571D01*
X206235714Y69900000D01*
X206407142Y69985714D01*
X207950000Y68185714D02*
X207950000Y69985714D01*
X208978571Y68185714D01*
X208978571Y69985714D01*
X209750000Y68700000D02*
X210607142Y68700000D01*
X209578571Y68185714D02*
X210178571Y69985714D01*
X210778571Y68185714D01*
X212235714Y68185714D02*
X211378571Y68185714D01*
X211378571Y69985714D01*
X214807142Y69128571D02*
X214207142Y69128571D01*
X214207142Y68185714D02*
X214207142Y69985714D01*
X215064285Y69985714D01*
X215750000Y69128571D02*
X216350000Y69128571D01*
X216607142Y68185714D02*
X215750000Y68185714D01*
X215750000Y69985714D01*
X216607142Y69985714D01*
X217292857Y68700000D02*
X218150000Y68700000D01*
X217121428Y68185714D02*
X217721428Y69985714D01*
X218321428Y68185714D01*
X218664285Y69985714D02*
X219692857Y69985714D01*
X219178571Y68185714D02*
X219178571Y69985714D01*
X220292857Y68185714D02*
X220292857Y69985714D01*
X220292857Y69128571D02*
X221321428Y69128571D01*
X221321428Y68185714D02*
X221321428Y69985714D01*
X222178571Y69128571D02*
X222778571Y69128571D01*
X223035714Y68185714D02*
X222178571Y68185714D01*
X222178571Y69985714D01*
X223035714Y69985714D01*
X224835714Y68185714D02*
X224235714Y69042857D01*
X223807142Y68185714D02*
X223807142Y69985714D01*
X224492857Y69985714D01*
X224664285Y69900000D01*
X224750000Y69814285D01*
X224835714Y69642857D01*
X224835714Y69385714D01*
X224750000Y69214285D01*
X224664285Y69128571D01*
X224492857Y69042857D01*
X223807142Y69042857D01*
X225435714Y69985714D02*
X225864285Y68185714D01*
X226207142Y69471428D01*
X226550000Y68185714D01*
X226978571Y69985714D01*
X227664285Y68185714D02*
X227664285Y69985714D01*
X228521428Y68185714D02*
X228521428Y69985714D01*
X229550000Y68185714D01*
X229550000Y69985714D01*
X231350000Y69900000D02*
X231178571Y69985714D01*
X230921428Y69985714D01*
X230664285Y69900000D01*
X230492857Y69728571D01*
X230407142Y69557142D01*
X230321428Y69214285D01*
X230321428Y68957142D01*
X230407142Y68614285D01*
X230492857Y68442857D01*
X230664285Y68271428D01*
X230921428Y68185714D01*
X231092857Y68185714D01*
X231350000Y68271428D01*
X231435714Y68357142D01*
X231435714Y68957142D01*
X231092857Y68957142D01*
X232035714Y67500000D02*
X232121428Y67585714D01*
X232292857Y67842857D01*
X232378571Y68014285D01*
X232464285Y68271428D01*
X232550000Y68700000D01*
X232550000Y69042857D01*
X232464285Y69471428D01*
X232378571Y69728571D01*
X232292857Y69900000D01*
X232121428Y70157142D01*
X232035714Y70242857D01*
X202571428Y13128571D02*
X201971428Y13128571D01*
X201971428Y12185714D02*
X201971428Y13985714D01*
X202828571Y13985714D01*
X203514285Y13128571D02*
X204114285Y13128571D01*
X204371428Y12185714D02*
X203514285Y12185714D01*
X203514285Y13985714D01*
X204371428Y13985714D01*
X205057142Y12700000D02*
X205914285Y12700000D01*
X204885714Y12185714D02*
X205485714Y13985714D01*
X206085714Y12185714D01*
X206428571Y13985714D02*
X207457142Y13985714D01*
X206942857Y12185714D02*
X206942857Y13985714D01*
X208057142Y12185714D02*
X208057142Y13985714D01*
X208057142Y13128571D02*
X209085714Y13128571D01*
X209085714Y12185714D02*
X209085714Y13985714D01*
X209942857Y13128571D02*
X210542857Y13128571D01*
X210800000Y12185714D02*
X209942857Y12185714D01*
X209942857Y13985714D01*
X210800000Y13985714D01*
X212600000Y12185714D02*
X212000000Y13042857D01*
X211571428Y12185714D02*
X211571428Y13985714D01*
X212257142Y13985714D01*
X212428571Y13900000D01*
X212514285Y13814285D01*
X212600000Y13642857D01*
X212600000Y13385714D01*
X212514285Y13214285D01*
X212428571Y13128571D01*
X212257142Y13042857D01*
X211571428Y13042857D01*
X214742857Y12185714D02*
X214742857Y13985714D01*
X215342857Y12700000D01*
X215942857Y13985714D01*
X215942857Y12185714D01*
X217571428Y13385714D02*
X217571428Y12185714D01*
X217142857Y14071428D02*
X216714285Y12785714D01*
X217828571Y12785714D01*
X219885714Y13128571D02*
X220485714Y13128571D01*
X220742857Y12185714D02*
X219885714Y12185714D01*
X219885714Y13985714D01*
X220742857Y13985714D01*
X221342857Y13985714D02*
X222542857Y12185714D01*
X222542857Y13985714D02*
X221342857Y12185714D01*
X223228571Y12185714D02*
X223228571Y13985714D01*
X223914285Y13985714D01*
X224085714Y13900000D01*
X224171428Y13814285D01*
X224257142Y13642857D01*
X224257142Y13385714D01*
X224171428Y13214285D01*
X224085714Y13128571D01*
X223914285Y13042857D01*
X223228571Y13042857D01*
X226057142Y12185714D02*
X225457142Y13042857D01*
X225028571Y12185714D02*
X225028571Y13985714D01*
X225714285Y13985714D01*
X225885714Y13900000D01*
X225971428Y13814285D01*
X226057142Y13642857D01*
X226057142Y13385714D01*
X225971428Y13214285D01*
X225885714Y13128571D01*
X225714285Y13042857D01*
X225028571Y13042857D01*
X226828571Y13128571D02*
X227428571Y13128571D01*
X227685714Y12185714D02*
X226828571Y12185714D01*
X226828571Y13985714D01*
X227685714Y13985714D01*
X228371428Y12271428D02*
X228628571Y12185714D01*
X229057142Y12185714D01*
X229228571Y12271428D01*
X229314285Y12357142D01*
X229400000Y12528571D01*
X229400000Y12700000D01*
X229314285Y12871428D01*
X229228571Y12957142D01*
X229057142Y13042857D01*
X228714285Y13128571D01*
X228542857Y13214285D01*
X228457142Y13300000D01*
X228371428Y13471428D01*
X228371428Y13642857D01*
X228457142Y13814285D01*
X228542857Y13900000D01*
X228714285Y13985714D01*
X229142857Y13985714D01*
X229400000Y13900000D01*
X230085714Y12271428D02*
X230342857Y12185714D01*
X230771428Y12185714D01*
X230942857Y12271428D01*
X231028571Y12357142D01*
X231114285Y12528571D01*
X231114285Y12700000D01*
X231028571Y12871428D01*
X230942857Y12957142D01*
X230771428Y13042857D01*
X230428571Y13128571D01*
X230257142Y13214285D01*
X230171428Y13300000D01*
X230085714Y13471428D01*
X230085714Y13642857D01*
X230171428Y13814285D01*
X230257142Y13900000D01*
X230428571Y13985714D01*
X230857142Y13985714D01*
X231114285Y13900000D01*
X241430000Y24000000D02*
X241430000Y1140000D01*
X190630000Y24000000D02*
X241430000Y24000000D01*
X190630000Y1140000D02*
X241430000Y1140000D01*
X190630000Y24000000D02*
X190630000Y1140000D01*
X190600000Y54606000D02*
X241400000Y54606000D01*
X190600000Y31746000D02*
X241400000Y31746000D01*
X190600000Y54606000D02*
X190600000Y31746000D01*
X241400000Y54606000D02*
X241400000Y31746000D01*
D11*
X244100000Y-27800000D02*
X244075000Y-27800000D01*
D10*
X241310000Y79352000D02*
X241310000Y56492000D01*
X190510000Y79352000D02*
X190510000Y56492000D01*
X190510000Y56492000D02*
X241310000Y56492000D01*
X190510000Y79352000D02*
X241310000Y79352000D01*
X212544576Y101359542D02*
X212492195Y101307161D01*
X212335052Y101254780D01*
X212230290Y101254780D01*
X212073147Y101307161D01*
X211968385Y101411923D01*
X211916004Y101516685D01*
X211863623Y101726209D01*
X211863623Y101883352D01*
X211916004Y102092876D01*
X211968385Y102197638D01*
X212073147Y102302400D01*
X212230290Y102354780D01*
X212335052Y102354780D01*
X212492195Y102302400D01*
X212544576Y102250019D01*
X213225528Y102354780D02*
X213435052Y102354780D01*
X213539814Y102302400D01*
X213644576Y102197638D01*
X213696957Y101988114D01*
X213696957Y101621447D01*
X213644576Y101411923D01*
X213539814Y101307161D01*
X213435052Y101254780D01*
X213225528Y101254780D01*
X213120766Y101307161D01*
X213016004Y101411923D01*
X212963623Y101621447D01*
X212963623Y101988114D01*
X213016004Y102197638D01*
X213120766Y102302400D01*
X213225528Y102354780D01*
X214116004Y102250019D02*
X214168385Y102302400D01*
X214273147Y102354780D01*
X214535052Y102354780D01*
X214639814Y102302400D01*
X214692195Y102250019D01*
X214744576Y102145257D01*
X214744576Y102040495D01*
X214692195Y101883352D01*
X214063623Y101254780D01*
X214744576Y101254780D01*
X216682671Y101254780D02*
X216316004Y101778590D01*
X216054100Y101254780D02*
X216054100Y102354780D01*
X216473147Y102354780D01*
X216577909Y102302400D01*
X216630290Y102250019D01*
X216682671Y102145257D01*
X216682671Y101988114D01*
X216630290Y101883352D01*
X216577909Y101830971D01*
X216473147Y101778590D01*
X216054100Y101778590D01*
X217154100Y101830971D02*
X217520766Y101830971D01*
X217677909Y101254780D02*
X217154100Y101254780D01*
X217154100Y102354780D01*
X217677909Y102354780D01*
X217992195Y102354780D02*
X218358861Y101254780D01*
X218725528Y102354780D01*
X220663623Y101150019D02*
X220558861Y101202400D01*
X220454100Y101307161D01*
X220296957Y101464304D01*
X220192195Y101516685D01*
X220087433Y101516685D01*
X220139814Y101254780D02*
X220035052Y101307161D01*
X219930290Y101411923D01*
X219877909Y101621447D01*
X219877909Y101988114D01*
X219930290Y102197638D01*
X220035052Y102302400D01*
X220139814Y102354780D01*
X220349338Y102354780D01*
X220454100Y102302400D01*
X220558861Y102197638D01*
X220611242Y101988114D01*
X220611242Y101621447D01*
X220558861Y101411923D01*
X220454100Y101307161D01*
X220349338Y101254780D01*
X220139814Y101254780D01*
X199408071Y92911714D02*
X199408071Y94711714D01*
X200179500Y92911714D02*
X200179500Y93854571D01*
X200093785Y94026000D01*
X199922357Y94111714D01*
X199665214Y94111714D01*
X199493785Y94026000D01*
X199408071Y93940285D01*
X200779500Y94111714D02*
X201465214Y94111714D01*
X201036642Y94711714D02*
X201036642Y93168857D01*
X201122357Y92997428D01*
X201293785Y92911714D01*
X201465214Y92911714D01*
X201808071Y94111714D02*
X202493785Y94111714D01*
X202065214Y94711714D02*
X202065214Y93168857D01*
X202150928Y92997428D01*
X202322357Y92911714D01*
X202493785Y92911714D01*
X203093785Y94111714D02*
X203093785Y92311714D01*
X203093785Y94026000D02*
X203265214Y94111714D01*
X203608071Y94111714D01*
X203779500Y94026000D01*
X203865214Y93940285D01*
X203950928Y93768857D01*
X203950928Y93254571D01*
X203865214Y93083142D01*
X203779500Y92997428D01*
X203608071Y92911714D01*
X203265214Y92911714D01*
X203093785Y92997428D01*
X204722357Y93083142D02*
X204808071Y92997428D01*
X204722357Y92911714D01*
X204636642Y92997428D01*
X204722357Y93083142D01*
X204722357Y92911714D01*
X204722357Y94026000D02*
X204808071Y93940285D01*
X204722357Y93854571D01*
X204636642Y93940285D01*
X204722357Y94026000D01*
X204722357Y93854571D01*
X206865214Y94797428D02*
X205322357Y92483142D01*
X208750928Y94797428D02*
X207208071Y92483142D01*
X209350928Y94111714D02*
X209350928Y92311714D01*
X209350928Y94026000D02*
X209522357Y94111714D01*
X209865214Y94111714D01*
X210036642Y94026000D01*
X210122357Y93940285D01*
X210208071Y93768857D01*
X210208071Y93254571D01*
X210122357Y93083142D01*
X210036642Y92997428D01*
X209865214Y92911714D01*
X209522357Y92911714D01*
X209350928Y92997428D01*
X210808071Y94111714D02*
X211236642Y92911714D01*
X211665214Y94111714D01*
X212608071Y92911714D02*
X212436642Y92997428D01*
X212350928Y93083142D01*
X212265214Y93254571D01*
X212265214Y93768857D01*
X212350928Y93940285D01*
X212436642Y94026000D01*
X212608071Y94111714D01*
X212865214Y94111714D01*
X213036642Y94026000D01*
X213122357Y93940285D01*
X213208071Y93768857D01*
X213208071Y93254571D01*
X213122357Y93083142D01*
X213036642Y92997428D01*
X212865214Y92911714D01*
X212608071Y92911714D01*
X213893785Y92997428D02*
X214065214Y92911714D01*
X214408071Y92911714D01*
X214579500Y92997428D01*
X214665214Y93168857D01*
X214665214Y93254571D01*
X214579500Y93426000D01*
X214408071Y93511714D01*
X214150928Y93511714D01*
X213979500Y93597428D01*
X213893785Y93768857D01*
X213893785Y93854571D01*
X213979500Y94026000D01*
X214150928Y94111714D01*
X214408071Y94111714D01*
X214579500Y94026000D01*
X215436642Y93083142D02*
X215522357Y92997428D01*
X215436642Y92911714D01*
X215350928Y92997428D01*
X215436642Y93083142D01*
X215436642Y92911714D01*
X216550928Y92911714D02*
X216379500Y92997428D01*
X216293785Y93083142D01*
X216208071Y93254571D01*
X216208071Y93768857D01*
X216293785Y93940285D01*
X216379500Y94026000D01*
X216550928Y94111714D01*
X216808071Y94111714D01*
X216979500Y94026000D01*
X217065214Y93940285D01*
X217150928Y93768857D01*
X217150928Y93254571D01*
X217065214Y93083142D01*
X216979500Y92997428D01*
X216808071Y92911714D01*
X216550928Y92911714D01*
X217922357Y92911714D02*
X217922357Y94111714D01*
X217922357Y93768857D02*
X218008071Y93940285D01*
X218093785Y94026000D01*
X218265214Y94111714D01*
X218436642Y94111714D01*
X219808071Y94111714D02*
X219808071Y92654571D01*
X219722357Y92483142D01*
X219636642Y92397428D01*
X219465214Y92311714D01*
X219208071Y92311714D01*
X219036642Y92397428D01*
X219808071Y92997428D02*
X219636642Y92911714D01*
X219293785Y92911714D01*
X219122357Y92997428D01*
X219036642Y93083142D01*
X218950928Y93254571D01*
X218950928Y93768857D01*
X219036642Y93940285D01*
X219122357Y94026000D01*
X219293785Y94111714D01*
X219636642Y94111714D01*
X219808071Y94026000D01*
X221950928Y94797428D02*
X220408071Y92483142D01*
X223322357Y92997428D02*
X223150928Y92911714D01*
X222808071Y92911714D01*
X222636642Y92997428D01*
X222550928Y93083142D01*
X222465214Y93254571D01*
X222465214Y93768857D01*
X222550928Y93940285D01*
X222636642Y94026000D01*
X222808071Y94111714D01*
X223150928Y94111714D01*
X223322357Y94026000D01*
X224350928Y92911714D02*
X224179500Y92997428D01*
X224093785Y93083142D01*
X224008071Y93254571D01*
X224008071Y93768857D01*
X224093785Y93940285D01*
X224179500Y94026000D01*
X224350928Y94111714D01*
X224608071Y94111714D01*
X224779500Y94026000D01*
X224865214Y93940285D01*
X224950928Y93768857D01*
X224950928Y93254571D01*
X224865214Y93083142D01*
X224779500Y92997428D01*
X224608071Y92911714D01*
X224350928Y92911714D01*
X225636642Y94540285D02*
X225722357Y94626000D01*
X225893785Y94711714D01*
X226322357Y94711714D01*
X226493785Y94626000D01*
X226579500Y94540285D01*
X226665214Y94368857D01*
X226665214Y94197428D01*
X226579500Y93940285D01*
X225550928Y92911714D01*
X226665214Y92911714D01*
X228722357Y94797428D02*
X227179500Y92483142D01*
X230093785Y94111714D02*
X230093785Y92311714D01*
X230093785Y92997428D02*
X229922357Y92911714D01*
X229579500Y92911714D01*
X229408071Y92997428D01*
X229322357Y93083142D01*
X229236642Y93254571D01*
X229236642Y93768857D01*
X229322357Y93940285D01*
X229408071Y94026000D01*
X229579500Y94111714D01*
X229922357Y94111714D01*
X230093785Y94026000D01*
X220304761Y86835714D02*
X220352380Y86978571D01*
X220352380Y87216666D01*
X220304761Y87311904D01*
X220257142Y87359523D01*
X220161904Y87407142D01*
X220066666Y87407142D01*
X219971428Y87359523D01*
X219923809Y87311904D01*
X219876190Y87216666D01*
X219828571Y87026190D01*
X219780952Y86930952D01*
X219733333Y86883333D01*
X219638095Y86835714D01*
X219542857Y86835714D01*
X219447619Y86883333D01*
X219400000Y86930952D01*
X219352380Y87026190D01*
X219352380Y87264285D01*
X219400000Y87407142D01*
X220352380Y87835714D02*
X219352380Y87835714D01*
X219352380Y88073809D01*
X219400000Y88216666D01*
X219495238Y88311904D01*
X219590476Y88359523D01*
X219780952Y88407142D01*
X219923809Y88407142D01*
X220114285Y88359523D01*
X220209523Y88311904D01*
X220304761Y88216666D01*
X220352380Y88073809D01*
X220352380Y87835714D01*
X220066666Y88788095D02*
X220066666Y89264285D01*
X220352380Y88692857D02*
X219352380Y89026190D01*
X220352380Y89359523D01*
X217754761Y86859523D02*
X217802380Y87002380D01*
X217802380Y87240476D01*
X217754761Y87335714D01*
X217707142Y87383333D01*
X217611904Y87430952D01*
X217516666Y87430952D01*
X217421428Y87383333D01*
X217373809Y87335714D01*
X217326190Y87240476D01*
X217278571Y87050000D01*
X217230952Y86954761D01*
X217183333Y86907142D01*
X217088095Y86859523D01*
X216992857Y86859523D01*
X216897619Y86907142D01*
X216850000Y86954761D01*
X216802380Y87050000D01*
X216802380Y87288095D01*
X216850000Y87430952D01*
X217707142Y88430952D02*
X217754761Y88383333D01*
X217802380Y88240476D01*
X217802380Y88145238D01*
X217754761Y88002380D01*
X217659523Y87907142D01*
X217564285Y87859523D01*
X217373809Y87811904D01*
X217230952Y87811904D01*
X217040476Y87859523D01*
X216945238Y87907142D01*
X216850000Y88002380D01*
X216802380Y88145238D01*
X216802380Y88240476D01*
X216850000Y88383333D01*
X216897619Y88430952D01*
X217802380Y89335714D02*
X217802380Y88859523D01*
X216802380Y88859523D01*
X211550000Y87588095D02*
X211502380Y87492857D01*
X211502380Y87350000D01*
X211550000Y87207142D01*
X211645238Y87111904D01*
X211740476Y87064285D01*
X211930952Y87016666D01*
X212073809Y87016666D01*
X212264285Y87064285D01*
X212359523Y87111904D01*
X212454761Y87207142D01*
X212502380Y87350000D01*
X212502380Y87445238D01*
X212454761Y87588095D01*
X212407142Y87635714D01*
X212073809Y87635714D01*
X212073809Y87445238D01*
X212502380Y88064285D02*
X211502380Y88064285D01*
X212502380Y88635714D01*
X211502380Y88635714D01*
X212502380Y89111904D02*
X211502380Y89111904D01*
X211502380Y89350000D01*
X211550000Y89492857D01*
X211645238Y89588095D01*
X211740476Y89635714D01*
X211930952Y89683333D01*
X212073809Y89683333D01*
X212264285Y89635714D01*
X212359523Y89588095D01*
X212454761Y89492857D01*
X212502380Y89350000D01*
X212502380Y89111904D01*
X214052380Y86838095D02*
X214052380Y87457142D01*
X214433333Y87123809D01*
X214433333Y87266666D01*
X214480952Y87361904D01*
X214528571Y87409523D01*
X214623809Y87457142D01*
X214861904Y87457142D01*
X214957142Y87409523D01*
X215004761Y87361904D01*
X215052380Y87266666D01*
X215052380Y86980952D01*
X215004761Y86885714D01*
X214957142Y86838095D01*
X214052380Y87742857D02*
X215052380Y88076190D01*
X214052380Y88409523D01*
X210300000Y80771428D02*
X210557142Y80685714D01*
X210985714Y80685714D01*
X211157142Y80771428D01*
X211242857Y80857142D01*
X211328571Y81028571D01*
X211328571Y81200000D01*
X211242857Y81371428D01*
X211157142Y81457142D01*
X210985714Y81542857D01*
X210642857Y81628571D01*
X210471428Y81714285D01*
X210385714Y81800000D01*
X210300000Y81971428D01*
X210300000Y82142857D01*
X210385714Y82314285D01*
X210471428Y82400000D01*
X210642857Y82485714D01*
X211071428Y82485714D01*
X211328571Y82400000D01*
X212014285Y80771428D02*
X212271428Y80685714D01*
X212700000Y80685714D01*
X212871428Y80771428D01*
X212957142Y80857142D01*
X213042857Y81028571D01*
X213042857Y81200000D01*
X212957142Y81371428D01*
X212871428Y81457142D01*
X212700000Y81542857D01*
X212357142Y81628571D01*
X212185714Y81714285D01*
X212100000Y81800000D01*
X212014285Y81971428D01*
X212014285Y82142857D01*
X212100000Y82314285D01*
X212185714Y82400000D01*
X212357142Y82485714D01*
X212785714Y82485714D01*
X213042857Y82400000D01*
X213814285Y80685714D02*
X213814285Y82485714D01*
X214242857Y82485714D01*
X214500000Y82400000D01*
X214671428Y82228571D01*
X214757142Y82057142D01*
X214842857Y81714285D01*
X214842857Y81457142D01*
X214757142Y81114285D01*
X214671428Y80942857D01*
X214500000Y80771428D01*
X214242857Y80685714D01*
X213814285Y80685714D01*
X216557142Y80685714D02*
X215528571Y80685714D01*
X216042857Y80685714D02*
X216042857Y82485714D01*
X215871428Y82228571D01*
X215700000Y82057142D01*
X215528571Y81971428D01*
X217157142Y82485714D02*
X218271428Y82485714D01*
X217671428Y81800000D01*
X217928571Y81800000D01*
X218100000Y81714285D01*
X218185714Y81628571D01*
X218271428Y81457142D01*
X218271428Y81028571D01*
X218185714Y80857142D01*
X218100000Y80771428D01*
X217928571Y80685714D01*
X217414285Y80685714D01*
X217242857Y80771428D01*
X217157142Y80857142D01*
X219385714Y82485714D02*
X219557142Y82485714D01*
X219728571Y82400000D01*
X219814285Y82314285D01*
X219900000Y82142857D01*
X219985714Y81800000D01*
X219985714Y81371428D01*
X219900000Y81028571D01*
X219814285Y80857142D01*
X219728571Y80771428D01*
X219557142Y80685714D01*
X219385714Y80685714D01*
X219214285Y80771428D01*
X219128571Y80857142D01*
X219042857Y81028571D01*
X218957142Y81371428D01*
X218957142Y81800000D01*
X219042857Y82142857D01*
X219128571Y82314285D01*
X219214285Y82400000D01*
X219385714Y82485714D01*
X221528571Y82485714D02*
X221185714Y82485714D01*
X221014285Y82400000D01*
X220928571Y82314285D01*
X220757142Y82057142D01*
X220671428Y81714285D01*
X220671428Y81028571D01*
X220757142Y80857142D01*
X220842857Y80771428D01*
X221014285Y80685714D01*
X221357142Y80685714D01*
X221528571Y80771428D01*
X221614285Y80857142D01*
X221700000Y81028571D01*
X221700000Y81457142D01*
X221614285Y81628571D01*
X221528571Y81714285D01*
X221357142Y81800000D01*
X221014285Y81800000D01*
X220842857Y81714285D01*
X220757142Y81628571D01*
X220671428Y81457142D01*
D11*
X228169200Y73600000D02*
X228169200Y70500000D01*
X203607400Y86300000D02*
X228169200Y86298400D01*
X203607400Y86300000D02*
X203607400Y70750000D01*
%TO.C,J5*%
X205770000Y53300000D02*
X205770000Y54630000D01*
X205770000Y54630000D02*
X207100000Y54630000D01*
X208370000Y54630000D02*
X236370000Y54630000D01*
X236370000Y51970000D02*
X236370000Y54630000D01*
X208370000Y51970000D02*
X236370000Y51970000D01*
X208370000Y51970000D02*
X208370000Y54630000D01*
%TO.C,J1*%
X236380000Y33016000D02*
X236380000Y31686000D01*
X236380000Y31686000D02*
X235050000Y31686000D01*
X233780000Y31686000D02*
X195620000Y31686000D01*
X195620000Y34346000D02*
X195620000Y31686000D01*
X233780000Y34346000D02*
X195620000Y34346000D01*
X233780000Y34346000D02*
X233780000Y31686000D01*
%TO.C,J12*%
X208370000Y21370000D02*
X208370000Y24030000D01*
X208370000Y21370000D02*
X236370000Y21370000D01*
X236370000Y21370000D02*
X236370000Y24030000D01*
X208370000Y24030000D02*
X236370000Y24030000D01*
X205770000Y24030000D02*
X207100000Y24030000D01*
X205770000Y22700000D02*
X205770000Y24030000D01*
%TO.C,J11*%
X233690000Y59092000D02*
X233690000Y56432000D01*
X233690000Y59092000D02*
X195530000Y59092000D01*
X195530000Y59092000D02*
X195530000Y56432000D01*
X233690000Y56432000D02*
X195530000Y56432000D01*
X236290000Y56432000D02*
X234960000Y56432000D01*
X236290000Y57762000D02*
X236290000Y56432000D01*
%TO.C,J8*%
X205770000Y78100000D02*
X205770000Y79430000D01*
X205770000Y79430000D02*
X207100000Y79430000D01*
X208370000Y79430000D02*
X236370000Y79430000D01*
X236370000Y76770000D02*
X236370000Y79430000D01*
X208370000Y76770000D02*
X236370000Y76770000D01*
X208370000Y76770000D02*
X208370000Y79430000D01*
%TO.C,J3*%
X233810000Y3740000D02*
X233810000Y1080000D01*
X233810000Y3740000D02*
X195650000Y3740000D01*
X195650000Y3740000D02*
X195650000Y1080000D01*
X233810000Y1080000D02*
X195650000Y1080000D01*
X236410000Y1080000D02*
X235080000Y1080000D01*
X236410000Y2410000D02*
X236410000Y1080000D01*
%TO.C,J10*%
X210710200Y84952200D02*
X210710200Y86282200D01*
X210710200Y86282200D02*
X212040200Y86282200D01*
X213310200Y86282200D02*
X220990200Y86282200D01*
X220990200Y83622200D02*
X220990200Y86282200D01*
X213310200Y83622200D02*
X220990200Y83622200D01*
X213310200Y83622200D02*
X213310200Y86282200D01*
%TO.C,J5*%
D10*
X237566666Y54183619D02*
X237566666Y53469333D01*
X237519047Y53326476D01*
X237423809Y53231238D01*
X237280952Y53183619D01*
X237185714Y53183619D01*
X238519047Y54183619D02*
X238042857Y54183619D01*
X237995238Y53707428D01*
X238042857Y53755047D01*
X238138095Y53802666D01*
X238376190Y53802666D01*
X238471428Y53755047D01*
X238519047Y53707428D01*
X238566666Y53612190D01*
X238566666Y53374095D01*
X238519047Y53278857D01*
X238471428Y53231238D01*
X238376190Y53183619D01*
X238138095Y53183619D01*
X238042857Y53231238D01*
X237995238Y53278857D01*
%TO.C,J1*%
X193866666Y33697619D02*
X193866666Y32983333D01*
X193819047Y32840476D01*
X193723809Y32745238D01*
X193580952Y32697619D01*
X193485714Y32697619D01*
X194866666Y32697619D02*
X194295238Y32697619D01*
X194580952Y32697619D02*
X194580952Y33697619D01*
X194485714Y33554761D01*
X194390476Y33459523D01*
X194295238Y33411904D01*
%TO.C,H5*%
X187463095Y-27202380D02*
X187463095Y-26202380D01*
X187463095Y-26678571D02*
X188034523Y-26678571D01*
X188034523Y-27202380D02*
X188034523Y-26202380D01*
X188986904Y-26202380D02*
X188510714Y-26202380D01*
X188463095Y-26678571D01*
X188510714Y-26630952D01*
X188605952Y-26583333D01*
X188844047Y-26583333D01*
X188939285Y-26630952D01*
X188986904Y-26678571D01*
X189034523Y-26773809D01*
X189034523Y-27011904D01*
X188986904Y-27107142D01*
X188939285Y-27154761D01*
X188844047Y-27202380D01*
X188605952Y-27202380D01*
X188510714Y-27154761D01*
X188463095Y-27107142D01*
%TO.C,H6*%
X242988095Y-26952380D02*
X242988095Y-25952380D01*
X242988095Y-26428571D02*
X243559523Y-26428571D01*
X243559523Y-26952380D02*
X243559523Y-25952380D01*
X244464285Y-25952380D02*
X244273809Y-25952380D01*
X244178571Y-26000000D01*
X244130952Y-26047619D01*
X244035714Y-26190476D01*
X243988095Y-26380952D01*
X243988095Y-26761904D01*
X244035714Y-26857142D01*
X244083333Y-26904761D01*
X244178571Y-26952380D01*
X244369047Y-26952380D01*
X244464285Y-26904761D01*
X244511904Y-26857142D01*
X244559523Y-26761904D01*
X244559523Y-26523809D01*
X244511904Y-26428571D01*
X244464285Y-26380952D01*
X244369047Y-26333333D01*
X244178571Y-26333333D01*
X244083333Y-26380952D01*
X244035714Y-26428571D01*
X243988095Y-26523809D01*
%TO.C,J12*%
X237370476Y23477619D02*
X237370476Y22763333D01*
X237322857Y22620476D01*
X237227619Y22525238D01*
X237084761Y22477619D01*
X236989523Y22477619D01*
X238370476Y22477619D02*
X237799047Y22477619D01*
X238084761Y22477619D02*
X238084761Y23477619D01*
X237989523Y23334761D01*
X237894285Y23239523D01*
X237799047Y23191904D01*
X238751428Y23382380D02*
X238799047Y23430000D01*
X238894285Y23477619D01*
X239132380Y23477619D01*
X239227619Y23430000D01*
X239275238Y23382380D01*
X239322857Y23287142D01*
X239322857Y23191904D01*
X239275238Y23049047D01*
X238703809Y22477619D01*
X239322857Y22477619D01*
%TO.C,J11*%
X193040476Y58347619D02*
X193040476Y57633333D01*
X192992857Y57490476D01*
X192897619Y57395238D01*
X192754761Y57347619D01*
X192659523Y57347619D01*
X194040476Y57347619D02*
X193469047Y57347619D01*
X193754761Y57347619D02*
X193754761Y58347619D01*
X193659523Y58204761D01*
X193564285Y58109523D01*
X193469047Y58061904D01*
X194992857Y57347619D02*
X194421428Y57347619D01*
X194707142Y57347619D02*
X194707142Y58347619D01*
X194611904Y58204761D01*
X194516666Y58109523D01*
X194421428Y58061904D01*
%TO.C,J8*%
X236852380Y77466666D02*
X237566666Y77466666D01*
X237709523Y77419047D01*
X237804761Y77323809D01*
X237852380Y77180952D01*
X237852380Y77085714D01*
X237280952Y78085714D02*
X237233333Y77990476D01*
X237185714Y77942857D01*
X237090476Y77895238D01*
X237042857Y77895238D01*
X236947619Y77942857D01*
X236900000Y77990476D01*
X236852380Y78085714D01*
X236852380Y78276190D01*
X236900000Y78371428D01*
X236947619Y78419047D01*
X237042857Y78466666D01*
X237090476Y78466666D01*
X237185714Y78419047D01*
X237233333Y78371428D01*
X237280952Y78276190D01*
X237280952Y78085714D01*
X237328571Y77990476D01*
X237376190Y77942857D01*
X237471428Y77895238D01*
X237661904Y77895238D01*
X237757142Y77942857D01*
X237804761Y77990476D01*
X237852380Y78085714D01*
X237852380Y78276190D01*
X237804761Y78371428D01*
X237757142Y78419047D01*
X237661904Y78466666D01*
X237471428Y78466666D01*
X237376190Y78419047D01*
X237328571Y78371428D01*
X237280952Y78276190D01*
%TO.C,J3*%
X193966666Y2897619D02*
X193966666Y2183333D01*
X193919047Y2040476D01*
X193823809Y1945238D01*
X193680952Y1897619D01*
X193585714Y1897619D01*
X194347619Y2897619D02*
X194966666Y2897619D01*
X194633333Y2516666D01*
X194776190Y2516666D01*
X194871428Y2469047D01*
X194919047Y2421428D01*
X194966666Y2326190D01*
X194966666Y2088095D01*
X194919047Y1992857D01*
X194871428Y1945238D01*
X194776190Y1897619D01*
X194490476Y1897619D01*
X194395238Y1945238D01*
X194347619Y1992857D01*
%TO.C,H1*%
X191160495Y87253819D02*
X191160495Y88253819D01*
X191160495Y87777628D02*
X191731923Y87777628D01*
X191731923Y87253819D02*
X191731923Y88253819D01*
X192731923Y87253819D02*
X192160495Y87253819D01*
X192446209Y87253819D02*
X192446209Y88253819D01*
X192350971Y88110961D01*
X192255733Y88015723D01*
X192160495Y87968104D01*
%TO.C,H4*%
X239501775Y-16835380D02*
X239501775Y-15835380D01*
X239501775Y-16311571D02*
X240073203Y-16311571D01*
X240073203Y-16835380D02*
X240073203Y-15835380D01*
X240977965Y-16168714D02*
X240977965Y-16835380D01*
X240739870Y-15787761D02*
X240501775Y-16502047D01*
X241120822Y-16502047D01*
%TO.C,H3*%
X191196055Y-17048740D02*
X191196055Y-16048740D01*
X191196055Y-16524931D02*
X191767483Y-16524931D01*
X191767483Y-17048740D02*
X191767483Y-16048740D01*
X192148436Y-16048740D02*
X192767483Y-16048740D01*
X192434150Y-16429693D01*
X192577007Y-16429693D01*
X192672245Y-16477312D01*
X192719864Y-16524931D01*
X192767483Y-16620169D01*
X192767483Y-16858264D01*
X192719864Y-16953502D01*
X192672245Y-17001121D01*
X192577007Y-17048740D01*
X192291293Y-17048740D01*
X192196055Y-17001121D01*
X192148436Y-16953502D01*
%TO.C,H2*%
X239547495Y87248739D02*
X239547495Y88248739D01*
X239547495Y87772548D02*
X240118923Y87772548D01*
X240118923Y87248739D02*
X240118923Y88248739D01*
X240547495Y88153500D02*
X240595114Y88201120D01*
X240690352Y88248739D01*
X240928447Y88248739D01*
X241023685Y88201120D01*
X241071304Y88153500D01*
X241118923Y88058262D01*
X241118923Y87963024D01*
X241071304Y87820167D01*
X240499876Y87248739D01*
X241118923Y87248739D01*
%TO.C,J10*%
X208240476Y85247619D02*
X208240476Y84533333D01*
X208192857Y84390476D01*
X208097619Y84295238D01*
X207954761Y84247619D01*
X207859523Y84247619D01*
X209240476Y84247619D02*
X208669047Y84247619D01*
X208954761Y84247619D02*
X208954761Y85247619D01*
X208859523Y85104761D01*
X208764285Y85009523D01*
X208669047Y84961904D01*
X209859523Y85247619D02*
X209954761Y85247619D01*
X210050000Y85200000D01*
X210097619Y85152380D01*
X210145238Y85057142D01*
X210192857Y84866666D01*
X210192857Y84628571D01*
X210145238Y84438095D01*
X210097619Y84342857D01*
X210050000Y84295238D01*
X209954761Y84247619D01*
X209859523Y84247619D01*
X209764285Y84295238D01*
X209716666Y84342857D01*
X209669047Y84438095D01*
X209621428Y84628571D01*
X209621428Y84866666D01*
X209669047Y85057142D01*
X209716666Y85152380D01*
X209764285Y85200000D01*
X209859523Y85247619D01*
%TD*%
M02*
