EESchema Schematic File Version 4
EELAYER 30 0
EELAYER END
$Descr A4 11693 8268
encoding utf-8
Sheet 1 1
Title ""
Date ""
Rev ""
Comp ""
Comment1 ""
Comment2 ""
Comment3 ""
Comment4 ""
$EndDescr
$Comp
L Device:R R3
U 1 1 5F989DB1
P 775 6275
F 0 "R3" H 845 6321 50  0000 L CNN
F 1 "4.7K" H 845 6230 50  0000 L CNN
F 2 "Resistor_THT:R_Axial_DIN0309_L9.0mm_D3.2mm_P12.70mm_Horizontal" V 705 6275 50  0001 C CNN
F 3 "~" H 775 6275 50  0001 C CNN
	1    775  6275
	1    0    0    -1  
$EndComp
Text GLabel 1150 6450 0    50   Input ~ 0
SCL
$Comp
L power:+3V3 #PWR04
U 1 1 5F98B87C
P 775 6125
F 0 "#PWR04" H 775 5975 50  0001 C CNN
F 1 "+3V3" H 790 6298 50  0000 C CNN
F 2 "" H 775 6125 50  0001 C CNN
F 3 "" H 775 6125 50  0001 C CNN
	1    775  6125
	1    0    0    -1  
$EndComp
$Comp
L Device:R R4
U 1 1 5F98BC9A
P 1150 6300
F 0 "R4" H 1220 6346 50  0000 L CNN
F 1 "4.7K" H 1220 6255 50  0000 L CNN
F 2 "Resistor_THT:R_Axial_DIN0309_L9.0mm_D3.2mm_P12.70mm_Horizontal" V 1080 6300 50  0001 C CNN
F 3 "~" H 1150 6300 50  0001 C CNN
	1    1150 6300
	1    0    0    -1  
$EndComp
$Comp
L power:+3V3 #PWR06
U 1 1 5F98C06B
P 1150 6150
F 0 "#PWR06" H 1150 6000 50  0001 C CNN
F 1 "+3V3" H 1165 6323 50  0000 C CNN
F 2 "" H 1150 6150 50  0001 C CNN
F 3 "" H 1150 6150 50  0001 C CNN
	1    1150 6150
	1    0    0    -1  
$EndComp
Text GLabel 775  6425 0    50   Input ~ 0
SDA
$Comp
L Mechanical:MountingHole H2
U 1 1 5F9CF5FF
P 6600 2875
F 0 "H2" H 6700 2921 50  0000 L CNN
F 1 "MountingHole" H 6700 2830 50  0000 L CNN
F 2 "MountingHole:MountingHole_3.5mm" H 6600 2875 50  0001 C CNN
F 3 "~" H 6600 2875 50  0001 C CNN
	1    6600 2875
	1    0    0    -1  
$EndComp
$Comp
L Connector:Conn_01x07_Female J8
U 1 1 5FB57B67
P 5825 1575
F 0 "J8" H 5853 1601 50  0000 L CNN
F 1 "SCD30" H 5853 1510 50  0000 L CNN
F 2 "Connector_PinSocket_2.54mm:PinSocket_1x07_P2.54mm_Vertical" H 5825 1575 50  0001 C CNN
F 3 "~" H 5825 1575 50  0001 C CNN
	1    5825 1575
	1    0    0    -1  
$EndComp
$Comp
L power:+3V3 #PWR023
U 1 1 5FBA156B
P 5625 1275
F 0 "#PWR023" H 5625 1125 50  0001 C CNN
F 1 "+3V3" H 5640 1448 50  0000 C CNN
F 2 "" H 5625 1275 50  0001 C CNN
F 3 "" H 5625 1275 50  0001 C CNN
	1    5625 1275
	1    0    0    -1  
$EndComp
$Comp
L power:GND #PWR020
U 1 1 5FBA258D
P 5275 1375
F 0 "#PWR020" H 5275 1125 50  0001 C CNN
F 1 "GND" H 5280 1202 50  0000 C CNN
F 2 "" H 5275 1375 50  0001 C CNN
F 3 "" H 5275 1375 50  0001 C CNN
	1    5275 1375
	1    0    0    -1  
$EndComp
Wire Wire Line
	5625 1375 5275 1375
Text GLabel 5625 1475 0    50   Input ~ 0
SCL
Text GLabel 5625 1575 0    50   Input ~ 0
SDA
Text Notes 650  5750 0    79   ~ 0
i2c pullups
Text Notes 5450 1000 0    79   ~ 0
SCD30
$Comp
L Mechanical:MountingHole H1
U 1 1 5FDF5FDF
P 6600 2650
F 0 "H1" H 6700 2696 50  0000 L CNN
F 1 "MountingHole" H 6700 2605 50  0000 L CNN
F 2 "MountingHole:MountingHole_3.7mm" H 6600 2650 50  0001 C CNN
F 3 "~" H 6600 2650 50  0001 C CNN
	1    6600 2650
	1    0    0    -1  
$EndComp
$Comp
L Connector:Conn_01x04_Female J10
U 1 1 60000D99
P 8325 6025
F 0 "J10" H 8353 6001 50  0000 L CNN
F 1 "ssd1306" H 8353 5910 50  0000 L CNN
F 2 "Connector_PinSocket_2.54mm:PinSocket_1x04_P2.54mm_Vertical" H 8325 6025 50  0001 C CNN
F 3 "~" H 8325 6025 50  0001 C CNN
	1    8325 6025
	1    0    0    -1  
$EndComp
$Comp
L power:GND #PWR027
U 1 1 60000DA1
P 7750 5925
F 0 "#PWR027" H 7750 5675 50  0001 C CNN
F 1 "GND" H 7755 5752 50  0000 C CNN
F 2 "" H 7750 5925 50  0001 C CNN
F 3 "" H 7750 5925 50  0001 C CNN
	1    7750 5925
	1    0    0    -1  
$EndComp
$Comp
L power:+3V3 #PWR028
U 1 1 60000DA7
P 8000 5850
F 0 "#PWR028" H 8000 5700 50  0001 C CNN
F 1 "+3V3" V 8015 5978 50  0000 L CNN
F 2 "" H 8000 5850 50  0001 C CNN
F 3 "" H 8000 5850 50  0001 C CNN
	1    8000 5850
	1    0    0    -1  
$EndComp
Wire Wire Line
	8125 6025 8000 6025
Wire Wire Line
	8000 6025 8000 5850
Wire Wire Line
	8125 5925 7750 5925
$Comp
L Switch:SW_Push_Dual SW1
U 1 1 6028B8CB
P 5400 4500
F 0 "SW1" H 5400 4785 50  0000 C CNN
F 1 "SW_Push_Dual" H 5400 4694 50  0000 C CNN
F 2 "Button_Switch_THT:SW_TH_Tactile_Omron_B3F-10xx" H 5400 4700 50  0001 C CNN
F 3 "~" H 5400 4700 50  0001 C CNN
	1    5400 4500
	1    0    0    -1  
$EndComp
Wire Wire Line
	5600 4500 5600 4300
Wire Wire Line
	5600 4300 5200 4300
Wire Wire Line
	5200 4300 5200 4500
Wire Wire Line
	5600 4700 5600 4550
Wire Wire Line
	5600 4550 5200 4550
Wire Wire Line
	5200 4550 5200 4700
$Comp
L power:GND #PWR019
U 1 1 6028DB07
P 5600 4700
F 0 "#PWR019" H 5600 4450 50  0001 C CNN
F 1 "GND" H 5605 4527 50  0000 C CNN
F 2 "" H 5600 4700 50  0001 C CNN
F 3 "" H 5600 4700 50  0001 C CNN
	1    5600 4700
	1    0    0    -1  
$EndComp
Connection ~ 5600 4700
$Comp
L Device:R R2
U 1 1 6028DEF2
P 4950 4350
F 0 "R2" H 5020 4396 50  0000 L CNN
F 1 "4.7K" H 5020 4305 50  0000 L CNN
F 2 "Resistor_THT:R_Axial_DIN0309_L9.0mm_D3.2mm_P12.70mm_Horizontal" V 4880 4350 50  0001 C CNN
F 3 "~" H 4950 4350 50  0001 C CNN
	1    4950 4350
	1    0    0    -1  
$EndComp
$Comp
L power:+3V3 #PWR018
U 1 1 6028E7B5
P 4950 4200
F 0 "#PWR018" H 4950 4050 50  0001 C CNN
F 1 "+3V3" H 4965 4373 50  0000 C CNN
F 2 "" H 4950 4200 50  0001 C CNN
F 3 "" H 4950 4200 50  0001 C CNN
	1    4950 4200
	1    0    0    -1  
$EndComp
Wire Wire Line
	5200 4500 4950 4500
Connection ~ 5200 4500
Text Notes 5050 3950 0    79   ~ 0
BUTTON A
$Comp
L power:GND #PWR07
U 1 1 601B48F9
P 3400 6700
F 0 "#PWR07" H 3400 6450 50  0001 C CNN
F 1 "GND" H 3405 6527 50  0000 C CNN
F 2 "" H 3400 6700 50  0001 C CNN
F 3 "" H 3400 6700 50  0001 C CNN
	1    3400 6700
	0    1    1    0   
$EndComp
Text Notes 2925 5425 0    79   ~ 0
POWER
Connection ~ 4950 4500
Text GLabel 8125 6125 0    50   Input ~ 0
SCL
Text GLabel 8125 6225 0    50   Input ~ 0
SDA
$Comp
L Connector:Barrel_Jack_MountingPin J4
U 1 1 607F42DF
P 3700 6800
F 0 "J4" H 3470 6672 50  0000 R CNN
F 1 "Barrel_Jack_MountingPin" H 3470 6763 50  0000 R CNN
F 2 "Connector_BarrelJack:BarrelJack_Horizontal" H 3750 6760 50  0001 C CNN
F 3 "~" H 3750 6760 50  0001 C CNN
	1    3700 6800
	-1   0    0    1   
$EndComp
Wire Wire Line
	3400 6500 3400 6700
Wire Wire Line
	3400 6500 3700 6500
Connection ~ 3400 6700
$Comp
L mysensors_radios:RFM95HW U1
U 1 1 608564B2
P 9200 2300
F 0 "U1" H 9200 2914 40  0000 C CNN
F 1 "RFM95HW" H 9200 2838 40  0000 C CNN
F 2 "footprints:RFM95" H 9200 2300 30  0001 C CIN
F 3 "https://cdn-learn.adafruit.com/assets/assets/000/031/659/original/RFM95_96_97_98W.pdf?1460518717" H 10000 1150 60  0000 C CNN
	1    9200 2300
	1    0    0    -1  
$EndComp
Text GLabel 8650 2450 0    50   Input ~ 0
11_LORA_MOSI
Text GLabel 8650 2550 0    50   Input ~ 0
12_LORA_MISO
Text GLabel 8650 2650 0    50   Input ~ 0
13_LORA_SCK
$Comp
L power:GND #PWR0103
U 1 1 6086F1E9
P 9100 3150
F 0 "#PWR0103" H 9100 2900 50  0001 C CNN
F 1 "GND" H 9105 2977 50  0000 C CNN
F 2 "" H 9100 3150 50  0001 C CNN
F 3 "" H 9100 3150 50  0001 C CNN
	1    9100 3150
	1    0    0    -1  
$EndComp
Wire Wire Line
	9300 3150 9200 3150
Wire Wire Line
	9200 3150 9100 3150
Connection ~ 9200 3150
Connection ~ 9100 3150
Text GLabel 9750 2400 2    50   Input ~ 0
LORA_DIO1
Text GLabel 8650 2850 0    50   Input ~ 0
A5_LORA_RESET
$Comp
L device:Jumper_NO_Small JP1
U 1 1 608EF379
P 10450 1750
F 0 "JP1" H 10450 1935 50  0000 C CNN
F 1 "Jumper_NO_Small" H 10450 1844 50  0000 C CNN
F 2 "Jumper:SolderJumper-2_P1.3mm_Open_TrianglePad1.0x1.5mm" H 10450 1750 50  0001 C CNN
F 3 "" H 10450 1750 50  0001 C CNN
	1    10450 1750
	-1   0    0    1   
$EndComp
$Comp
L Connector:Conn_01x01_Female J5
U 1 1 609682ED
P 8350 1800
F 0 "J5" V 8288 1712 50  0000 R CNN
F 1 "Conn_01x01_Female" V 8197 1712 50  0000 R CNN
F 2 "Connector_PinSocket_2.54mm:PinSocket_1x01_P2.54mm_Vertical" H 8350 1800 50  0001 C CNN
F 3 "~" H 8350 1800 50  0001 C CNN
	1    8350 1800
	0    -1   -1   0   
$EndComp
Wire Wire Line
	8650 2150 8350 2150
Wire Wire Line
	8350 2150 8350 2000
Text GLabel 10550 1750 2    50   Input ~ 0
LORA_DIO1
$Comp
L power:+3V3 #PWR0104
U 1 1 60954B2C
P 9200 1950
F 0 "#PWR0104" H 9200 1800 50  0001 C CNN
F 1 "+3V3" V 9215 2078 50  0000 L CNN
F 2 "" H 9200 1950 50  0001 C CNN
F 3 "" H 9200 1950 50  0001 C CNN
	1    9200 1950
	1    0    0    -1  
$EndComp
Text GLabel 8650 2350 0    50   Input ~ 0
A4_LORA_CS
Text GLabel 9750 2300 2    50   Input ~ 0
A2_LORA_IRQ
$Comp
L Connector:Conn_01x14_Female J13
U 1 1 60B52275
P -4150 5450
F 0 "J13" H -4300 4600 50  0000 L CNN
F 1 "Conn_01x14_Female" H -4650 6150 50  0000 L CNN
F 2 "Connector_PinSocket_2.54mm:PinSocket_1x14_P2.54mm_Vertical" H -4150 5450 50  0001 C CNN
F 3 "~" H -4150 5450 50  0001 C CNN
	1    -4150 5450
	-1   0    0    1   
$EndComp
$Comp
L Connector:Conn_01x14_Female J12
U 1 1 60B539AE
P -2200 5300
F 0 "J12" H -2350 6050 50  0000 L CNN
F 1 "Conn_01x14_Female" H -2800 4500 50  0000 L CNN
F 2 "Connector_PinSocket_2.54mm:PinSocket_1x14_P2.54mm_Vertical" H -2200 5300 50  0001 C CNN
F 3 "~" H -2200 5300 50  0001 C CNN
	1    -2200 5300
	1    0    0    -1  
$EndComp
$Comp
L Connector:Conn_01x14_Female J14
U 1 1 60BBE697
P -4100 2500
F 0 "J14" H -4250 1650 50  0000 L CNN
F 1 "Conn_01x14_Female" H -4650 3200 50  0000 L CNN
F 2 "Connector_PinSocket_2.54mm:PinSocket_1x14_P2.54mm_Vertical" H -4100 2500 50  0001 C CNN
F 3 "~" H -4100 2500 50  0001 C CNN
	1    -4100 2500
	-1   0    0    1   
$EndComp
$Comp
L Connector:Micro_SD_Card J15
U 1 1 60C464D6
P 2800 4450
F 0 "J15" H 2750 5167 50  0000 C CNN
F 1 "Micro_SD_Card" H 2750 5076 50  0000 C CNN
F 2 "footprints:DM3D-SF_outline" H 3950 4750 50  0001 C CNN
F 3 "http://katalog.we-online.de/em/datasheet/693072010801.pdf" H 2800 4450 50  0001 C CNN
	1    2800 4450
	1    0    0    -1  
$EndComp
Text Notes 7700 5500 0    79   ~ 0
SSD1306
Text GLabel -2400 5000 0    50   Input ~ 0
10_ESP_CS
Text GLabel -3950 5950 2    50   Input ~ 0
MISO
Text GLabel -3950 5850 2    50   Input ~ 0
MOSI
Text GLabel -3950 5750 2    50   Input ~ 0
SCK
Wire Wire Line
	-3950 4850 -3550 4850
Wire Wire Line
	-3550 4850 -3550 4750
$Comp
L Adafruit_AirLift_FeatherWing-eagle-import:GND #GND0107
U 1 1 60AD7DBB
P -3000 4900
F 0 "#GND0107" H -3000 4900 50  0001 C CNN
F 1 "GND" H -3000 4779 59  0000 C CNN
F 2 "" H -3000 4900 50  0001 C CNN
F 3 "" H -3000 4900 50  0001 C CNN
	1    -3000 4900
	1    0    0    -1  
$EndComp
Wire Wire Line
	-2400 4800 -3000 4800
Text Notes -3650 4350 0    79   ~ 0
IB ESP32 ADD-ON
Text GLabel -3900 3000 2    50   Input ~ 0
MISO
Text GLabel -3900 2900 2    50   Input ~ 0
MOSI
Text GLabel -3900 2800 2    50   Input ~ 0
SCK
Text GLabel -3900 1800 2    50   Input ~ 0
~RESET
$Comp
L power:+3V3 #PWR0107
U 1 1 60B473C3
P -3450 1700
F 0 "#PWR0107" H -3450 1550 50  0001 C CNN
F 1 "+3V3" H -3435 1873 50  0000 C CNN
F 2 "" H -3450 1700 50  0001 C CNN
F 3 "" H -3450 1700 50  0001 C CNN
	1    -3450 1700
	1    0    0    -1  
$EndComp
Wire Wire Line
	-3900 1900 -3450 1900
Wire Wire Line
	-3450 1900 -3450 1700
$Comp
L device:C C5
U 1 1 60904288
P 2400 3250
F 0 "C5" H 2515 3296 50  0000 L CNN
F 1 "1u" H 2515 3205 50  0000 L CNN
F 2 "Capacitor_SMD:C_0603_1608Metric_Pad1.05x0.95mm_HandSolder" H 2438 3100 50  0001 C CNN
F 3 "" H 2400 3250 50  0001 C CNN
	1    2400 3250
	1    0    0    -1  
$EndComp
$Comp
L power:+3V3 #PWR0116
U 1 1 60904977
P 2400 3100
F 0 "#PWR0116" H 2400 2950 50  0001 C CNN
F 1 "+3V3" H 2415 3273 50  0000 C CNN
F 2 "" H 2400 3100 50  0001 C CNN
F 3 "" H 2400 3100 50  0001 C CNN
	1    2400 3100
	1    0    0    -1  
$EndComp
$Comp
L power:GND #PWR0117
U 1 1 609055EF
P 2400 3400
F 0 "#PWR0117" H 2400 3150 50  0001 C CNN
F 1 "GND" H 2405 3227 50  0000 C CNN
F 2 "" H 2400 3400 50  0001 C CNN
F 3 "" H 2400 3400 50  0001 C CNN
	1    2400 3400
	1    0    0    -1  
$EndComp
$Comp
L Mechanical:MountingHole H4
U 1 1 5F9D006D
P 6600 3325
F 0 "H4" H 6700 3371 50  0000 L CNN
F 1 "MountingHole" H 6700 3280 50  0000 L CNN
F 2 "MountingHole:MountingHole_3.5mm" H 6600 3325 50  0001 C CNN
F 3 "~" H 6600 3325 50  0001 C CNN
	1    6600 3325
	1    0    0    -1  
$EndComp
$Comp
L Mechanical:MountingHole H3
U 1 1 5F9CFBAC
P 6600 3100
F 0 "H3" H 6700 3146 50  0000 L CNN
F 1 "MountingHole" H 6700 3055 50  0000 L CNN
F 2 "MountingHole:MountingHole_3.5mm" H 6600 3100 50  0001 C CNN
F 3 "~" H 6600 3100 50  0001 C CNN
	1    6600 3100
	1    0    0    -1  
$EndComp
Text Notes 12350 1700 0    79   ~ 0
NEOPIXEL SOLDERING
$Comp
L Connector:Conn_01x04_Female J1
U 1 1 60A7A6C9
P 13300 2500
F 0 "J1" H 13328 2476 50  0000 L CNN
F 1 "Conn_01x04_Female" H 13328 2385 50  0000 L CNN
F 2 "footprints:PinSocket_1x04_P2.54mm_Vertical_no_silk" H 13300 2500 50  0001 C CNN
F 3 "~" H 13300 2500 50  0001 C CNN
	1    13300 2500
	1    0    0    -1  
$EndComp
$Comp
L Connector:TestPoint TP1
U 1 1 60A7F8AD
P 12750 2400
F 0 "TP1" V 12945 2472 50  0000 C CNN
F 1 "TestPoint" V 12854 2472 50  0000 C CNN
F 2 "footprints:TestPoint_Pad_1.0x1.0mm_no_silk" H 12950 2400 50  0001 C CNN
F 3 "~" H 12950 2400 50  0001 C CNN
	1    12750 2400
	0    -1   -1   0   
$EndComp
$Comp
L Connector:TestPoint TP2
U 1 1 60A80254
P 12750 2500
F 0 "TP2" V 12945 2572 50  0000 C CNN
F 1 "TestPoint" V 12854 2572 50  0000 C CNN
F 2 "footprints:TestPoint_Pad_1.0x1.0mm_no_silk" H 12950 2500 50  0001 C CNN
F 3 "~" H 12950 2500 50  0001 C CNN
	1    12750 2500
	0    -1   -1   0   
$EndComp
$Comp
L Connector:TestPoint TP3
U 1 1 60A80559
P 12750 2600
F 0 "TP3" V 12945 2672 50  0000 C CNN
F 1 "TestPoint" V 12854 2672 50  0000 C CNN
F 2 "footprints:TestPoint_Pad_1.0x1.0mm_no_silk" H 12950 2600 50  0001 C CNN
F 3 "~" H 12950 2600 50  0001 C CNN
	1    12750 2600
	0    -1   -1   0   
$EndComp
$Comp
L Connector:TestPoint TP4
U 1 1 60A8079B
P 12750 2700
F 0 "TP4" V 12945 2772 50  0000 C CNN
F 1 "TestPoint" V 12854 2772 50  0000 C CNN
F 2 "footprints:TestPoint_Pad_1.0x1.0mm_no_silk" H 12950 2700 50  0001 C CNN
F 3 "~" H 12950 2700 50  0001 C CNN
	1    12750 2700
	0    -1   -1   0   
$EndComp
Wire Wire Line
	13100 2400 12750 2400
Wire Wire Line
	13100 2600 12850 2600
Wire Wire Line
	13100 2700 12750 2700
Text Notes -4550 4900 0    79   ~ 0
IBM4
$Comp
L power:GND #PWR0118
U 1 1 60983EFA
P 4300 3300
F 0 "#PWR0118" H 4300 3050 50  0001 C CNN
F 1 "GND" H 4305 3127 50  0000 C CNN
F 2 "" H 4300 3300 50  0001 C CNN
F 3 "" H 4300 3300 50  0001 C CNN
	1    4300 3300
	1    0    0    -1  
$EndComp
Text GLabel 3900 3100 0    50   Input ~ 0
~RESET
Text Notes 3900 2700 0    79   ~ 0
RESET
Text GLabel -2550 2900 0    50   Input ~ 0
SDA
Text GLabel -2550 2800 0    50   Input ~ 0
SCL
$Comp
L Adafruit_AirLift_FeatherWing-eagle-import:GND #GND0108
U 1 1 60B3BEBE
P -3250 2000
F 0 "#GND0108" H -3250 2000 50  0001 C CNN
F 1 "GND" H -3250 1879 59  0000 C CNN
F 2 "" H -3250 2000 50  0001 C CNN
F 3 "" H -3250 2000 50  0001 C CNN
	1    -3250 2000
	1    0    0    -1  
$EndComp
Text GLabel -2550 2000 0    50   Input ~ 0
VBUS
$Comp
L Connector:Conn_01x14_Female J3
U 1 1 60BBD632
P -2350 2400
F 0 "J3" H -2500 3100 50  0000 L CNN
F 1 "Conn_01x14_Female" H -2800 1600 50  0000 L CNN
F 2 "Connector_PinSocket_2.54mm:PinSocket_1x14_P2.54mm_Vertical" H -2350 2400 50  0001 C CNN
F 3 "~" H -2350 2400 50  0001 C CNN
	1    -2350 2400
	1    0    0    -1  
$EndComp
Text GLabel -3900 2300 2    50   Input ~ 0
A1_SD_CS
Text GLabel -2550 2400 0    50   Input ~ 0
10_ESP_CS
Text GLabel -2550 2500 0    50   Input ~ 0
9_ESP_BUSY
Text GLabel -2550 2600 0    50   Input ~ 0
7_ESP_RESET
$Comp
L power:GND #PWR0119
U 1 1 6097278D
P 13250 2850
F 0 "#PWR0119" H 13250 2600 50  0001 C CNN
F 1 "GND" H 13255 2677 50  0000 C CNN
F 2 "" H 13250 2850 50  0001 C CNN
F 3 "" H 13250 2850 50  0001 C CNN
	1    13250 2850
	1    0    0    -1  
$EndComp
Connection ~ 13100 2400
$Comp
L device:R R5
U 1 1 609788EA
P 12250 1850
F 0 "R5" V 12043 1850 50  0000 C CNN
F 1 "500" V 12134 1850 50  0000 C CNN
F 2 "Resistor_THT:R_Axial_DIN0309_L9.0mm_D3.2mm_P12.70mm_Horizontal" V 12180 1850 50  0001 C CNN
F 3 "" H 12250 1850 50  0001 C CNN
	1    12250 1850
	0    1    1    0   
$EndComp
Text GLabel -2550 2700 0    50   Input ~ 0
5_NEOPIXEL
Wire Wire Line
	12750 2500 13000 2500
Wire Wire Line
	13000 2500 13000 2050
Connection ~ 13000 2500
Wire Wire Line
	13000 2500 13100 2500
Wire Wire Line
	12850 2600 12850 1850
Connection ~ 12850 2600
Wire Wire Line
	12850 2600 12750 2600
Wire Wire Line
	13100 2250 13450 2250
Wire Wire Line
	13450 2250 13450 2850
Wire Wire Line
	13450 2850 13250 2850
Wire Wire Line
	13100 2850 13100 2700
Wire Wire Line
	13100 2250 13100 2400
Connection ~ 13100 2700
Connection ~ 13250 2850
Wire Wire Line
	13250 2850 13100 2850
Wire Wire Line
	12100 1700 11950 1700
Wire Wire Line
	12100 1700 12100 1850
Text GLabel -2400 5200 0    50   Input ~ 0
9_ESP_BUSY
Text GLabel -2400 5100 0    50   Input ~ 0
7_ESP_RESET
Text GLabel -3900 2200 2    50   Input ~ 0
A0_LORAWAN
Text GLabel 1900 4250 0    50   Input ~ 0
A1_SD_CS
Text GLabel 1900 4350 0    50   Input ~ 0
MOSI
Text GLabel 1900 4550 0    50   Input ~ 0
SCK
Text GLabel 1900 4750 0    50   Input ~ 0
MISO
$Comp
L power:GND #PWR0121
U 1 1 60AF12FC
P 1500 4650
F 0 "#PWR0121" H 1500 4400 50  0001 C CNN
F 1 "GND" H 1505 4477 50  0000 C CNN
F 2 "" H 1500 4650 50  0001 C CNN
F 3 "" H 1500 4650 50  0001 C CNN
	1    1500 4650
	1    0    0    -1  
$EndComp
Wire Wire Line
	1900 4650 1500 4650
Wire Wire Line
	1900 4450 1350 4450
Wire Wire Line
	1350 4450 1350 4150
$Comp
L power:+3V3 #PWR0122
U 1 1 60AFC4A9
P 1350 4150
F 0 "#PWR0122" H 1350 4000 50  0001 C CNN
F 1 "+3V3" H 1350 4300 50  0000 C CNN
F 2 "" H 1350 4150 50  0001 C CNN
F 3 "" H 1350 4150 50  0001 C CNN
	1    1350 4150
	1    0    0    -1  
$EndComp
Text GLabel -3900 2600 2    50   Input ~ 0
A4_LORA_CS
Text GLabel -3900 2400 2    50   Input ~ 0
A2_LORA_IRQ
Text GLabel -2550 2300 0    50   Input ~ 0
11_LORA_MOSI
Text GLabel -2550 2200 0    50   Input ~ 0
12_LORA_MISO
Text GLabel -2550 2100 0    50   Input ~ 0
13_LORA_SCK
Wire Wire Line
	-3250 1900 -2550 1900
Text GLabel -3900 2500 2    50   Input ~ 0
A3_BUTTON_A
Text GLabel -3900 2000 2    50   Input ~ 0
AREF
Text GLabel -3900 2100 2    50   Input ~ 0
VHI
Text GLabel 4450 4500 3    50   Input ~ 0
A3_BUTTON_A
$Comp
L Mechanical:MountingHole H8
U 1 1 60D011E3
P 6700 1575
F 0 "H8" H 6800 1621 50  0000 L CNN
F 1 "MountingHole" H 6800 1530 50  0000 L CNN
F 2 "MountingHole:MountingHole_2.2mm_M2" H 6700 1575 50  0001 C CNN
F 3 "~" H 6700 1575 50  0001 C CNN
	1    6700 1575
	1    0    0    -1  
$EndComp
$Comp
L Mechanical:MountingHole H7
U 1 1 60D011E9
P 6700 1350
F 0 "H7" H 6800 1396 50  0000 L CNN
F 1 "MountingHole" H 6800 1305 50  0000 L CNN
F 2 "MountingHole:MountingHole_2.2mm_M2" H 6700 1350 50  0001 C CNN
F 3 "~" H 6700 1350 50  0001 C CNN
	1    6700 1350
	1    0    0    -1  
$EndComp
$Comp
L Mechanical:MountingHole H10
U 1 1 60D011EF
P 6700 2025
F 0 "H10" H 6800 2071 50  0000 L CNN
F 1 "MountingHole" H 6800 1980 50  0000 L CNN
F 2 "MountingHole:MountingHole_2.2mm_M2" H 6700 2025 50  0001 C CNN
F 3 "~" H 6700 2025 50  0001 C CNN
	1    6700 2025
	1    0    0    -1  
$EndComp
$Comp
L Mechanical:MountingHole H9
U 1 1 60D011F5
P 6700 1800
F 0 "H9" H 6800 1846 50  0000 L CNN
F 1 "MountingHole" H 6800 1755 50  0000 L CNN
F 2 "MountingHole:MountingHole_2.2mm_M2" H 6700 1800 50  0001 C CNN
F 3 "~" H 6700 1800 50  0001 C CNN
	1    6700 1800
	1    0    0    -1  
$EndComp
$Comp
L Adafruit_AirLift_FeatherWing-eagle-import:GND #GND0109
U 1 1 60D7FC5C
P 3600 7650
F 0 "#GND0109" H 3600 7650 50  0001 C CNN
F 1 "GND" H 3600 7529 59  0000 C CNN
F 2 "" H 3600 7650 50  0001 C CNN
F 3 "" H 3600 7650 50  0001 C CNN
	1    3600 7650
	1    0    0    -1  
$EndComp
$Comp
L Connector:Screw_Terminal_01x02 J7
U 1 1 60D7B882
P 3800 7550
F 0 "J7" H 3718 7225 50  0000 C CNN
F 1 "Screw_Terminal_01x02" H 3718 7316 50  0000 C CNN
F 2 "TerminalBlock_Phoenix:TerminalBlock_Phoenix_PT-1,5-2-5.0-H_1x02_P5.00mm_Horizontal" H 3800 7550 50  0001 C CNN
F 3 "~" H 3800 7550 50  0001 C CNN
	1    3800 7550
	1    0    0    1   
$EndComp
Text GLabel 10350 1750 0    50   Input ~ 0
A0_LORAWAN
$Comp
L Switch:SW_Push_Dual SW3
U 1 1 60EFEB86
P 4100 3100
F 0 "SW3" H 4100 3385 50  0000 C CNN
F 1 "SW_Push_Dual" H 4100 3294 50  0000 C CNN
F 2 "Button_Switch_THT:SW_TH_Tactile_Omron_B3F-10xx" H 4100 3300 50  0001 C CNN
F 3 "~" H 4100 3300 50  0001 C CNN
	1    4100 3100
	1    0    0    -1  
$EndComp
Wire Wire Line
	4300 3100 4300 3000
Wire Wire Line
	4300 3000 3900 3000
Wire Wire Line
	3900 3000 3900 3100
Wire Wire Line
	3900 3300 3900 3200
Wire Wire Line
	3900 3200 4300 3200
Wire Wire Line
	4300 3200 4300 3300
Connection ~ 4300 3300
$Comp
L Mechanical:MountingHole H5
U 1 1 609D9C6D
P 13050 900
F 0 "H5" H 13150 946 50  0000 L CNN
F 1 "MountingHole" H 13150 855 50  0000 L CNN
F 2 "MountingHole:MountingHole_3.5mm" H 13050 900 50  0001 C CNN
F 3 "~" H 13050 900 50  0001 C CNN
	1    13050 900 
	1    0    0    -1  
$EndComp
$Comp
L Mechanical:MountingHole H6
U 1 1 609DA433
P 13050 1200
F 0 "H6" H 13150 1246 50  0000 L CNN
F 1 "MountingHole" H 13150 1155 50  0000 L CNN
F 2 "MountingHole:MountingHole_3.5mm" H 13050 1200 50  0001 C CNN
F 3 "~" H 13050 1200 50  0001 C CNN
	1    13050 1200
	1    0    0    -1  
$EndComp
Text Notes 12850 650  0    79   ~ 0
Neopixel Holes
Text Notes 2500 700  0    79   ~ 0
Breakouts
$Comp
L power:+3V3 #PWR014
U 1 1 601BD700
P 2050 1700
F 0 "#PWR014" H 2050 1550 50  0001 C CNN
F 1 "+3V3" H 2065 1873 50  0000 C CNN
F 2 "" H 2050 1700 50  0001 C CNN
F 3 "" H 2050 1700 50  0001 C CNN
	1    2050 1700
	1    0    0    -1  
$EndComp
$Comp
L power:GND #PWR015
U 1 1 601BEB98
P 2500 1800
F 0 "#PWR015" H 2500 1550 50  0001 C CNN
F 1 "GND" H 2505 1627 50  0000 C CNN
F 2 "" H 2500 1800 50  0001 C CNN
F 3 "" H 2500 1800 50  0001 C CNN
	1    2500 1800
	1    0    0    -1  
$EndComp
Wire Wire Line
	2800 1800 2500 1800
Text GLabel 2800 1600 0    50   Input ~ 0
VHI
Wire Wire Line
	2050 1700 2800 1700
Text GLabel 2800 1200 0    50   Input ~ 0
SDA
Text GLabel 2800 1300 0    50   Input ~ 0
SCL
Text GLabel 2800 1400 0    50   Input ~ 0
TX
$Comp
L Connector:Conn_01x07_Female J2
U 1 1 60E65CC9
P 3000 1500
F 0 "J2" H 3028 1526 50  0000 L CNN
F 1 "Conn_01x07_Female" H 3028 1435 50  0000 L CNN
F 2 "Connector_PinHeader_2.54mm:PinHeader_1x07_P2.54mm_Vertical" H 3000 1500 50  0001 C CNN
F 3 "~" H 3000 1500 50  0001 C CNN
	1    3000 1500
	1    0    0    -1  
$EndComp
Text GLabel 2800 1500 0    50   Input ~ 0
RX
$Comp
L power:GND #PWR0111
U 1 1 60F802F8
P 6625 4550
F 0 "#PWR0111" H 6625 4300 50  0001 C CNN
F 1 "GND" H 6630 4377 50  0000 C CNN
F 2 "" H 6625 4550 50  0001 C CNN
F 3 "" H 6625 4550 50  0001 C CNN
	1    6625 4550
	1    0    0    -1  
$EndComp
$Comp
L power:+3V3 #PWR0112
U 1 1 60F802FE
P 6850 4650
F 0 "#PWR0112" H 6850 4500 50  0001 C CNN
F 1 "+3V3" H 6865 4823 50  0000 C CNN
F 2 "" H 6850 4650 50  0001 C CNN
F 3 "" H 6850 4650 50  0001 C CNN
	1    6850 4650
	1    0    0    -1  
$EndComp
Text GLabel 7025 4750 0    50   Input ~ 0
SDA
Text GLabel 7025 4850 0    50   Input ~ 0
SCL
Wire Wire Line
	7025 4550 6625 4550
Wire Wire Line
	7025 4650 6850 4650
$Comp
L Connector:Conn_01x04_Female J6
U 1 1 60F80308
P 7225 4650
F 0 "J6" H 7253 4626 50  0000 L CNN
F 1 "Conn_01x04_Female" V 7400 4200 50  0000 L CNN
F 2 "Connector_JST:JST_SH_SM04B-SRSS-TB_1x04-1MP_P1.00mm_Horizontal" H 7225 4650 50  0001 C CNN
F 3 "~" H 7225 4650 50  0001 C CNN
	1    7225 4650
	1    0    0    -1  
$EndComp
Text Notes 6400 4300 0    79   ~ 0
QWIIC
Text GLabel -3900 2700 2    50   Input ~ 0
A5_LORA_RESET
$Comp
L power:+3V3 #PWR0105
U 1 1 60ED2EE8
P -3550 4750
F 0 "#PWR0105" H -3550 4600 50  0001 C CNN
F 1 "+3V3" H -3535 4923 50  0000 C CNN
F 2 "" H -3550 4750 50  0001 C CNN
F 3 "" H -3550 4750 50  0001 C CNN
	1    -3550 4750
	1    0    0    -1  
$EndComp
$Comp
L Switch:SW_Push_Dual SW2
U 1 1 60FBA6AD
P 5450 5950
F 0 "SW2" H 5450 6235 50  0000 C CNN
F 1 "SW_Push_Dual" H 5450 6144 50  0000 C CNN
F 2 "Button_Switch_THT:SW_TH_Tactile_Omron_B3F-10xx" H 5450 6150 50  0001 C CNN
F 3 "~" H 5450 6150 50  0001 C CNN
	1    5450 5950
	1    0    0    -1  
$EndComp
Wire Wire Line
	5650 5950 5650 5750
Wire Wire Line
	5650 5750 5250 5750
Wire Wire Line
	5250 5750 5250 5950
Wire Wire Line
	5650 6150 5650 6000
Wire Wire Line
	5650 6000 5250 6000
Wire Wire Line
	5250 6000 5250 6150
$Comp
L power:GND #PWR0106
U 1 1 60FBA6B9
P 5650 6150
F 0 "#PWR0106" H 5650 5900 50  0001 C CNN
F 1 "GND" H 5655 5977 50  0000 C CNN
F 2 "" H 5650 6150 50  0001 C CNN
F 3 "" H 5650 6150 50  0001 C CNN
	1    5650 6150
	1    0    0    -1  
$EndComp
Connection ~ 5650 6150
$Comp
L Device:R R1
U 1 1 60FBA6C0
P 5000 5800
F 0 "R1" H 5070 5846 50  0000 L CNN
F 1 "4.7K" H 5070 5755 50  0000 L CNN
F 2 "Resistor_THT:R_Axial_DIN0309_L9.0mm_D3.2mm_P12.70mm_Horizontal" V 4930 5800 50  0001 C CNN
F 3 "~" H 5000 5800 50  0001 C CNN
	1    5000 5800
	1    0    0    -1  
$EndComp
$Comp
L power:+3V3 #PWR0108
U 1 1 60FBA6C6
P 5000 5650
F 0 "#PWR0108" H 5000 5500 50  0001 C CNN
F 1 "+3V3" H 5015 5823 50  0000 C CNN
F 2 "" H 5000 5650 50  0001 C CNN
F 3 "" H 5000 5650 50  0001 C CNN
	1    5000 5650
	1    0    0    -1  
$EndComp
Wire Wire Line
	5250 5950 5000 5950
Connection ~ 5250 5950
Text Notes 5100 5400 0    79   ~ 0
BUTTON B
Connection ~ 5000 5950
Text Notes 6450 5750 0    79   ~ 0
QWIIC
Text GLabel -2550 3000 0    50   Input ~ 0
TX
Text GLabel -2550 3100 0    50   Input ~ 0
RX
Wire Wire Line
	4450 4500 4950 4500
Wire Wire Line
	12400 1850 12850 1850
Wire Wire Line
	4500 5950 5000 5950
$Comp
L Connector:Conn_01x03_Female J9
U 1 1 61020F33
P 2200 6750
F 0 "J9" H 2228 6776 50  0000 L CNN
F 1 "Conn_01x03_Female" H 2228 6685 50  0000 L CNN
F 2 "Connector_PinSocket_2.54mm:PinSocket_1x03_P2.54mm_Vertical" H 2200 6750 50  0001 C CNN
F 3 "~" H 2200 6750 50  0001 C CNN
	1    2200 6750
	1    0    0    -1  
$EndComp
Text Notes 1900 6450 0    79   ~ 0
DC-DC
$Comp
L device:C C1
U 1 1 610277F2
P 1800 7300
F 0 "C1" H 1685 7254 50  0000 R CNN
F 1 "10uF" H 1685 7345 50  0000 R CNN
F 2 "Capacitor_THT:CP_Radial_D5.0mm_P2.50mm" H 1838 7150 50  0001 C CNN
F 3 "" H 1800 7300 50  0001 C CNN
	1    1800 7300
	-1   0    0    1   
$EndComp
$Comp
L device:C C2
U 1 1 61051461
P 2300 7300
F 0 "C2" H 2185 7254 50  0000 R CNN
F 1 "22uF" H 2185 7345 50  0000 R CNN
F 2 "Capacitor_THT:CP_Radial_D5.0mm_P2.50mm" H 2338 7150 50  0001 C CNN
F 3 "" H 2300 7300 50  0001 C CNN
	1    2300 7300
	-1   0    0    1   
$EndComp
Text GLabel 2000 6850 0    50   UnSpc ~ 0
VOUT_DCDC
$Comp
L power:GND #PWR0101
U 1 1 6106310F
P 1450 6750
F 0 "#PWR0101" H 1450 6500 50  0001 C CNN
F 1 "GND" H 1455 6577 50  0000 C CNN
F 2 "" H 1450 6750 50  0001 C CNN
F 3 "" H 1450 6750 50  0001 C CNN
	1    1450 6750
	1    0    0    -1  
$EndComp
Wire Wire Line
	2000 6750 1450 6750
$Comp
L device:Jumper_NO_Small JP2
U 1 1 610FFD73
P 2950 6300
F 0 "JP2" H 2950 6485 50  0000 C CNN
F 1 "Jumper_NO_Small" H 2950 6394 50  0000 C CNN
F 2 "Jumper:SolderJumper-2_P1.3mm_Open_TrianglePad1.0x1.5mm" H 2950 6300 50  0001 C CNN
F 3 "" H 2950 6300 50  0001 C CNN
	1    2950 6300
	-1   0    0    1   
$EndComp
Text GLabel -2550 1800 0    50   UnSpc ~ 0
VBAT
$Comp
L power:GND #PWR0102
U 1 1 61125937
P 1800 7450
F 0 "#PWR0102" H 1800 7200 50  0001 C CNN
F 1 "GND" H 1805 7277 50  0000 C CNN
F 2 "" H 1800 7450 50  0001 C CNN
F 3 "" H 1800 7450 50  0001 C CNN
	1    1800 7450
	1    0    0    -1  
$EndComp
$Comp
L power:GND #PWR0109
U 1 1 611261CE
P 2300 7450
F 0 "#PWR0109" H 2300 7200 50  0001 C CNN
F 1 "GND" H 2305 7277 50  0000 C CNN
F 2 "" H 2300 7450 50  0001 C CNN
F 3 "" H 2300 7450 50  0001 C CNN
	1    2300 7450
	1    0    0    -1  
$EndComp
Text GLabel 3200 6050 2    50   Input ~ 0
VHI
Text GLabel 1800 7150 0    50   Input ~ 0
VIN_DCDC
Text GLabel 2300 7150 2    50   UnSpc ~ 0
VOUT_DCDC
Text GLabel 2850 6300 0    50   Input ~ 0
VIN_DCDC
Text GLabel 3050 6300 2    50   UnSpc ~ 0
VOUT_DCDC
$Comp
L Device:D D1
U 1 1 60F73E0C
P 3050 6050
F 0 "D1" H 3050 5833 50  0000 C CNN
F 1 "D" H 3050 5924 50  0000 C CNN
F 2 "Diode_THT:D_5W_P12.70mm_Horizontal" H 3050 6050 50  0001 C CNN
F 3 "~" H 3050 6050 50  0001 C CNN
	1    3050 6050
	-1   0    0    1   
$EndComp
Text GLabel 2000 6650 0    50   Input ~ 0
VIN_DCDC
Text GLabel 3400 6900 0    50   Input ~ 0
VIN_DCDC
Text GLabel 2900 6050 0    50   UnSpc ~ 0
VOUT_DCDC
Text Notes 2550 5700 0    47   ~ 0
diode voltage drop means we should\nadd voltage to min input voltage on DC DC\neither 3.3 or 5V DC DC should work
$Comp
L power:+3V3 #PWR0110
U 1 1 60FD98F6
P 11950 2050
F 0 "#PWR0110" H 11950 1900 50  0001 C CNN
F 1 "+3V3" V 11965 2178 50  0000 L CNN
F 2 "" H 11950 2050 50  0001 C CNN
F 3 "" H 11950 2050 50  0001 C CNN
	1    11950 2050
	1    0    0    -1  
$EndComp
Wire Wire Line
	11950 2050 13000 2050
$Comp
L Connector:Conn_01x05_Female J11
U 1 1 60F84692
P -3250 1300
F 0 "J11" V -3404 1012 50  0000 R CNN
F 1 "Conn_01x05_Female" V -3313 1012 50  0000 R CNN
F 2 "Connector_PinSocket_2.54mm:PinSocket_1x05_P2.54mm_Vertical" H -3250 1300 50  0001 C CNN
F 3 "~" H -3250 1300 50  0001 C CNN
	1    -3250 1300
	0    -1   1    0   
$EndComp
Text GLabel -3150 1100 1    50   Input ~ 0
3_BUTTON_B
Text GLabel 4500 5950 3    50   Input ~ 0
3_BUTTON_B
Text GLabel -3050 1100 1    50   Input ~ 0
4
$Comp
L Mechanical:MountingHole H16
U 1 1 60FD8DA4
P 7475 1575
F 0 "H16" H 7575 1621 50  0000 L CNN
F 1 "MountingHole" H 7575 1530 50  0000 L CNN
F 2 "MountingHole:MountingHole_2.2mm_M2" H 7475 1575 50  0001 C CNN
F 3 "~" H 7475 1575 50  0001 C CNN
	1    7475 1575
	1    0    0    -1  
$EndComp
$Comp
L Mechanical:MountingHole H15
U 1 1 60FD8DAA
P 7475 1350
F 0 "H15" H 7575 1396 50  0000 L CNN
F 1 "MountingHole" H 7575 1305 50  0000 L CNN
F 2 "MountingHole:MountingHole_2.2mm_M2" H 7475 1350 50  0001 C CNN
F 3 "~" H 7475 1350 50  0001 C CNN
	1    7475 1350
	1    0    0    -1  
$EndComp
$Comp
L Mechanical:MountingHole H18
U 1 1 60FD8DB0
P 7475 2025
F 0 "H18" H 7575 2071 50  0000 L CNN
F 1 "MountingHole" H 7575 1980 50  0000 L CNN
F 2 "MountingHole:MountingHole_2.2mm_M2" H 7475 2025 50  0001 C CNN
F 3 "~" H 7475 2025 50  0001 C CNN
	1    7475 2025
	1    0    0    -1  
$EndComp
$Comp
L Mechanical:MountingHole H17
U 1 1 60FD8DB6
P 7475 1800
F 0 "H17" H 7575 1846 50  0000 L CNN
F 1 "MountingHole" H 7575 1755 50  0000 L CNN
F 2 "MountingHole:MountingHole_2.2mm_M2" H 7475 1800 50  0001 C CNN
F 3 "~" H 7475 1800 50  0001 C CNN
	1    7475 1800
	1    0    0    -1  
$EndComp
$Comp
L Mechanical:MountingHole H12
U 1 1 60FDB140
P 6700 600
F 0 "H12" H 6800 646 50  0000 L CNN
F 1 "MountingHole" H 6800 555 50  0000 L CNN
F 2 "MountingHole:MountingHole_2.2mm_M2" H 6700 600 50  0001 C CNN
F 3 "~" H 6700 600 50  0001 C CNN
	1    6700 600 
	1    0    0    -1  
$EndComp
$Comp
L Mechanical:MountingHole H11
U 1 1 60FDB146
P 6700 375
F 0 "H11" H 6800 421 50  0000 L CNN
F 1 "MountingHole" H 6800 330 50  0000 L CNN
F 2 "MountingHole:MountingHole_2.2mm_M2" H 6700 375 50  0001 C CNN
F 3 "~" H 6700 375 50  0001 C CNN
	1    6700 375 
	1    0    0    -1  
$EndComp
$Comp
L Mechanical:MountingHole H14
U 1 1 60FDB14C
P 6700 1050
F 0 "H14" H 6800 1096 50  0000 L CNN
F 1 "MountingHole" H 6800 1005 50  0000 L CNN
F 2 "MountingHole:MountingHole_2.2mm_M2" H 6700 1050 50  0001 C CNN
F 3 "~" H 6700 1050 50  0001 C CNN
	1    6700 1050
	1    0    0    -1  
$EndComp
$Comp
L Mechanical:MountingHole H13
U 1 1 60FDB152
P 6700 825
F 0 "H13" H 6800 871 50  0000 L CNN
F 1 "MountingHole" H 6800 780 50  0000 L CNN
F 2 "MountingHole:MountingHole_2.2mm_M2" H 6700 825 50  0001 C CNN
F 3 "~" H 6700 825 50  0001 C CNN
	1    6700 825 
	1    0    0    -1  
$EndComp
$Comp
L Mechanical:MountingHole H20
U 1 1 60FDC8E8
P 7600 625
F 0 "H20" H 7700 671 50  0000 L CNN
F 1 "MountingHole" H 7700 580 50  0000 L CNN
F 2 "MountingHole:MountingHole_2.2mm_M2" H 7600 625 50  0001 C CNN
F 3 "~" H 7600 625 50  0001 C CNN
	1    7600 625 
	1    0    0    -1  
$EndComp
$Comp
L Mechanical:MountingHole H19
U 1 1 60FDC8EE
P 7600 400
F 0 "H19" H 7700 446 50  0000 L CNN
F 1 "MountingHole" H 7700 355 50  0000 L CNN
F 2 "MountingHole:MountingHole_2.2mm_M2" H 7600 400 50  0001 C CNN
F 3 "~" H 7600 400 50  0001 C CNN
	1    7600 400 
	1    0    0    -1  
$EndComp
$Comp
L Mechanical:MountingHole H22
U 1 1 60FDC8F4
P 7600 1075
F 0 "H22" H 7700 1121 50  0000 L CNN
F 1 "MountingHole" H 7700 1030 50  0000 L CNN
F 2 "MountingHole:MountingHole_2.2mm_M2" H 7600 1075 50  0001 C CNN
F 3 "~" H 7600 1075 50  0001 C CNN
	1    7600 1075
	1    0    0    -1  
$EndComp
$Comp
L Mechanical:MountingHole H21
U 1 1 60FDC8FA
P 7600 850
F 0 "H21" H 7700 896 50  0000 L CNN
F 1 "MountingHole" H 7700 805 50  0000 L CNN
F 2 "MountingHole:MountingHole_2.2mm_M2" H 7600 850 50  0001 C CNN
F 3 "~" H 7600 850 50  0001 C CNN
	1    7600 850 
	1    0    0    -1  
$EndComp
$Comp
L Mechanical:MountingHole H24
U 1 1 60FED33C
P 8525 600
F 0 "H24" H 8625 646 50  0000 L CNN
F 1 "MountingHole" H 8625 555 50  0000 L CNN
F 2 "MountingHole:MountingHole_2.2mm_M2" H 8525 600 50  0001 C CNN
F 3 "~" H 8525 600 50  0001 C CNN
	1    8525 600 
	1    0    0    -1  
$EndComp
$Comp
L Mechanical:MountingHole H23
U 1 1 60FED342
P 8525 375
F 0 "H23" H 8625 421 50  0000 L CNN
F 1 "MountingHole" H 8625 330 50  0000 L CNN
F 2 "MountingHole:MountingHole_2.2mm_M2" H 8525 375 50  0001 C CNN
F 3 "~" H 8525 375 50  0001 C CNN
	1    8525 375 
	1    0    0    -1  
$EndComp
$Comp
L Mechanical:MountingHole H26
U 1 1 60FED348
P 8525 1050
F 0 "H26" H 8625 1096 50  0000 L CNN
F 1 "MountingHole" H 8625 1005 50  0000 L CNN
F 2 "MountingHole:MountingHole_2.2mm_M2" H 8525 1050 50  0001 C CNN
F 3 "~" H 8525 1050 50  0001 C CNN
	1    8525 1050
	1    0    0    -1  
$EndComp
$Comp
L Mechanical:MountingHole H25
U 1 1 60FED34E
P 8525 825
F 0 "H25" H 8625 871 50  0000 L CNN
F 1 "MountingHole" H 8625 780 50  0000 L CNN
F 2 "MountingHole:MountingHole_2.2mm_M2" H 8525 825 50  0001 C CNN
F 3 "~" H 8525 825 50  0001 C CNN
	1    8525 825 
	1    0    0    -1  
$EndComp
$Comp
L Mechanical:MountingHole H28
U 1 1 61006FD9
P 9425 675
F 0 "H28" H 9525 721 50  0000 L CNN
F 1 "MountingHole" H 9525 630 50  0000 L CNN
F 2 "MountingHole:MountingHole_2.2mm_M2" H 9425 675 50  0001 C CNN
F 3 "~" H 9425 675 50  0001 C CNN
	1    9425 675 
	1    0    0    -1  
$EndComp
$Comp
L Mechanical:MountingHole H27
U 1 1 61006FDF
P 9425 450
F 0 "H27" H 9525 496 50  0000 L CNN
F 1 "MountingHole" H 9525 405 50  0000 L CNN
F 2 "MountingHole:MountingHole_2.2mm_M2" H 9425 450 50  0001 C CNN
F 3 "~" H 9425 450 50  0001 C CNN
	1    9425 450 
	1    0    0    -1  
$EndComp
$Comp
L Mechanical:MountingHole H30
U 1 1 61006FE5
P 9425 1125
F 0 "H30" H 9525 1171 50  0000 L CNN
F 1 "MountingHole" H 9525 1080 50  0000 L CNN
F 2 "MountingHole:MountingHole_2.2mm_M2" H 9425 1125 50  0001 C CNN
F 3 "~" H 9425 1125 50  0001 C CNN
	1    9425 1125
	1    0    0    -1  
$EndComp
$Comp
L Mechanical:MountingHole H29
U 1 1 61006FEB
P 9425 900
F 0 "H29" H 9525 946 50  0000 L CNN
F 1 "MountingHole" H 9525 855 50  0000 L CNN
F 2 "MountingHole:MountingHole_2.2mm_M2" H 9425 900 50  0001 C CNN
F 3 "~" H 9425 900 50  0001 C CNN
	1    9425 900 
	1    0    0    -1  
$EndComp
Text GLabel 3600 7450 0    50   UnSpc ~ 0
VBAT
$Comp
L Mechanical:MountingHole H32
U 1 1 6104BAAC
P 10325 950
F 0 "H32" H 10425 996 50  0000 L CNN
F 1 "MountingHole" H 10425 905 50  0000 L CNN
F 2 "MountingHole:MountingHole_2.2mm_M2" H 10325 950 50  0001 C CNN
F 3 "~" H 10325 950 50  0001 C CNN
	1    10325 950 
	1    0    0    -1  
$EndComp
$Comp
L Mechanical:MountingHole H31
U 1 1 6104BAB2
P 10325 725
F 0 "H31" H 10425 771 50  0000 L CNN
F 1 "MountingHole" H 10425 680 50  0000 L CNN
F 2 "MountingHole:MountingHole_2.2mm_M2" H 10325 725 50  0001 C CNN
F 3 "~" H 10325 725 50  0001 C CNN
	1    10325 725 
	1    0    0    -1  
$EndComp
$Comp
L Mechanical:MountingHole H34
U 1 1 61050862
P 10325 500
F 0 "H34" H 10425 546 50  0000 L CNN
F 1 "MountingHole" H 10425 455 50  0000 L CNN
F 2 "MountingHole:MountingHole_2.2mm_M2" H 10325 500 50  0001 C CNN
F 3 "~" H 10325 500 50  0001 C CNN
	1    10325 500 
	1    0    0    -1  
$EndComp
$Comp
L Mechanical:MountingHole H33
U 1 1 61050868
P 10325 275
F 0 "H33" H 10425 321 50  0000 L CNN
F 1 "MountingHole" H 10425 230 50  0000 L CNN
F 2 "MountingHole:MountingHole_2.2mm_M2" H 10325 275 50  0001 C CNN
F 3 "~" H 10325 275 50  0001 C CNN
	1    10325 275 
	1    0    0    -1  
$EndComp
Text GLabel 11950 1700 0    50   Input ~ 0
2_NEOPIXEL
Text GLabel -3900 3100 2    50   Input ~ 0
2_NEOPIXEL
$EndSCHEMATC
