%TF.GenerationSoftware,KiCad,Pcbnew,5.1.12-84ad8e8a86~92~ubuntu18.04.1*%
%TF.CreationDate,2022-02-03T16:03:31-05:00*%
%TF.ProjectId,remote,72656d6f-7465-42e6-9b69-6361645f7063,rev?*%
%TF.SameCoordinates,Original*%
%TF.FileFunction,Profile,NP*%
%FSLAX46Y46*%
G04 Gerber Fmt 4.6, Leading zero omitted, Abs format (unit mm)*
G04 Created by KiCad (PCBNEW 5.1.12-84ad8e8a86~92~ubuntu18.04.1) date 2022-02-03 16:03:31*
%MOMM*%
%LPD*%
G01*
G04 APERTURE LIST*
%TA.AperFunction,Profile*%
%ADD10C,0.050000*%
%TD*%
G04 APERTURE END LIST*
D10*
X15570000Y-36181000D02*
G75*
G03*
X15570000Y-36181000I-1500000J0D01*
G01*
X35510000Y-36381000D02*
G75*
G03*
X35510000Y-36381000I-1500000J0D01*
G01*
X39480000Y-36481000D02*
G75*
G03*
X39480000Y-36481000I-1500000J0D01*
G01*
X13500000Y-47630000D02*
X38500000Y-47630000D01*
X13500000Y-62630000D02*
X13500000Y-47630000D01*
X38500000Y-62630000D02*
X13500000Y-62630000D01*
X38500000Y-47630000D02*
X38500000Y-62630000D01*
X3020580Y-8159420D02*
X48980052Y-8159420D01*
X48979736Y-109159948D02*
X33219508Y-109160492D01*
X35500000Y-32291000D02*
G75*
G03*
X35500000Y-32291000I-1500000J0D01*
G01*
X39500000Y-32291000D02*
G75*
G03*
X39500000Y-32291000I-1500000J0D01*
G01*
X21220000Y-9992512D02*
G75*
G03*
X21220000Y-14085000I0J-2046244D01*
G01*
X3027948Y-109160264D02*
G75*
G02*
X8000Y-106140000I316J3020264D01*
G01*
X8000Y-106140000D02*
X0Y-74929736D01*
X48980052Y-8159420D02*
G75*
G02*
X52000000Y-11179684I-316J-3020264D01*
G01*
X27500000Y-36381000D02*
G75*
G03*
X27500000Y-36381000I-1500000J0D01*
G01*
X23530000Y-36281000D02*
G75*
G03*
X23530000Y-36281000I-1500000J0D01*
G01*
X19530000Y-36281000D02*
G75*
G03*
X19530000Y-36281000I-1500000J0D01*
G01*
X31500000Y-36381000D02*
G75*
G03*
X31500000Y-36381000I-1500000J0D01*
G01*
X31500000Y-20291000D02*
G75*
G03*
X31500000Y-20291000I-1500000J0D01*
G01*
X27500000Y-20291000D02*
G75*
G03*
X27500000Y-20291000I-1500000J0D01*
G01*
X15500000Y-20291000D02*
G75*
G03*
X15500000Y-20291000I-1500000J0D01*
G01*
X19500000Y-20291000D02*
G75*
G03*
X19500000Y-20291000I-1500000J0D01*
G01*
X23500000Y-20291000D02*
G75*
G03*
X23500000Y-20291000I-1500000J0D01*
G01*
X39500000Y-20291000D02*
G75*
G03*
X39500000Y-20291000I-1500000J0D01*
G01*
X35500000Y-20291000D02*
G75*
G03*
X35500000Y-20291000I-1500000J0D01*
G01*
X23530000Y-32281000D02*
G75*
G03*
X23530000Y-32281000I-1500000J0D01*
G01*
X15530000Y-32281000D02*
G75*
G03*
X15530000Y-32281000I-1500000J0D01*
G01*
X23500000Y-24291000D02*
G75*
G03*
X23500000Y-24291000I-1500000J0D01*
G01*
X15500000Y-28291000D02*
G75*
G03*
X15500000Y-28291000I-1500000J0D01*
G01*
X31500000Y-28291000D02*
G75*
G03*
X31500000Y-28291000I-1500000J0D01*
G01*
X39500000Y-28291000D02*
G75*
G03*
X39500000Y-28291000I-1500000J0D01*
G01*
X23500000Y-28291000D02*
G75*
G03*
X23500000Y-28291000I-1500000J0D01*
G01*
X27500000Y-28291000D02*
G75*
G03*
X27500000Y-28291000I-1500000J0D01*
G01*
X31500000Y-32291000D02*
G75*
G03*
X31500000Y-32291000I-1500000J0D01*
G01*
X35500000Y-28291000D02*
G75*
G03*
X35500000Y-28291000I-1500000J0D01*
G01*
X31500000Y-24291000D02*
G75*
G03*
X31500000Y-24291000I-1500000J0D01*
G01*
X39500000Y-24291000D02*
G75*
G03*
X39500000Y-24291000I-1500000J0D01*
G01*
X19500000Y-28291000D02*
G75*
G03*
X19500000Y-28291000I-1500000J0D01*
G01*
X35500000Y-24291000D02*
G75*
G03*
X35500000Y-24291000I-1500000J0D01*
G01*
X27500000Y-24291000D02*
G75*
G03*
X27500000Y-24291000I-1500000J0D01*
G01*
X19500000Y-24291000D02*
G75*
G03*
X19500000Y-24291000I-1500000J0D01*
G01*
X15500000Y-24291000D02*
G75*
G03*
X15500000Y-24291000I-1500000J0D01*
G01*
X27500000Y-32291000D02*
G75*
G03*
X27500000Y-32291000I-1500000J0D01*
G01*
X19500000Y-32291000D02*
G75*
G03*
X19500000Y-32291000I-1500000J0D01*
G01*
X52000000Y-11179684D02*
X52000000Y-106140000D01*
X0Y-11180000D02*
X0Y-74929736D01*
X30892000Y-14090000D02*
X21220000Y-14085000D01*
X30892000Y-9997512D02*
G75*
G02*
X30892000Y-14090000I0J-2046244D01*
G01*
X21220000Y-9992512D02*
X30892000Y-9997512D01*
X0Y-11180000D02*
G75*
G02*
X3020580Y-8159420I3020580J0D01*
G01*
X52000000Y-106140000D02*
G75*
G02*
X48979736Y-109159948I-3020264J316D01*
G01*
X3027948Y-109160264D02*
X33219508Y-109160492D01*
M02*
