M48
; DRILL file {KiCad 5.1.6-c6e7f7d~87~ubuntu18.04.1} date Wed Jul 21 15:50:50 2021
; FORMAT={-:-/ absolute / inch / decimal}
; #@! TF.CreationDate,2021-07-21T15:50:50-04:00
; #@! TF.GenerationSoftware,Kicad,Pcbnew,5.1.6-c6e7f7d~87~ubuntu18.04.1
; #@! TF.FileFunction,Plated,1,2,PTH
FMAT,2
INCH
T1C0.0157
T2C0.0315
T3C0.0394
T4C0.0512
T5C0.0551
%
G90
G05
T1
X7.3622Y1.2795
X7.4094Y0.8268
X7.4331Y-0.378
X7.4567Y-0.2047
X7.457Y0.483
X7.5039Y1.4094
X7.5039Y0.6457
X7.524Y3.013
X7.5417Y0.041
X7.5492Y2.2539
X7.5945Y0.8071
X7.6772Y1.6614
X7.7165Y2.4094
X7.7244Y1.1575
X7.7323Y0.0945
X7.7402Y2.4724
X7.7559Y3.1575
X7.7717Y1.4252
X7.7874Y3.2835
X7.811Y2.4252
X7.8189Y3.5512
X7.8386Y1.2402
X7.8543Y-0.4035
X7.8622Y0.874
X7.8661Y3.4882
X7.8701Y1.4567
X7.876Y0.6909
X7.9134Y2.4252
X7.9134Y1.8386
X7.9213Y1.9213
X8.0079Y2.4488
X8.0236Y1.9764
X8.0276Y0.9449
X8.0315Y0.8583
X8.0787Y0.9724
X8.0866Y2.378
X8.1201Y3.0906
X8.1732Y1.6457
X8.1811Y1.2795
X8.1929Y1.2205
X8.1988Y-0.5709
X8.2185Y3.4449
X8.2992Y1.6457
X8.3386Y1.8898
X8.3465Y1.7008
X8.3543Y3.0709
X8.3701Y1.1181
X8.3937Y3.1969
X8.4094Y1.4134
X8.4094Y0.8976
X8.5039Y1.685
X8.5157Y1.6299
X8.5335Y3.1201
X8.5394Y3.5157
X8.5512Y3.3543
X8.5669Y2.3307
X8.5709Y1.4646
X8.5827Y-0.5807
X8.5906Y1.748
X8.6024Y1.1024
X8.6339Y1.6772
X8.6378Y2.0551
X8.6417Y3.0217
X8.6535Y1.4528
X8.6693Y0.878
X8.6811Y1.2126
X8.6909Y3.6713
X8.6909Y-0.3051
X8.7008Y3.2756
X8.7008Y3.1969
X8.7008Y3.063
X8.7008Y2.0984
X8.7047Y3.5591
X8.7087Y2.3465
X8.7564Y2.966
X8.7874Y1.4173
X8.7943Y3.6368
X8.8189Y1.6634
X8.8346Y3.1969
X8.8504Y2.4961
X8.874Y2.4173
X8.8819Y3.2598
X8.8878Y-0.5413
X8.9173Y1.878
X8.9567Y-0.2264
X8.9685Y0.9488
X8.9764Y-0.0984
X8.9843Y2.7244
X8.9921Y1.3071
X9.0157Y3.2638
X9.031Y1.525
X9.0394Y3.1496
X9.0394Y0.9409
X9.0453Y2.1752
X9.0472Y0.2559
X9.0551Y2.2677
X9.062Y1.1841
X9.0748Y1.9331
X9.0906Y0.8898
X9.0945Y2.6693
X9.1024Y2.5669
X9.1142Y2.185
X9.1181Y1.7402
X9.124Y3.4547
X9.124Y2.0571
X9.1299Y0.752
X9.1575Y3.1969
X9.1634Y2.6575
X9.1732Y2.8642
X9.1811Y3.2756
X9.1831Y3.5925
X9.2028Y1.6043
X9.2224Y1.2598
X9.2323Y2.815
X9.2835Y1.0394
X9.2913Y3.0413
X9.2913Y2.7165
X9.315Y2.6063
X9.3268Y0.685
X9.3307Y1.9252
X9.3386Y1.1535
X9.3405Y-0.246
X9.3406Y2.1457
X9.3406Y0.0984
X9.3504Y3.0413
X9.3543Y0.7913
X9.3996Y1.2402
X9.3996Y1.186
X9.3996Y-0.061
X9.4094Y-0.1476
X9.4567Y2.0709
X9.4764Y1.0079
X9.484Y0.154
X9.4921Y1.937
X9.498Y2.1161
X9.5039Y1.9803
X9.5079Y2.1575
X9.5079Y2.0276
X9.5315Y0.7323
X9.5394Y1.1024
X9.5433Y1.1575
X9.563Y1.374
X9.6063Y0.9606
X9.6063Y0.2835
X9.6142Y-0.0394
X9.6535Y0.5512
T2
X8.189Y2.2638
X8.189Y1.7638
X9.1654Y-0.0846
X9.1654Y-0.1831
X8.0315Y2.2638
X8.0315Y1.7638
X9.1693Y0.1811
X9.1693Y0.0827
X8.3465Y2.2638
X8.3465Y1.7638
X8.8386Y2.2638
X8.8386Y1.7638
X8.5039Y2.2638
X8.5039Y1.7638
T3
X7.577Y1.345
X7.677Y1.345
X7.777Y1.345
X7.877Y1.345
X7.977Y1.345
X8.077Y1.345
X8.177Y1.345
X8.277Y1.345
X8.377Y1.345
X8.477Y1.345
X8.577Y1.345
X8.677Y1.345
X8.777Y1.345
X8.877Y1.345
X7.577Y0.745
X7.677Y0.745
X7.777Y0.745
X7.877Y0.745
X7.977Y0.745
X8.077Y0.745
X8.177Y0.745
X8.277Y0.745
X8.377Y0.745
X8.477Y0.745
X8.577Y0.745
X8.677Y0.745
X8.777Y0.745
X8.877Y0.745
X8.878Y1.2441
X8.878Y1.1441
X8.878Y1.0441
X8.878Y0.9441
X8.878Y0.8441
X8.118Y3.373
X8.218Y3.373
X8.318Y3.373
X8.418Y3.373
X9.484Y0.354
X9.484Y0.254
X9.484Y0.154
X9.484Y0.054
X9.484Y-0.046
X9.484Y-0.146
X9.484Y-0.246
X7.574Y-0.034
X7.674Y-0.034
X7.774Y-0.034
X7.874Y-0.034
X7.974Y-0.034
X8.074Y-0.034
X8.174Y-0.034
X8.274Y-0.034
X8.374Y-0.034
X8.474Y-0.034
X8.574Y-0.034
X8.674Y-0.034
X8.774Y-0.034
X8.874Y-0.034
X8.8563Y-0.372
X8.9563Y-0.372
X9.0563Y-0.372
X7.574Y0.566
X7.674Y0.566
X7.774Y0.566
X7.874Y0.566
X7.974Y0.566
X8.074Y0.566
X8.174Y0.566
X8.274Y0.566
X8.374Y0.566
X8.474Y0.566
X8.574Y0.566
X8.674Y0.566
X8.774Y0.566
X8.874Y0.566
X8.268Y1.526
X8.368Y1.526
X8.468Y1.526
X8.568Y1.526
X8.668Y1.526
X8.768Y1.526
X8.868Y1.526
X9.2126Y0.8622
X9.2126Y0.685
X9.4685Y0.8622
X9.4685Y0.685
X7.5228Y2.8919
X7.5228Y2.636
X7.7Y2.8919
X7.7Y2.636
X9.173Y2.966
X9.273Y2.966
X9.373Y2.966
X9.473Y2.966
X7.628Y2.2539
X7.628Y1.998
X7.8051Y2.2539
X7.8051Y1.998
X9.226Y3.772
T4
X7.872Y-0.4744
X8.0689Y-0.4744
T5
X7.5965Y-0.2008
X8.0965Y-0.2008
T3
G00X8.285Y-0.3715
M15
G01X8.285Y-0.2927
M16
G05
G00X8.4306Y-0.214
M15
G01X8.5094Y-0.214
M16
G05
G00X8.4306Y-0.4502
M15
G01X8.5094Y-0.4502
M16
G05
T0
M30
