%TF.GenerationSoftware,KiCad,Pcbnew,5.1.6-c6e7f7d~87~ubuntu18.04.1*%
%TF.CreationDate,2021-09-22T20:52:25-04:00*%
%TF.ProjectId,remote,72656d6f-7465-42e6-9b69-6361645f7063,rev?*%
%TF.SameCoordinates,Original*%
%TF.FileFunction,Paste,Top*%
%TF.FilePolarity,Positive*%
%FSLAX46Y46*%
G04 Gerber Fmt 4.6, Leading zero omitted, Abs format (unit mm)*
G04 Created by KiCad (PCBNEW 5.1.6-c6e7f7d~87~ubuntu18.04.1) date 2021-09-22 20:52:25*
%MOMM*%
%LPD*%
G01*
G04 APERTURE LIST*
G04 APERTURE END LIST*
%TO.C,J13*%
G36*
G01*
X14042000Y-91325001D02*
X14042000Y-90024999D01*
G75*
G02*
X14291999Y-89775000I249999J0D01*
G01*
X14992001Y-89775000D01*
G75*
G02*
X15242000Y-90024999I0J-249999D01*
G01*
X15242000Y-91325001D01*
G75*
G02*
X14992001Y-91575000I-249999J0D01*
G01*
X14291999Y-91575000D01*
G75*
G02*
X14042000Y-91325001I0J249999D01*
G01*
G37*
G36*
G01*
X8442000Y-91325001D02*
X8442000Y-90024999D01*
G75*
G02*
X8691999Y-89775000I249999J0D01*
G01*
X9392001Y-89775000D01*
G75*
G02*
X9642000Y-90024999I0J-249999D01*
G01*
X9642000Y-91325001D01*
G75*
G02*
X9392001Y-91575000I-249999J0D01*
G01*
X8691999Y-91575000D01*
G75*
G02*
X8442000Y-91325001I0J249999D01*
G01*
G37*
G36*
G01*
X13042000Y-87425000D02*
X13042000Y-86175000D01*
G75*
G02*
X13192000Y-86025000I150000J0D01*
G01*
X13492000Y-86025000D01*
G75*
G02*
X13642000Y-86175000I0J-150000D01*
G01*
X13642000Y-87425000D01*
G75*
G02*
X13492000Y-87575000I-150000J0D01*
G01*
X13192000Y-87575000D01*
G75*
G02*
X13042000Y-87425000I0J150000D01*
G01*
G37*
G36*
G01*
X12042000Y-87425000D02*
X12042000Y-86175000D01*
G75*
G02*
X12192000Y-86025000I150000J0D01*
G01*
X12492000Y-86025000D01*
G75*
G02*
X12642000Y-86175000I0J-150000D01*
G01*
X12642000Y-87425000D01*
G75*
G02*
X12492000Y-87575000I-150000J0D01*
G01*
X12192000Y-87575000D01*
G75*
G02*
X12042000Y-87425000I0J150000D01*
G01*
G37*
G36*
G01*
X11042000Y-87425000D02*
X11042000Y-86175000D01*
G75*
G02*
X11192000Y-86025000I150000J0D01*
G01*
X11492000Y-86025000D01*
G75*
G02*
X11642000Y-86175000I0J-150000D01*
G01*
X11642000Y-87425000D01*
G75*
G02*
X11492000Y-87575000I-150000J0D01*
G01*
X11192000Y-87575000D01*
G75*
G02*
X11042000Y-87425000I0J150000D01*
G01*
G37*
G36*
G01*
X10042000Y-87425000D02*
X10042000Y-86175000D01*
G75*
G02*
X10192000Y-86025000I150000J0D01*
G01*
X10492000Y-86025000D01*
G75*
G02*
X10642000Y-86175000I0J-150000D01*
G01*
X10642000Y-87425000D01*
G75*
G02*
X10492000Y-87575000I-150000J0D01*
G01*
X10192000Y-87575000D01*
G75*
G02*
X10042000Y-87425000I0J150000D01*
G01*
G37*
%TD*%
%TO.C,J18*%
G36*
G01*
X42762000Y-91325001D02*
X42762000Y-90024999D01*
G75*
G02*
X43011999Y-89775000I249999J0D01*
G01*
X43712001Y-89775000D01*
G75*
G02*
X43962000Y-90024999I0J-249999D01*
G01*
X43962000Y-91325001D01*
G75*
G02*
X43712001Y-91575000I-249999J0D01*
G01*
X43011999Y-91575000D01*
G75*
G02*
X42762000Y-91325001I0J249999D01*
G01*
G37*
G36*
G01*
X37162000Y-91325001D02*
X37162000Y-90024999D01*
G75*
G02*
X37411999Y-89775000I249999J0D01*
G01*
X38112001Y-89775000D01*
G75*
G02*
X38362000Y-90024999I0J-249999D01*
G01*
X38362000Y-91325001D01*
G75*
G02*
X38112001Y-91575000I-249999J0D01*
G01*
X37411999Y-91575000D01*
G75*
G02*
X37162000Y-91325001I0J249999D01*
G01*
G37*
G36*
G01*
X41762000Y-87425000D02*
X41762000Y-86175000D01*
G75*
G02*
X41912000Y-86025000I150000J0D01*
G01*
X42212000Y-86025000D01*
G75*
G02*
X42362000Y-86175000I0J-150000D01*
G01*
X42362000Y-87425000D01*
G75*
G02*
X42212000Y-87575000I-150000J0D01*
G01*
X41912000Y-87575000D01*
G75*
G02*
X41762000Y-87425000I0J150000D01*
G01*
G37*
G36*
G01*
X40762000Y-87425000D02*
X40762000Y-86175000D01*
G75*
G02*
X40912000Y-86025000I150000J0D01*
G01*
X41212000Y-86025000D01*
G75*
G02*
X41362000Y-86175000I0J-150000D01*
G01*
X41362000Y-87425000D01*
G75*
G02*
X41212000Y-87575000I-150000J0D01*
G01*
X40912000Y-87575000D01*
G75*
G02*
X40762000Y-87425000I0J150000D01*
G01*
G37*
G36*
G01*
X39762000Y-87425000D02*
X39762000Y-86175000D01*
G75*
G02*
X39912000Y-86025000I150000J0D01*
G01*
X40212000Y-86025000D01*
G75*
G02*
X40362000Y-86175000I0J-150000D01*
G01*
X40362000Y-87425000D01*
G75*
G02*
X40212000Y-87575000I-150000J0D01*
G01*
X39912000Y-87575000D01*
G75*
G02*
X39762000Y-87425000I0J150000D01*
G01*
G37*
G36*
G01*
X38762000Y-87425000D02*
X38762000Y-86175000D01*
G75*
G02*
X38912000Y-86025000I150000J0D01*
G01*
X39212000Y-86025000D01*
G75*
G02*
X39362000Y-86175000I0J-150000D01*
G01*
X39362000Y-87425000D01*
G75*
G02*
X39212000Y-87575000I-150000J0D01*
G01*
X38912000Y-87575000D01*
G75*
G02*
X38762000Y-87425000I0J150000D01*
G01*
G37*
%TD*%
%TO.C,J12*%
G36*
G01*
X40790000Y-5215000D02*
X40790000Y-6465000D01*
G75*
G02*
X40640000Y-6615000I-150000J0D01*
G01*
X40340000Y-6615000D01*
G75*
G02*
X40190000Y-6465000I0J150000D01*
G01*
X40190000Y-5215000D01*
G75*
G02*
X40340000Y-5065000I150000J0D01*
G01*
X40640000Y-5065000D01*
G75*
G02*
X40790000Y-5215000I0J-150000D01*
G01*
G37*
G36*
G01*
X39790000Y-5215000D02*
X39790000Y-6465000D01*
G75*
G02*
X39640000Y-6615000I-150000J0D01*
G01*
X39340000Y-6615000D01*
G75*
G02*
X39190000Y-6465000I0J150000D01*
G01*
X39190000Y-5215000D01*
G75*
G02*
X39340000Y-5065000I150000J0D01*
G01*
X39640000Y-5065000D01*
G75*
G02*
X39790000Y-5215000I0J-150000D01*
G01*
G37*
G36*
G01*
X38790000Y-5215000D02*
X38790000Y-6465000D01*
G75*
G02*
X38640000Y-6615000I-150000J0D01*
G01*
X38340000Y-6615000D01*
G75*
G02*
X38190000Y-6465000I0J150000D01*
G01*
X38190000Y-5215000D01*
G75*
G02*
X38340000Y-5065000I150000J0D01*
G01*
X38640000Y-5065000D01*
G75*
G02*
X38790000Y-5215000I0J-150000D01*
G01*
G37*
G36*
G01*
X37790000Y-5215000D02*
X37790000Y-6465000D01*
G75*
G02*
X37640000Y-6615000I-150000J0D01*
G01*
X37340000Y-6615000D01*
G75*
G02*
X37190000Y-6465000I0J150000D01*
G01*
X37190000Y-5215000D01*
G75*
G02*
X37340000Y-5065000I150000J0D01*
G01*
X37640000Y-5065000D01*
G75*
G02*
X37790000Y-5215000I0J-150000D01*
G01*
G37*
G36*
G01*
X42390000Y-1314999D02*
X42390000Y-2615001D01*
G75*
G02*
X42140001Y-2865000I-249999J0D01*
G01*
X41439999Y-2865000D01*
G75*
G02*
X41190000Y-2615001I0J249999D01*
G01*
X41190000Y-1314999D01*
G75*
G02*
X41439999Y-1065000I249999J0D01*
G01*
X42140001Y-1065000D01*
G75*
G02*
X42390000Y-1314999I0J-249999D01*
G01*
G37*
G36*
G01*
X36790000Y-1314999D02*
X36790000Y-2615001D01*
G75*
G02*
X36540001Y-2865000I-249999J0D01*
G01*
X35839999Y-2865000D01*
G75*
G02*
X35590000Y-2615001I0J249999D01*
G01*
X35590000Y-1314999D01*
G75*
G02*
X35839999Y-1065000I249999J0D01*
G01*
X36540001Y-1065000D01*
G75*
G02*
X36790000Y-1314999I0J-249999D01*
G01*
G37*
%TD*%
M02*
