M48
; DRILL file {KiCad 5.1.6-c6e7f7d~87~ubuntu18.04.1} date Mon Aug 30 08:39:16 2021
; FORMAT={-:-/ absolute / inch / decimal}
; #@! TF.CreationDate,2021-08-30T08:39:16-04:00
; #@! TF.GenerationSoftware,Kicad,Pcbnew,5.1.6-c6e7f7d~87~ubuntu18.04.1
; #@! TF.FileFunction,Plated,1,2,PTH
FMAT,2
INCH
T1C0.0157
T2C0.0295
T3C0.0315
T4C0.0390
T5C0.0394
T6C0.0512
T7C0.0551
%
G90
G05
T1
X7.3543Y2.8504
X7.3701Y0.937
X7.3858Y-0.126
X7.4173Y1.9606
X7.4252Y2.9764
X7.4646Y2.0787
X7.4646Y-0.2047
X7.4961Y3.0787
X7.5039Y0.3307
X7.5118Y2.6378
X7.5118Y0.8661
X7.5669Y0.9921
X7.5827Y1.189
X7.6535Y2.3937
X7.6693Y3.1417
X7.685Y3.5197
X7.6929Y2.5433
X7.7165Y0.7795
X7.748Y3.4646
X7.7559Y0.4134
X7.8425Y1.6378
X7.8504Y2.6142
X7.8504Y0.7717
X7.8504Y0.7717
X7.8543Y-0.6988
X7.8583Y0.0157
X7.9134Y-0.6299
X7.9528Y2.4094
X7.9843Y-0.0157
X7.9921Y3.189
X7.9921Y2.7559
X8.0Y2.1654
X8.0079Y1.4173
X8.0236Y-0.748
X8.0315Y2.8543
X8.0472Y2.5039
X8.0551Y1.5276
X8.0551Y-0.2756
X8.061Y3.1594
X8.0807Y0.3543
X8.1181Y2.1732
X8.1496Y2.9843
X8.1496Y1.3858
X8.2002Y2.1738
X8.2992Y1.2047
X8.3228Y3.4646
X8.3228Y-0.2283
X8.3386Y2.9449
X8.3543Y1.9764
X8.4252Y3.5118
X8.5335Y3.2579
X8.5669Y2.5669
X8.5984Y3.5118
X8.6417Y3.1988
X8.6457Y3.4646
X8.6614Y1.6929
X8.6772Y-0.4961
X8.7165Y-0.2283
X8.7717Y-0.2913
X8.8031Y0.7323
X8.8189Y0.2677
X8.8681Y-0.6988
X8.9075Y-0.4724
X8.9528Y-0.189
X8.9606Y-0.4961
X8.9961Y-0.6398
X9.0Y1.4803
X9.0315Y-0.1417
X9.0315Y-0.8031
X9.0709Y-0.5512
X9.1024Y-0.2992
X9.1634Y0.561
X9.1929Y0.8071
X9.1929Y0.7185
X9.2421Y0.7776
X9.252Y1.2106
X9.252Y0.6988
X9.2677Y3.2047
X9.2756Y3.5276
X9.315Y-0.2283
X9.3209Y0.7185
X9.3228Y3.4882
X9.3465Y-0.1102
X9.3602Y1.0827
X9.3602Y0.7677
X9.3622Y3.1181
X9.3701Y1.4016
X9.4094Y1.0236
X9.4193Y-0.4232
X9.4291Y-0.1772
X9.4291Y-0.2264
X9.5433Y-0.748
X9.5669Y3.0315
X9.5669Y2.1063
X9.5669Y0.935
X9.5965Y3.2087
X9.6063Y0.8465
X9.6161Y2.0571
X9.626Y-0.1772
X9.626Y-0.6102
X9.6752Y-0.2067
T2
X7.502Y0.2579
X7.5807Y0.2579
T3
X8.9213Y0.7756
X8.9213Y0.2756
X9.1024Y0.7756
X9.1024Y0.2756
X8.622Y0.7795
X8.622Y0.2795
X8.4488Y0.7795
X8.4488Y0.2795
X9.1732Y-0.0748
X9.1732Y-0.1732
X8.8346Y-0.0748
X8.8346Y-0.1732
T4
X9.4441Y2.7374
X9.4441Y2.5602
X9.4441Y0.5807
X9.4441Y0.4035
X9.4441Y1.7937
X9.4441Y1.6165
T5
X8.1535Y0.8937
X8.2535Y0.8937
X8.3535Y0.8937
X8.4535Y0.8937
X8.5535Y0.8937
X8.6535Y0.8937
X8.7535Y0.8937
X8.8535Y0.8937
X8.9535Y0.8937
X9.0535Y0.8937
X9.1535Y0.8937
X9.2535Y0.8937
X8.8616Y-0.3878
X8.9616Y-0.3878
X9.0616Y-0.3878
X7.7504Y2.2741
X7.8504Y2.2741
X7.9504Y2.2741
X8.0504Y2.2741
X8.1504Y2.2741
X8.2504Y2.2741
X8.3504Y2.2741
X8.4504Y2.2741
X8.5504Y2.2741
X8.6504Y2.2741
X8.7504Y2.2741
X8.8504Y2.2741
X8.9504Y2.2741
X9.0504Y2.2741
X9.1504Y2.2741
X9.2504Y2.2741
X7.7539Y1.2998
X7.8539Y1.2998
X7.9539Y1.2998
X8.0539Y1.2998
X8.1539Y1.2998
X8.2539Y1.2998
X8.3539Y1.2998
X8.4539Y1.2998
X8.5539Y1.2998
X8.6539Y1.2998
X8.7539Y1.2998
X8.8539Y1.2998
X8.9539Y1.2998
X9.0539Y1.2998
X9.1539Y1.2998
X9.2539Y1.2998
X8.1535Y2.0984
X8.2535Y2.0984
X8.3535Y2.0984
X8.4535Y2.0984
X8.5535Y2.0984
X8.6535Y2.0984
X8.7535Y2.0984
X8.8535Y2.0984
X8.9535Y2.0984
X9.0535Y2.0984
X9.1535Y2.0984
X9.2535Y2.0984
X7.628Y2.8394
X7.628Y2.7394
X7.628Y2.6394
X7.628Y2.5394
X8.348Y3.3446
X8.448Y3.3446
X8.548Y3.3446
X8.648Y3.3446
X8.1535Y3.0748
X8.2535Y3.0748
X8.3535Y3.0748
X8.4535Y3.0748
X8.5535Y3.0748
X8.6535Y3.0748
X8.7535Y3.0748
X8.8535Y3.0748
X8.9535Y3.0748
X9.0535Y3.0748
X9.1535Y3.0748
X9.2535Y3.0748
X7.628Y1.8453
X7.628Y1.7453
X7.628Y1.6453
X7.628Y1.5453
X7.7551Y0.0949
X7.8551Y0.0949
X7.9551Y0.0949
X8.0551Y0.0949
X8.1551Y0.0949
X8.2551Y0.0949
X8.3551Y0.0949
X8.4551Y0.0949
X8.5551Y0.0949
X8.6551Y0.0949
X8.7551Y0.0949
X8.8551Y0.0949
X8.9551Y0.0949
X9.0551Y0.0949
X9.1551Y0.0949
X9.2551Y0.0949
X7.8161Y-0.5276
X7.9161Y-0.5276
X8.0161Y-0.5276
X8.1161Y-0.5276
T6
X9.3461Y2.787
X9.3461Y2.511
X9.3461Y0.6303
X9.3461Y0.3543
X7.5925Y-0.065
X7.5925Y-0.2618
X9.3461Y1.8433
X9.3461Y1.5673
T7
X7.872Y-0.0827
X8.372Y-0.0827
T5
G00X8.285Y-0.4331
M15
G01X8.285Y-0.3543
M16
G05
G00X8.4306Y-0.2756
M15
G01X8.5094Y-0.2756
M16
G05
G00X8.4306Y-0.5118
M15
G01X8.5094Y-0.5118
M16
G05
T0
M30
