%TF.GenerationSoftware,KiCad,Pcbnew,5.1.6-c6e7f7d~87~ubuntu18.04.1*%
%TF.CreationDate,2021-09-22T21:34:05-04:00*%
%TF.ProjectId,remote,72656d6f-7465-42e6-9b69-6361645f7063,rev?*%
%TF.SameCoordinates,Original*%
%TF.FileFunction,Copper,L1,Top*%
%TF.FilePolarity,Positive*%
%FSLAX46Y46*%
G04 Gerber Fmt 4.6, Leading zero omitted, Abs format (unit mm)*
G04 Created by KiCad (PCBNEW 5.1.6-c6e7f7d~87~ubuntu18.04.1) date 2021-09-22 21:34:05*
%MOMM*%
%LPD*%
G01*
G04 APERTURE LIST*
%TA.AperFunction,ComponentPad*%
%ADD10O,1.700000X1.700000*%
%TD*%
%TA.AperFunction,ComponentPad*%
%ADD11R,1.700000X1.700000*%
%TD*%
%TA.AperFunction,ComponentPad*%
%ADD12C,5.400000*%
%TD*%
%TA.AperFunction,ViaPad*%
%ADD13C,0.800000*%
%TD*%
%TA.AperFunction,Conductor*%
%ADD14C,0.700000*%
%TD*%
%TA.AperFunction,Conductor*%
%ADD15C,0.250000*%
%TD*%
G04 APERTURE END LIST*
D10*
%TO.P,J2,4*%
%TO.N,SDA*%
X137710000Y-88790000D03*
%TO.P,J2,3*%
%TO.N,SCL*%
X137710000Y-86250000D03*
%TO.P,J2,2*%
%TO.N,+3V3*%
X137710000Y-83710000D03*
D11*
%TO.P,J2,1*%
%TO.N,GND*%
X137710000Y-81170000D03*
%TD*%
D10*
%TO.P,J1,4*%
%TO.N,SDA*%
X130170000Y-73800000D03*
%TO.P,J1,3*%
%TO.N,SCL*%
X127630000Y-73800000D03*
%TO.P,J1,2*%
%TO.N,+3V3*%
X125090000Y-73800000D03*
D11*
%TO.P,J1,1*%
%TO.N,GND*%
X122550000Y-73800000D03*
%TD*%
D12*
%TO.P,H5,1*%
%TO.N,N/C*%
X148120000Y-28910000D03*
%TD*%
%TO.P,H6,1*%
%TO.N,N/C*%
X104060000Y-28890000D03*
%TD*%
%TO.P,H4,1*%
%TO.N,SDA*%
X148060000Y-58890000D03*
%TD*%
%TO.P,H3,1*%
%TO.N,SCL*%
X104060000Y-58890000D03*
%TD*%
%TO.P,H2,1*%
%TO.N,+3V3*%
X148060000Y-113890000D03*
%TD*%
%TO.P,H1,1*%
%TO.N,GND*%
X104060000Y-113890000D03*
%TD*%
D13*
%TO.N,+3V3*%
X125230000Y-83350000D03*
%TO.N,GND*%
X122820000Y-81370000D03*
%TO.N,SDA*%
X130170000Y-88140000D03*
%TO.N,SCL*%
X127550000Y-85490000D03*
%TD*%
D14*
%TO.N,+3V3*%
X125230000Y-73940000D02*
X125090000Y-73800000D01*
X125230000Y-84110000D02*
X125230000Y-83350000D01*
X125230000Y-83350000D02*
X125230000Y-73940000D01*
%TO.N,GND*%
X122550000Y-73800000D02*
X122550000Y-81100000D01*
X122550000Y-81100000D02*
X122820000Y-81370000D01*
X122960000Y-81510000D02*
X122820000Y-81370000D01*
D15*
%TO.N,SDA*%
X130170000Y-73800000D02*
X130170000Y-88140000D01*
%TO.N,SCL*%
X127550000Y-73880000D02*
X127630000Y-73800000D01*
X127550000Y-85490000D02*
X127550000Y-73880000D01*
%TD*%
M02*
