(module PinSocket_1x08_P2.54mm_Vertical (layer F.Cu) (tedit 61E22596)
  (descr "Through hole straight socket strip, 1x08, 2.54mm pitch, single row (from Kicad 4.0.7), script generated")
  (tags "Through hole socket strip THT 1x08 2.54mm single row")
  (fp_text reference REF** (at 0 -2.39) (layer F.SilkS)
    (effects (font (size 1 1) (thickness 0.15)))
  )
  (fp_text value PinSocket_1x08_P2.54mm_Vertical (at 0 20.55) (layer F.Fab)
    (effects (font (size 1 1) (thickness 0.15)))
  )
  (fp_text user %R (at 0 0 180) (layer F.Fab)
    (effects (font (size 1 1) (thickness 0.15)))
  )
  (fp_line (start -10.16 1.27) (end -10.16 -0.635) (layer F.Fab) (width 0.1))
  (fp_line (start -10.16 -0.635) (end -9.525 -1.27) (layer F.Fab) (width 0.1))
  (fp_line (start -9.525 -1.27) (end 10.16 -1.27) (layer F.Fab) (width 0.1))
  (fp_line (start 10.16 -1.27) (end 10.16 1.27) (layer F.Fab) (width 0.1))
  (fp_line (start 10.16 1.27) (end -10.16 1.27) (layer F.Fab) (width 0.1))
  (fp_line (start -7.62 1.33) (end -7.62 -1.33) (layer F.SilkS) (width 0.12))
  (fp_line (start -7.62 1.33) (end 10.22 1.33) (layer F.SilkS) (width 0.12))
  (fp_line (start 10.22 1.33) (end 10.22 -1.33) (layer F.SilkS) (width 0.12))
  (fp_line (start -7.62 -1.33) (end 10.22 -1.33) (layer F.SilkS) (width 0.12))
  (fp_line (start -10.22 -1.33) (end -8.89 -1.33) (layer F.SilkS) (width 0.12))
  (fp_line (start -10.22 0) (end -10.22 -1.33) (layer F.SilkS) (width 0.12))
  (fp_line (start -10.69 1.8) (end -10.69 -1.75) (layer F.CrtYd) (width 0.05))
  (fp_line (start -10.69 -1.75) (end 10.66 -1.75) (layer F.CrtYd) (width 0.05))
  (fp_line (start 10.66 -1.75) (end 10.66 1.8) (layer F.CrtYd) (width 0.05))
  (fp_line (start 10.66 1.8) (end -10.69 1.8) (layer F.CrtYd) (width 0.05))
  (fp_circle (center 15 0) (end 16.35 0) (layer F.SilkS) (width 0.12))
  (fp_circle (center -15 0) (end -13.65 0) (layer F.SilkS) (width 0.12))
  (fp_circle (center 15 42) (end 16.35 42) (layer F.SilkS) (width 0.12))
  (fp_circle (center -15 42) (end -13.65 42) (layer F.SilkS) (width 0.12))
  (fp_line (start -16.35 2.5) (end -16.35 32.5) (layer F.SilkS) (width 0.12))
  (fp_line (start 16.35 2.5) (end 16.35 32.5) (layer F.SilkS) (width 0.12))
  (fp_line (start -16.35 2.5) (end 16.35 2.5) (layer F.SilkS) (width 0.12))
  (fp_line (start -16.35 32.5) (end 16.35 32.5) (layer F.SilkS) (width 0.12))
  (pad 8 thru_hole oval (at 8.89 0 90) (size 1.7 1.7) (drill 1) (layers *.Cu *.Mask))
  (pad 7 thru_hole oval (at 6.35 0 90) (size 1.7 1.7) (drill 1) (layers *.Cu *.Mask))
  (pad 6 thru_hole oval (at 3.81 0 90) (size 1.7 1.7) (drill 1) (layers *.Cu *.Mask))
  (pad 5 thru_hole oval (at 1.27 0 90) (size 1.7 1.7) (drill 1) (layers *.Cu *.Mask))
  (pad 4 thru_hole oval (at -1.27 0 90) (size 1.7 1.7) (drill 1) (layers *.Cu *.Mask))
  (pad 3 thru_hole oval (at -3.81 0 90) (size 1.7 1.7) (drill 1) (layers *.Cu *.Mask))
  (pad 2 thru_hole oval (at -6.35 0 90) (size 1.7 1.7) (drill 1) (layers *.Cu *.Mask))
  (pad 1 thru_hole rect (at -8.89 0 90) (size 1.7 1.7) (drill 1) (layers *.Cu *.Mask))
  (model ${KICAD6_3DMODEL_DIR}/Connector_PinSocket_2.54mm.3dshapes/PinSocket_1x08_P2.54mm_Vertical.wrl
    (at (xyz 0 0 0))
    (scale (xyz 1 1 1))
    (rotate (xyz 0 0 0))
  )
)
