%TF.GenerationSoftware,KiCad,Pcbnew,5.1.9-73d0e3b20d~88~ubuntu18.04.1*%
%TF.CreationDate,2021-05-13T18:16:41-04:00*%
%TF.ProjectId,remote,72656d6f-7465-42e6-9b69-6361645f7063,rev?*%
%TF.SameCoordinates,Original*%
%TF.FileFunction,Copper,L1,Top*%
%TF.FilePolarity,Positive*%
%FSLAX46Y46*%
G04 Gerber Fmt 4.6, Leading zero omitted, Abs format (unit mm)*
G04 Created by KiCad (PCBNEW 5.1.9-73d0e3b20d~88~ubuntu18.04.1) date 2021-05-13 18:16:41*
%MOMM*%
%LPD*%
G01*
G04 APERTURE LIST*
%TA.AperFunction,ComponentPad*%
%ADD10O,1.700000X1.700000*%
%TD*%
%TA.AperFunction,ComponentPad*%
%ADD11R,1.700000X1.700000*%
%TD*%
%TA.AperFunction,ComponentPad*%
%ADD12O,1.600000X1.600000*%
%TD*%
%TA.AperFunction,ComponentPad*%
%ADD13R,1.600000X1.600000*%
%TD*%
%TA.AperFunction,ComponentPad*%
%ADD14C,1.600000*%
%TD*%
%TA.AperFunction,ComponentPad*%
%ADD15R,3.500000X3.500000*%
%TD*%
%TA.AperFunction,ComponentPad*%
%ADD16C,1.700000*%
%TD*%
%TA.AperFunction,ComponentPad*%
%ADD17C,2.600000*%
%TD*%
%TA.AperFunction,ComponentPad*%
%ADD18R,2.600000X2.600000*%
%TD*%
%TA.AperFunction,SMDPad,CuDef*%
%ADD19R,1.000000X1.000000*%
%TD*%
%TA.AperFunction,ViaPad*%
%ADD20C,0.800000*%
%TD*%
%TA.AperFunction,Conductor*%
%ADD21C,0.700000*%
%TD*%
%TA.AperFunction,Conductor*%
%ADD22C,0.400000*%
%TD*%
G04 APERTURE END LIST*
D10*
%TO.P,J2,7*%
%TO.N,GND*%
X240893600Y-6248400D03*
%TO.P,J2,6*%
%TO.N,+3V3*%
X240893600Y-3708400D03*
%TO.P,J2,5*%
%TO.N,VHI*%
X240893600Y-1168400D03*
%TO.P,J2,4*%
%TO.N,ESP_RX*%
X240893600Y1371600D03*
%TO.P,J2,3*%
%TO.N,EXP_TX*%
X240893600Y3911600D03*
%TO.P,J2,2*%
%TO.N,SCL*%
X240893600Y6451600D03*
D11*
%TO.P,J2,1*%
%TO.N,SDA*%
X240893600Y8991600D03*
%TD*%
D12*
%TO.P,SW2,8*%
%TO.N,A0_LORAWAN*%
X229666800Y20370800D03*
%TO.P,SW2,4*%
%TO.N,3_LDO_ENABLE*%
X237286800Y15290800D03*
%TO.P,SW2,C*%
%TO.N,+3V3*%
X229666800Y17830800D03*
X237286800Y17830800D03*
%TO.P,SW2,2*%
%TO.N,4_SERDAT*%
X229666800Y15290800D03*
D13*
%TO.P,SW2,1*%
%TO.N,A5_BUTTON_B*%
X237286800Y20370800D03*
%TD*%
D12*
%TO.P,R22,2*%
%TO.N,GND*%
X222148400Y27787600D03*
D14*
%TO.P,R22,1*%
%TO.N,A5_BUTTON_B*%
X209448400Y27787600D03*
%TD*%
%TO.P,R20,1*%
%TO.N,4_SERDAT*%
X222554800Y3302000D03*
D12*
%TO.P,R20,2*%
%TO.N,GND*%
X209854800Y3302000D03*
%TD*%
%TO.P,R18,2*%
%TO.N,GND*%
X222148400Y23114000D03*
D14*
%TO.P,R18,1*%
%TO.N,3_LDO_ENABLE*%
X209448400Y23114000D03*
%TD*%
D12*
%TO.P,R16,2*%
%TO.N,GND*%
X209854800Y7975600D03*
D14*
%TO.P,R16,1*%
%TO.N,A0_LORAWAN*%
X222554800Y7975600D03*
%TD*%
%TO.P,J4,3*%
%TO.N,N/C*%
%TA.AperFunction,ComponentPad*%
G36*
G01*
X210906600Y-10439600D02*
X209156600Y-10439600D01*
G75*
G02*
X208281600Y-9564600I0J875000D01*
G01*
X208281600Y-7814600D01*
G75*
G02*
X209156600Y-6939600I875000J0D01*
G01*
X210906600Y-6939600D01*
G75*
G02*
X211781600Y-7814600I0J-875000D01*
G01*
X211781600Y-9564600D01*
G75*
G02*
X210906600Y-10439600I-875000J0D01*
G01*
G37*
%TD.AperFunction*%
%TO.P,J4,2*%
%TO.N,GND*%
%TA.AperFunction,ComponentPad*%
G36*
G01*
X215731600Y-13189600D02*
X213731600Y-13189600D01*
G75*
G02*
X212981600Y-12439600I0J750000D01*
G01*
X212981600Y-10939600D01*
G75*
G02*
X213731600Y-10189600I750000J0D01*
G01*
X215731600Y-10189600D01*
G75*
G02*
X216481600Y-10939600I0J-750000D01*
G01*
X216481600Y-12439600D01*
G75*
G02*
X215731600Y-13189600I-750000J0D01*
G01*
G37*
%TD.AperFunction*%
D15*
%TO.P,J4,1*%
%TO.N,VBAT*%
X214731600Y-5689600D03*
%TD*%
D12*
%TO.P,R14,2*%
%TO.N,5_NEOPIXEL*%
X219100400Y56032400D03*
D14*
%TO.P,R14,1*%
%TO.N,Net-(J1-Pad3)*%
X219100400Y43332400D03*
%TD*%
D16*
%TO.P,SW3,1*%
%TO.N,~RESET*%
X235762800Y-1879600D03*
%TO.P,SW3,2*%
X235762800Y4620400D03*
%TO.P,SW3,3*%
%TO.N,GND*%
X231262800Y-1879600D03*
%TO.P,SW3,4*%
X231262800Y4620400D03*
%TD*%
D17*
%TO.P,J7,2*%
%TO.N,VBAT*%
X199774800Y-12700000D03*
D18*
%TO.P,J7,1*%
%TO.N,GND*%
X204774800Y-12700000D03*
%TD*%
D12*
%TO.P,R4,2*%
%TO.N,SCL*%
X219659200Y65026777D03*
D14*
%TO.P,R4,1*%
%TO.N,+3V3*%
X206959200Y65026777D03*
%TD*%
D12*
%TO.P,R2,2*%
%TO.N,SDA*%
X219659200Y69218240D03*
D14*
%TO.P,R2,1*%
%TO.N,+3V3*%
X206959200Y69218240D03*
%TD*%
D12*
%TO.P,R6,2*%
%TO.N,A3_BUTTON_A*%
X223773538Y56083200D03*
D14*
%TO.P,R6,1*%
%TO.N,+3V3*%
X223773538Y43383200D03*
%TD*%
D11*
%TO.P,J1,1*%
%TO.N,GND*%
X232994200Y75336400D03*
D10*
%TO.P,J1,2*%
%TO.N,VHI*%
X235534200Y75336400D03*
%TO.P,J1,3*%
%TO.N,Net-(J1-Pad3)*%
X238074200Y75336400D03*
%TO.P,J1,4*%
%TO.N,GND*%
X240614200Y75336400D03*
%TD*%
D19*
%TO.P,TP4,1*%
%TO.N,GND*%
X240596420Y74165460D03*
%TD*%
%TO.P,TP3,1*%
%TO.N,Net-(J1-Pad3)*%
X238046260Y74173080D03*
%TD*%
%TO.P,TP2,1*%
%TO.N,VHI*%
X235557060Y74112120D03*
%TD*%
%TO.P,TP1,1*%
%TO.N,GND*%
X232989120Y74137520D03*
%TD*%
D11*
%TO.P,J17,1*%
%TO.N,N/C*%
X225475800Y20599400D03*
D10*
%TO.P,J17,2*%
X225475800Y23139400D03*
%TO.P,J17,3*%
X225475800Y25679400D03*
%TO.P,J17,4*%
%TO.N,3_LDO_ENABLE*%
X225475800Y28219400D03*
%TO.P,J17,5*%
%TO.N,4_SERDAT*%
X225475800Y30759400D03*
%TD*%
D11*
%TO.P,J14,1*%
%TO.N,2_ESP_GPIO0*%
X225475800Y18059400D03*
D10*
%TO.P,J14,2*%
%TO.N,MISO*%
X222935800Y18059400D03*
%TO.P,J14,3*%
%TO.N,MOSI*%
X220395800Y18059400D03*
%TO.P,J14,4*%
%TO.N,SCK*%
X217855800Y18059400D03*
%TO.P,J14,5*%
%TO.N,A5_BUTTON_B*%
X215315800Y18059400D03*
%TO.P,J14,6*%
%TO.N,A4_LORA_CS*%
X212775800Y18059400D03*
%TO.P,J14,7*%
%TO.N,A3_BUTTON_A*%
X210235800Y18059400D03*
%TO.P,J14,8*%
%TO.N,A2_LORA_IRQ*%
X207695800Y18059400D03*
%TO.P,J14,9*%
%TO.N,A1_SD_CS*%
X205155800Y18059400D03*
%TO.P,J14,10*%
%TO.N,A0_LORAWAN*%
X202615800Y18059400D03*
%TO.P,J14,11*%
%TO.N,VHI*%
X200075800Y18059400D03*
%TO.P,J14,12*%
%TO.N,N/C*%
X197535800Y18059400D03*
%TO.P,J14,13*%
%TO.N,+3V3*%
X194995800Y18059400D03*
%TO.P,J14,14*%
%TO.N,~RESET*%
X192455800Y18059400D03*
%TD*%
D11*
%TO.P,J13,1*%
%TO.N,N/C*%
X225399600Y-1727200D03*
D10*
%TO.P,J13,2*%
%TO.N,MISO*%
X222859600Y-1727200D03*
%TO.P,J13,3*%
%TO.N,MOSI*%
X220319600Y-1727200D03*
%TO.P,J13,4*%
%TO.N,SCK*%
X217779600Y-1727200D03*
%TO.P,J13,5*%
%TO.N,N/C*%
X215239600Y-1727200D03*
%TO.P,J13,6*%
X212699600Y-1727200D03*
%TO.P,J13,7*%
X210159600Y-1727200D03*
%TO.P,J13,8*%
X207619600Y-1727200D03*
%TO.P,J13,9*%
X205079600Y-1727200D03*
%TO.P,J13,10*%
X202539600Y-1727200D03*
%TO.P,J13,11*%
X199999600Y-1727200D03*
%TO.P,J13,12*%
X197459600Y-1727200D03*
%TO.P,J13,13*%
%TO.N,3VESP*%
X194919600Y-1727200D03*
%TO.P,J13,14*%
%TO.N,N/C*%
X192379600Y-1727200D03*
%TD*%
D11*
%TO.P,J12,1*%
%TO.N,N/C*%
X192379600Y13512800D03*
D10*
%TO.P,J12,2*%
%TO.N,GND*%
X194919600Y13512800D03*
%TO.P,J12,3*%
%TO.N,N/C*%
X197459600Y13512800D03*
%TO.P,J12,4*%
%TO.N,10_ESP_CS*%
X199999600Y13512800D03*
%TO.P,J12,5*%
%TO.N,7_ESP_RESET*%
X202539600Y13512800D03*
%TO.P,J12,6*%
%TO.N,9_ESP_BUSY*%
X205079600Y13512800D03*
%TO.P,J12,7*%
%TO.N,2_ESP_GPIO0*%
X207619600Y13512800D03*
%TO.P,J12,8*%
%TO.N,N/C*%
X210159600Y13512800D03*
%TO.P,J12,9*%
X212699600Y13512800D03*
%TO.P,J12,10*%
X215239600Y13512800D03*
%TO.P,J12,11*%
X217779600Y13512800D03*
%TO.P,J12,12*%
X220319600Y13512800D03*
%TO.P,J12,13*%
%TO.N,ESP_RX*%
X222859600Y13512800D03*
%TO.P,J12,14*%
%TO.N,EXP_TX*%
X225399600Y13512800D03*
%TD*%
D11*
%TO.P,J3,1*%
%TO.N,VBAT*%
X192455800Y33299400D03*
D10*
%TO.P,J3,2*%
%TO.N,GND*%
X194995800Y33299400D03*
%TO.P,J3,3*%
%TO.N,N/C*%
X197535800Y33299400D03*
%TO.P,J3,4*%
%TO.N,13_LORA_SCK*%
X200075800Y33299400D03*
%TO.P,J3,5*%
%TO.N,12_LORA_MISO*%
X202615800Y33299400D03*
%TO.P,J3,6*%
%TO.N,11_LORA_MOSI*%
X205155800Y33299400D03*
%TO.P,J3,7*%
%TO.N,10_ESP_CS*%
X207695800Y33299400D03*
%TO.P,J3,8*%
%TO.N,9_ESP_BUSY*%
X210235800Y33299400D03*
%TO.P,J3,9*%
%TO.N,7_ESP_RESET*%
X212775800Y33299400D03*
%TO.P,J3,10*%
%TO.N,5_NEOPIXEL*%
X215315800Y33299400D03*
%TO.P,J3,11*%
%TO.N,SCL*%
X217855800Y33299400D03*
%TO.P,J3,12*%
%TO.N,SDA*%
X220395800Y33299400D03*
%TO.P,J3,13*%
%TO.N,ESP_RX*%
X222935800Y33299400D03*
%TO.P,J3,14*%
%TO.N,EXP_TX*%
X225475800Y33299400D03*
%TD*%
D11*
%TO.P,J5,1*%
%TO.N,Net-(J5-Pad1)*%
X234340400Y95808800D03*
%TD*%
D16*
%TO.P,SW1,1*%
%TO.N,A3_BUTTON_A*%
X195580000Y66954400D03*
%TO.P,SW1,2*%
X195580000Y73454400D03*
%TO.P,SW1,3*%
%TO.N,GND*%
X191080000Y66954400D03*
%TO.P,SW1,4*%
X191080000Y73454400D03*
%TD*%
D11*
%TO.P,J10,1*%
%TO.N,GND*%
X206197200Y85674200D03*
D10*
%TO.P,J10,2*%
%TO.N,+3V3*%
X208737200Y85674200D03*
%TO.P,J10,3*%
%TO.N,SCL*%
X211277200Y85674200D03*
%TO.P,J10,4*%
%TO.N,SDA*%
X213817200Y85674200D03*
%TD*%
D11*
%TO.P,J8,1*%
%TO.N,+3V3*%
X225247200Y37998400D03*
D10*
%TO.P,J8,2*%
%TO.N,GND*%
X222707200Y37998400D03*
%TO.P,J8,3*%
%TO.N,SCL*%
X220167200Y37998400D03*
%TO.P,J8,4*%
%TO.N,SDA*%
X217627200Y37998400D03*
%TO.P,J8,5*%
%TO.N,N/C*%
X215087200Y37998400D03*
%TO.P,J8,6*%
X212547200Y37998400D03*
%TO.P,J8,7*%
X210007200Y37998400D03*
%TD*%
D20*
%TO.N,+3V3*%
X231089200Y-11684000D03*
X231495600Y-4216400D03*
X194411600Y22148800D03*
X189636400Y22758400D03*
X190601600Y38201600D03*
X206197200Y38658800D03*
X206806800Y43332400D03*
X223824800Y47193200D03*
X222859600Y85648800D03*
X222402400Y77470000D03*
X217170000Y77470000D03*
X215900000Y88188800D03*
X228244400Y52120800D03*
X228295200Y58318400D03*
X228092000Y48971200D03*
X210769200Y68884800D03*
X210870800Y65074800D03*
X211074000Y60248800D03*
X239420400Y16205200D03*
X239826800Y11125200D03*
X243738400Y10363200D03*
X207670400Y89560400D03*
X237947200Y36372800D03*
X238785400Y18262600D03*
X210261200Y76098400D03*
%TO.N,GND*%
X203758800Y-8331200D03*
X201828400Y-8331200D03*
X201066400Y-3911600D03*
X187299600Y152400D03*
X232359200Y-7112000D03*
X232359200Y-12446000D03*
X242925600Y19761200D03*
X242214400Y12395200D03*
X230886000Y11633200D03*
X187807600Y11125200D03*
X194868800Y36576000D03*
X195986400Y3606800D03*
X199237600Y86055200D03*
X198424800Y91744800D03*
X207568800Y93319600D03*
X221335600Y79654400D03*
X220929200Y93268800D03*
X232562400Y79095600D03*
X234035600Y77266800D03*
X240690400Y76352400D03*
X230276400Y54864000D03*
X230124000Y58420000D03*
X192735200Y43738800D03*
X192735200Y56794400D03*
X192176400Y62382400D03*
X232765600Y59944000D03*
X223418400Y40487600D03*
X230276400Y40640000D03*
X195021200Y30226000D03*
X191109600Y77317600D03*
X217271600Y61518800D03*
X240690400Y21844000D03*
X239826800Y34696400D03*
X230428800Y35102800D03*
X188925200Y38252400D03*
X189585600Y39573200D03*
X216458800Y56184800D03*
X186436000Y7467600D03*
X187299600Y-2844800D03*
%TO.N,SDA*%
X236575600Y-14884400D03*
X237947200Y8686800D03*
X239674400Y17627600D03*
X213715600Y91287600D03*
X220421200Y35356800D03*
X235305600Y35814000D03*
X235661200Y32918400D03*
X239420400Y31851600D03*
X219252800Y74472800D03*
X214172800Y75336400D03*
X217779600Y35509200D03*
%TO.N,SCL*%
X229057200Y-12700000D03*
X238150400Y5994400D03*
X241350800Y15748000D03*
X243941600Y17729200D03*
X220421200Y46482000D03*
X243840000Y43332400D03*
X210362800Y90932000D03*
X225247200Y45770800D03*
X224942400Y64770000D03*
X214884000Y66243200D03*
X229971600Y-9652000D03*
X238086800Y-9458390D03*
%TO.N,LORA_DIO1*%
X227584000Y81076800D03*
X227076000Y68478400D03*
%TO.N,MISO*%
X242062000Y69850000D03*
X203708000Y70256400D03*
X223469200Y26314400D03*
X236778800Y27635200D03*
X203301600Y65024000D03*
X241249200Y55118000D03*
X235762800Y54711600D03*
%TO.N,MOSI*%
X226974400Y51206400D03*
X226618800Y58216800D03*
X210515200Y59080400D03*
X210007200Y61468000D03*
X219303600Y20878800D03*
X228346000Y22555200D03*
%TO.N,SCK*%
X214172800Y54356000D03*
X202336400Y55778400D03*
X202641200Y43738800D03*
X219151200Y26466800D03*
X205028800Y26720800D03*
X203149200Y39166800D03*
X214071200Y57048400D03*
%TO.N,3VESP*%
X188518800Y-7467600D03*
X189179200Y-50800D03*
X193649600Y63500000D03*
X194005200Y61214000D03*
X201422000Y67970400D03*
X200050400Y69799200D03*
X187248800Y33680400D03*
X186334400Y8839200D03*
X191008000Y40640000D03*
X191785200Y54914800D03*
X198018400Y67767200D03*
X197205600Y63703200D03*
%TO.N,ESP_RX*%
X238963200Y9601200D03*
X239014000Y2032000D03*
X223621600Y34798000D03*
X232968800Y33324800D03*
X231902000Y9753600D03*
X223113600Y9906000D03*
X222605600Y31496000D03*
X199186800Y30886400D03*
X197967600Y39166800D03*
%TO.N,EXP_TX*%
X234325200Y3708400D03*
X234340400Y13563600D03*
X234797600Y31546800D03*
%TO.N,~RESET*%
X193446400Y6451600D03*
%TO.N,Net-(J1-Pad3)*%
X220675200Y57251600D03*
X220421200Y48463200D03*
X219202000Y47396400D03*
X235762800Y55829200D03*
X235762800Y55829200D03*
%TO.N,10_ESP_CS*%
X196545200Y15341600D03*
X196285799Y23108599D03*
X204571600Y39166800D03*
X202438000Y69545200D03*
X202844400Y64008000D03*
X204419200Y43789600D03*
X205892400Y63195200D03*
X207518000Y25349200D03*
%TO.N,9_ESP_BUSY*%
X206451200Y31496000D03*
X208432400Y55067200D03*
X203809600Y55676800D03*
X202234800Y57099200D03*
%TO.N,7_ESP_RESET*%
X212445600Y21234400D03*
X203809600Y20320000D03*
X211480400Y42214800D03*
X215442800Y42316400D03*
X215646000Y61671200D03*
%TO.N,5_NEOPIXEL*%
X218897200Y36830000D03*
X215239600Y36118800D03*
X217779600Y48717200D03*
X221691200Y51714400D03*
X221589600Y55575200D03*
%TO.N,2_ESP_GPIO0*%
X225247200Y15697200D03*
X207619600Y15138400D03*
X216306400Y40233600D03*
X216916000Y30581600D03*
X227228400Y29311600D03*
%TO.N,ESP_MISO*%
X200609200Y62230000D03*
X199288400Y46177200D03*
X194005200Y45567600D03*
X193954400Y43281600D03*
%TO.N,VBAT*%
X217525600Y-13817600D03*
X188010800Y31445200D03*
X195478400Y-11328400D03*
%TO.N,13_LORA_SCK*%
X189687200Y80365600D03*
X191160400Y31343600D03*
%TO.N,11_LORA_MOSI*%
X204470000Y46482000D03*
X200456800Y46177200D03*
X200863200Y36271200D03*
X205028800Y36169600D03*
X203962000Y82600800D03*
%TO.N,12_LORA_MISO*%
X208584800Y80873600D03*
X207111600Y37236400D03*
X203047600Y37134800D03*
%TO.N,A5_BUTTON_B*%
X227177600Y18338800D03*
X226771200Y16510000D03*
X215341200Y15849600D03*
X213817200Y28803600D03*
%TO.N,A4_LORA_CS*%
X209346800Y89814400D03*
X207873600Y94640400D03*
X199745600Y93827600D03*
X199644000Y76454000D03*
X188417200Y75742800D03*
X188264800Y34747200D03*
X211429600Y34798000D03*
%TO.N,A3_BUTTON_A*%
X221843600Y49834800D03*
X223672400Y72694800D03*
X221645801Y16820201D03*
%TO.N,A2_LORA_IRQ*%
X243738400Y79197200D03*
X243382800Y60045600D03*
X240030000Y59639200D03*
X207518000Y23926800D03*
X242366800Y25298400D03*
%TO.N,VHI*%
X243789200Y-14732000D03*
X243382800Y-1270000D03*
X199999600Y1168400D03*
X198323200Y7620000D03*
X190347600Y8432800D03*
X190703200Y20675600D03*
X199440800Y20675600D03*
X236067600Y71678800D03*
X244805200Y69799200D03*
%TO.N,3_LDO_ENABLE*%
X235864400Y16256000D03*
X235712000Y28651200D03*
X217982800Y29006800D03*
X217170000Y25654000D03*
X215025000Y22109400D03*
X213817200Y25298400D03*
%TO.N,A0_LORAWAN*%
X234289600Y63957200D03*
X233680000Y20574000D03*
X201168000Y9956800D03*
X228041200Y19862800D03*
X227838000Y8229600D03*
%TO.N,4_SERDAT*%
X233375200Y14732000D03*
X233019600Y2641600D03*
X232054400Y30276800D03*
X231800400Y16357600D03*
%TO.N,A1_SD_CS*%
X226314000Y49784000D03*
X213918800Y53035200D03*
X213817200Y20015200D03*
X205079600Y19812000D03*
X225856800Y52882800D03*
%TD*%
D21*
%TO.N,+3V3*%
X231089200Y-11684000D02*
X231089200Y-4622800D01*
X231089200Y-4622800D02*
X231495600Y-4216400D01*
X194995800Y18059400D02*
X194995800Y21767800D01*
X194995800Y21767800D02*
X194614800Y22148800D01*
X194614800Y22148800D02*
X194411600Y22148800D01*
X189636400Y22758400D02*
X189636400Y29108400D01*
X189636400Y29108400D02*
X189636400Y34696400D01*
X189636400Y34696400D02*
X189636400Y37236400D01*
X189636400Y37236400D02*
X190601600Y38201600D01*
X206197200Y38658800D02*
X206197200Y42722800D01*
X206197200Y42722800D02*
X206806800Y43332400D01*
X223773538Y43383200D02*
X223773538Y47141938D01*
X223773538Y47141938D02*
X223824800Y47193200D01*
X225247200Y41909538D02*
X223773538Y43383200D01*
X225247200Y37998400D02*
X225247200Y41909538D01*
X208737200Y85674200D02*
X208737200Y87477600D01*
X222859600Y85648800D02*
X222859600Y77978000D01*
X222859600Y77978000D02*
X222402400Y77520800D01*
X222402400Y77520800D02*
X222402400Y77470000D01*
X217170000Y77470000D02*
X216712800Y77927200D01*
X216712800Y77927200D02*
X216712800Y87376000D01*
X216712800Y87376000D02*
X215900000Y88188800D01*
X228244400Y52120800D02*
X228244400Y58267600D01*
X228244400Y58267600D02*
X228295200Y58318400D01*
X228092000Y51968400D02*
X228244400Y52120800D01*
X228092000Y48971200D02*
X228092000Y51968400D01*
X206959200Y65026777D02*
X206959200Y69218240D01*
X210769200Y68884800D02*
X210769200Y65176400D01*
X210769200Y65176400D02*
X210870800Y65074800D01*
X211074000Y64871600D02*
X210870800Y65074800D01*
X211074000Y60248800D02*
X211074000Y64871600D01*
X239420400Y16205200D02*
X239420400Y11531600D01*
X239420400Y11531600D02*
X239826800Y11125200D01*
X243738400Y10363200D02*
X243738400Y1117600D01*
X243738400Y1117600D02*
X242366800Y-254000D01*
X242366800Y-2235200D02*
X240893600Y-3708400D01*
X242366800Y-254000D02*
X242366800Y-2235200D01*
X208737200Y87477600D02*
X208737200Y88493600D01*
X208737200Y88493600D02*
X207670400Y89560400D01*
X237947200Y36372800D02*
X237947200Y22758400D01*
X237947200Y22758400D02*
X238760000Y21945600D01*
X238760000Y21945600D02*
X238760000Y18643600D01*
X238785400Y18618200D02*
X238760000Y18643600D01*
X238785400Y18262600D02*
X238785400Y18618200D01*
X210718400Y68935600D02*
X210769200Y68884800D01*
X210261200Y76098400D02*
X210261200Y69138800D01*
X210515200Y68884800D02*
X210769200Y68884800D01*
X210261200Y69138800D02*
X210515200Y68884800D01*
%TO.N,GND*%
X204774800Y-12700000D02*
X204774800Y-9347200D01*
X204774800Y-9347200D02*
X203758800Y-8331200D01*
X201828400Y-8331200D02*
X201828400Y-4673600D01*
X201828400Y-4673600D02*
X201066400Y-3911600D01*
X232359200Y-7112000D02*
X232359200Y-12446000D01*
X232359200Y-7112000D02*
X232359200Y-5842000D01*
X232359200Y-5842000D02*
X232765600Y-5435600D01*
X232765600Y-3382400D02*
X231262800Y-1879600D01*
X232765600Y-5435600D02*
X232765600Y-3382400D01*
X242925600Y19761200D02*
X242925600Y12750800D01*
X242925600Y12750800D02*
X242570000Y12395200D01*
X242570000Y12395200D02*
X242214400Y12395200D01*
X230886000Y4997200D02*
X231262800Y4620400D01*
X230886000Y11633200D02*
X230886000Y4997200D01*
X231262800Y4620400D02*
X231262800Y-1879600D01*
X209854800Y7975600D02*
X209854800Y3302000D01*
X222148400Y27787600D02*
X222148400Y23114000D01*
X187452000Y10769600D02*
X187807600Y11125200D01*
X194868800Y33426400D02*
X194995800Y33299400D01*
X194868800Y36576000D02*
X194868800Y33426400D01*
X194919600Y4673600D02*
X194919600Y13512800D01*
X195986400Y3606800D02*
X194919600Y4673600D01*
X191080000Y73454400D02*
X191080000Y66954400D01*
X199237600Y86055200D02*
X198678800Y86614000D01*
X198678800Y86614000D02*
X198678800Y91490800D01*
X198678800Y91490800D02*
X198424800Y91744800D01*
X206197200Y85674200D02*
X206197200Y91948000D01*
X206197200Y91948000D02*
X207568800Y93319600D01*
X221335600Y79654400D02*
X221335600Y91897200D01*
X221335600Y91897200D02*
X221335600Y92811600D01*
X221335600Y92811600D02*
X221335600Y92862400D01*
X221335600Y92862400D02*
X220929200Y93268800D01*
X232562400Y75768200D02*
X232994200Y75336400D01*
X232562400Y79095600D02*
X232562400Y75768200D01*
X232994200Y75336400D02*
X232994200Y76225400D01*
X232994200Y76225400D02*
X234035600Y77266800D01*
X240690400Y75412600D02*
X240614200Y75336400D01*
X240690400Y76352400D02*
X240690400Y75412600D01*
X230276400Y54864000D02*
X230276400Y58267600D01*
X230276400Y58267600D02*
X230124000Y58420000D01*
X192735200Y43738800D02*
X192735200Y56794400D01*
X192176400Y65858000D02*
X191080000Y66954400D01*
X192176400Y62382400D02*
X192176400Y65858000D01*
X232994200Y75336400D02*
X232994200Y60172600D01*
X232994200Y60172600D02*
X232765600Y59944000D01*
X222707200Y37998400D02*
X222707200Y39776400D01*
X222707200Y39776400D02*
X223418400Y40487600D01*
X230276400Y40640000D02*
X230276400Y54864000D01*
X195021200Y33274000D02*
X194995800Y33299400D01*
X195021200Y30226000D02*
X195021200Y33274000D01*
X188925200Y38252400D02*
X188976000Y38201600D01*
X191109600Y73484000D02*
X191080000Y73454400D01*
X191109600Y77317600D02*
X191109600Y73484000D01*
X240690400Y21844000D02*
X240690400Y33934400D01*
X240690400Y33934400D02*
X239928400Y34696400D01*
X239928400Y34696400D02*
X239826800Y34696400D01*
X230428800Y40487600D02*
X230276400Y40640000D01*
X230428800Y35102800D02*
X230428800Y40487600D01*
X188925200Y38912800D02*
X189585600Y39573200D01*
X188925200Y38252400D02*
X188925200Y38912800D01*
X216865200Y61112400D02*
X217271600Y61518800D01*
X216458800Y56184800D02*
X216865200Y56591200D01*
X216865200Y56591200D02*
X216865200Y61112400D01*
X240614200Y74183240D02*
X240596420Y74165460D01*
X240614200Y75336400D02*
X240614200Y74183240D01*
X232994200Y74142600D02*
X232989120Y74137520D01*
X232994200Y75336400D02*
X232994200Y74142600D01*
X187452000Y8483600D02*
X187452000Y10769600D01*
X186436000Y7467600D02*
X187452000Y8483600D01*
X187299600Y152400D02*
X187299600Y-2844800D01*
D22*
%TO.N,SDA*%
X236575600Y-14884400D02*
X237286800Y-14173200D01*
X237286800Y-14173200D02*
X237286800Y8026400D01*
X237286800Y8026400D02*
X237947200Y8686800D01*
X240893600Y8991600D02*
X240893600Y11226800D01*
X240893600Y11226800D02*
X240538000Y11582400D01*
X240538000Y11582400D02*
X240538000Y16408400D01*
X240538000Y16408400D02*
X239674400Y17272000D01*
X239674400Y17272000D02*
X239674400Y17627600D01*
X213715600Y85775800D02*
X213817200Y85674200D01*
X213715600Y91287600D02*
X213715600Y85775800D01*
X220421200Y33324800D02*
X220395800Y33299400D01*
X220421200Y35356800D02*
X220421200Y33324800D01*
X235305600Y35814000D02*
X235305600Y33274000D01*
X235305600Y33274000D02*
X235661200Y32918400D01*
X239420400Y31851600D02*
X239623600Y31648400D01*
X239623600Y31648400D02*
X239623600Y19405600D01*
X239674400Y19354800D02*
X239674400Y17627600D01*
X239623600Y19405600D02*
X239674400Y19354800D01*
X219659200Y69218240D02*
X219659200Y74066400D01*
X219659200Y74066400D02*
X219252800Y74472800D01*
X214172800Y85318600D02*
X213817200Y85674200D01*
X214172800Y75336400D02*
X214172800Y85318600D01*
X217627200Y56845200D02*
X218287600Y57505600D01*
X218287600Y67846640D02*
X219659200Y69218240D01*
X218287600Y57505600D02*
X218287600Y67846640D01*
X217627200Y56845200D02*
X217627200Y49733200D01*
X217627200Y49733200D02*
X216916000Y49022000D01*
X216916000Y49022000D02*
X216916000Y40995600D01*
X217106401Y38519199D02*
X217627200Y37998400D01*
X217106401Y40805199D02*
X217106401Y38519199D01*
X216916000Y40995600D02*
X217106401Y40805199D01*
X217627200Y37998400D02*
X217627200Y35661600D01*
X217627200Y35661600D02*
X217779600Y35509200D01*
%TO.N,SCL*%
X238150400Y5994400D02*
X237886810Y5730810D01*
X241350800Y12074798D02*
X241503200Y11922398D01*
X241350800Y15748000D02*
X241350800Y12074798D01*
X241503200Y11922398D02*
X241503200Y11633200D01*
X241503200Y11633200D02*
X242468400Y10668000D01*
X242468400Y10668000D02*
X242468400Y7264400D01*
X241655600Y6451600D02*
X240893600Y6451600D01*
X242468400Y7264400D02*
X241655600Y6451600D01*
X220167200Y37998400D02*
X220167200Y41910000D01*
X220167200Y41910000D02*
X220421200Y42164000D01*
X220421200Y42164000D02*
X220421200Y46482000D01*
X243840000Y39928800D02*
X243941600Y39827200D01*
X243840000Y43332400D02*
X243840000Y39928800D01*
X243941600Y17729200D02*
X243941600Y39827200D01*
X211277200Y85674200D02*
X211277200Y90017600D01*
X211277200Y90017600D02*
X210362800Y90932000D01*
X220167200Y37998400D02*
X220167200Y36677600D01*
X217855800Y34366200D02*
X217855800Y33299400D01*
X220167200Y36677600D02*
X217855800Y34366200D01*
X211277200Y85674200D02*
X211277200Y78028800D01*
X211277200Y78028800D02*
X212394800Y76911200D01*
X225247200Y45770800D02*
X224739200Y46278800D01*
X224739200Y46278800D02*
X224739200Y54711600D01*
X224739200Y54711600D02*
X225298000Y55270400D01*
X225298000Y55270400D02*
X225298000Y64414400D01*
X225298000Y64414400D02*
X224942400Y64770000D01*
X212394800Y76911200D02*
X212547200Y76911200D01*
X212547200Y76911200D02*
X213207600Y76250800D01*
X213207600Y76250800D02*
X213207600Y73761600D01*
X213207600Y73761600D02*
X214426800Y72542400D01*
X214426800Y72542400D02*
X214426800Y66700400D01*
X214426800Y66700400D02*
X214884000Y66243200D01*
X229057200Y-12700000D02*
X229666800Y-12090400D01*
X229666800Y-12090400D02*
X229666800Y-9956800D01*
X229666800Y-9956800D02*
X229971600Y-9652000D01*
X238086800Y-8185180D02*
X237886810Y-7985190D01*
X238086800Y-9458390D02*
X238086800Y-8185180D01*
X237886810Y5730810D02*
X237886810Y-7985190D01*
%TO.N,LORA_DIO1*%
X227584000Y81076800D02*
X227025200Y80518000D01*
X227025200Y80518000D02*
X227025200Y68529200D01*
X227025200Y68529200D02*
X227076000Y68478400D01*
%TO.N,MISO*%
X241249200Y55118000D02*
X241249200Y56134000D01*
X241249200Y56134000D02*
X241249200Y60096400D01*
X241249200Y60096400D02*
X241249200Y61671200D01*
X241249200Y61671200D02*
X242620800Y63042800D01*
X242620800Y63042800D02*
X242620800Y69291200D01*
X242620800Y69291200D02*
X242062000Y69850000D01*
X203708000Y70256400D02*
X203708000Y65176400D01*
X223469200Y18592800D02*
X222935800Y18059400D01*
X223469200Y26314400D02*
X223469200Y18592800D01*
X222859600Y-1371600D02*
X222859600Y-1727200D01*
X224109601Y-121599D02*
X222859600Y-1371600D01*
X222935800Y18059400D02*
X224109601Y16885599D01*
X224109601Y16885599D02*
X224109601Y-121599D01*
X236982000Y27838400D02*
X236778800Y27635200D01*
X203555600Y65024000D02*
X203708000Y65176400D01*
X203301600Y65024000D02*
X203555600Y65024000D01*
X235762800Y54711600D02*
X235762800Y50901600D01*
X236982000Y49682400D02*
X236982000Y49479200D01*
X235762800Y50901600D02*
X236982000Y49682400D01*
X236982000Y49479200D02*
X236982000Y27838400D01*
%TO.N,MOSI*%
X226974400Y51206400D02*
X226974400Y54965600D01*
X226974400Y54965600D02*
X226974400Y57200800D01*
X226974400Y57200800D02*
X226974400Y57861200D01*
X226974400Y57861200D02*
X226618800Y58216800D01*
X210007200Y59588400D02*
X210515200Y59080400D01*
X210007200Y61468000D02*
X210007200Y59588400D01*
X220395800Y18059400D02*
X220395800Y17500600D01*
X219069599Y16174399D02*
X219069599Y11918001D01*
X220395800Y17500600D02*
X219069599Y16174399D01*
X219069599Y11918001D02*
X219100400Y11887200D01*
X219100400Y-508000D02*
X220319600Y-1727200D01*
X219100400Y11887200D02*
X219100400Y-508000D01*
X220395800Y18059400D02*
X219303600Y19151600D01*
X219303600Y19151600D02*
X219303600Y20878800D01*
X228346000Y22555200D02*
X228346000Y45466000D01*
X227114001Y51066799D02*
X226974400Y51206400D01*
X227114001Y46697999D02*
X227114001Y51066799D01*
X228346000Y45466000D02*
X227114001Y46697999D01*
%TO.N,SCK*%
X202336400Y55778400D02*
X202336400Y44094400D01*
X202336400Y44094400D02*
X202336400Y44043600D01*
X202336400Y44043600D02*
X202641200Y43738800D01*
X218440000Y-1066800D02*
X217779600Y-1727200D01*
X218440000Y9601200D02*
X218440000Y-1066800D01*
X216509600Y11531600D02*
X218440000Y9601200D01*
X217855800Y18059400D02*
X217855800Y15671800D01*
X217855800Y15671800D02*
X216814400Y14630400D01*
X216509600Y14122400D02*
X216509600Y11531600D01*
X216814400Y14427200D02*
X216509600Y14122400D01*
X216814400Y14630400D02*
X216814400Y14427200D01*
X217855800Y18059400D02*
X217855800Y22783800D01*
X217855800Y22783800D02*
X219608400Y24536400D01*
X219608400Y24536400D02*
X219608400Y26009600D01*
X219608400Y26009600D02*
X219151200Y26466800D01*
X205028800Y26720800D02*
X205028800Y29108400D01*
X205028800Y29108400D02*
X203860400Y30276800D01*
X203865801Y38450199D02*
X203149200Y39166800D01*
X203860400Y30276800D02*
X203865801Y30282201D01*
X203865801Y30282201D02*
X203865801Y38450199D01*
X214071200Y54457600D02*
X214172800Y54356000D01*
X214071200Y57048400D02*
X214071200Y54457600D01*
D21*
%TO.N,3VESP*%
X188518800Y-7467600D02*
X188518800Y-711200D01*
X188518800Y-711200D02*
X189179200Y-50800D01*
X193649600Y63500000D02*
X193649600Y61569600D01*
X193649600Y61569600D02*
X194005200Y61214000D01*
X201422000Y67970400D02*
X201422000Y68427600D01*
X201422000Y68427600D02*
X200050400Y69799200D01*
X187248800Y33680400D02*
X186740800Y33172400D01*
X186740800Y33172400D02*
X186740800Y23063200D01*
X186740800Y23063200D02*
X186740800Y11785600D01*
X186740800Y11785600D02*
X186232800Y11277600D01*
X186232800Y11277600D02*
X186232800Y8940800D01*
X186232800Y8940800D02*
X186334400Y8839200D01*
X191008000Y40640000D02*
X191871600Y41503600D01*
X191785199Y41590001D02*
X191785199Y44312799D01*
X191871600Y41503600D02*
X191785199Y41590001D01*
X191785199Y44312799D02*
X191835190Y44362790D01*
X191835190Y44362790D02*
X191835190Y54864810D01*
X191835190Y54864810D02*
X191785200Y54914800D01*
X198018400Y67767200D02*
X197612000Y67360800D01*
X197612000Y67360800D02*
X197612000Y64109600D01*
X197612000Y64109600D02*
X197205600Y63703200D01*
D22*
%TO.N,ESP_RX*%
X238963200Y9601200D02*
X238963200Y2082800D01*
X238963200Y2082800D02*
X239014000Y2032000D01*
X222935800Y33299400D02*
X222935800Y34112200D01*
X222935800Y34112200D02*
X223621600Y34798000D01*
X232968800Y33324800D02*
X232968800Y21234400D01*
X232968800Y21234400D02*
X232816400Y21082000D01*
X232816400Y21082000D02*
X232816400Y16002000D01*
X232816400Y16002000D02*
X232359200Y15544800D01*
X232359200Y15544800D02*
X232359200Y10210800D01*
X232359200Y10210800D02*
X231902000Y9753600D01*
X222859600Y13512800D02*
X222859600Y10160000D01*
X222859600Y10160000D02*
X223113600Y9906000D01*
X222935800Y33299400D02*
X222935800Y31826200D01*
X222935800Y31826200D02*
X222605600Y31496000D01*
X199186800Y30886400D02*
X198882000Y31191200D01*
X198825799Y38308601D02*
X197967600Y39166800D01*
X198882000Y31191200D02*
X198825799Y31247401D01*
X198825799Y31247401D02*
X198825799Y38308601D01*
%TO.N,EXP_TX*%
X234325200Y3708400D02*
X234325200Y13548400D01*
X234325200Y13548400D02*
X234340400Y13563600D01*
X234797600Y14020800D02*
X234340400Y13563600D01*
X234797600Y31546800D02*
X234797600Y14020800D01*
%TO.N,~RESET*%
X235762800Y-1879600D02*
X235762800Y4620400D01*
X193446400Y6451600D02*
X193294000Y6451600D01*
X193294000Y6451600D02*
X192735200Y7010400D01*
X192735200Y7010400D02*
X192735200Y11176000D01*
X193669599Y16845601D02*
X192455800Y18059400D01*
X193669599Y12110399D02*
X193669599Y16845601D01*
X192735200Y11176000D02*
X193669599Y12110399D01*
%TO.N,Net-(J1-Pad3)*%
X238074200Y75336400D02*
X238074200Y66573400D01*
X238074200Y66573400D02*
X237236000Y65735200D01*
X220675200Y57251600D02*
X220675200Y48717200D01*
X220675200Y48717200D02*
X220421200Y48463200D01*
X219202000Y43434000D02*
X219100400Y43332400D01*
X219202000Y47396400D02*
X219202000Y43434000D01*
D21*
X238074200Y74201020D02*
X238046260Y74173080D01*
X238074200Y75336400D02*
X238074200Y74201020D01*
D22*
X237236000Y65735200D02*
X237236000Y58470800D01*
X237236000Y58470800D02*
X235762800Y56997600D01*
X235762800Y56997600D02*
X235762800Y55829200D01*
X235762800Y55829200D02*
X235762800Y55829200D01*
X235762800Y55829200D02*
X235762800Y55829200D01*
%TO.N,10_ESP_CS*%
X207695800Y33299400D02*
X207695800Y29032200D01*
X196285799Y15601001D02*
X196545200Y15341600D01*
X196285799Y23108599D02*
X196285799Y15601001D01*
X204571600Y39166800D02*
X205181200Y38557200D01*
X205181200Y38557200D02*
X205181200Y37541200D01*
X205181200Y37541200D02*
X206451200Y36271200D01*
X206451200Y34544000D02*
X207695800Y33299400D01*
X206451200Y36271200D02*
X206451200Y34544000D01*
X202438000Y69545200D02*
X202438000Y64414400D01*
X202438000Y64414400D02*
X202844400Y64008000D01*
X204419200Y43789600D02*
X205892400Y45262800D01*
X205892400Y50647600D02*
X205841600Y50698400D01*
X205892400Y45262800D02*
X205892400Y50647600D01*
X205841600Y50698400D02*
X205841600Y63144400D01*
X205841600Y63144400D02*
X205892400Y63195200D01*
X207695800Y29032200D02*
X207695800Y25527000D01*
X207695800Y25527000D02*
X207518000Y25349200D01*
%TO.N,9_ESP_BUSY*%
X205079600Y13512800D02*
X205079600Y14732000D01*
X206445799Y28031399D02*
X206248000Y28229198D01*
X205079600Y14732000D02*
X206445799Y16098199D01*
X206445799Y16098199D02*
X206445799Y28031399D01*
X206248000Y28229198D02*
X206248000Y31292800D01*
X206248000Y31292800D02*
X206451200Y31496000D01*
X210235800Y33299400D02*
X210235800Y34823400D01*
X210235800Y34823400D02*
X208686400Y36372800D01*
X208686400Y38557200D02*
X208991200Y38862000D01*
X208686400Y36372800D02*
X208686400Y38557200D01*
X209020798Y38862000D02*
X209143600Y38984802D01*
X208991200Y38862000D02*
X209020798Y38862000D01*
X209143600Y38984802D02*
X209143600Y41452800D01*
X209143600Y41452800D02*
X209143600Y41910000D01*
X209143600Y41910000D02*
X208432400Y42621200D01*
X208432400Y42621200D02*
X208432400Y45720000D01*
X208432400Y45720000D02*
X208432400Y55067200D01*
X203809600Y55676800D02*
X203657200Y55676800D01*
X203657200Y55676800D02*
X202234800Y57099200D01*
%TO.N,7_ESP_RESET*%
X203865801Y14839001D02*
X202539600Y13512800D01*
X203865801Y18659401D02*
X203865801Y14839001D01*
X203809600Y18715602D02*
X203865801Y18659401D01*
X203809600Y20320000D02*
X203809600Y18715602D01*
X212775800Y33299400D02*
X212775800Y35280600D01*
X212775800Y35280600D02*
X211378800Y36677600D01*
X211257201Y37438397D02*
X211257201Y42398001D01*
X211378800Y36677600D02*
X211378800Y37316798D01*
X211378800Y37316798D02*
X211257201Y37438397D01*
X211257201Y42398001D02*
X211440402Y42214800D01*
X211440402Y42214800D02*
X211480400Y42214800D01*
X216001600Y42875200D02*
X215442800Y42316400D01*
X216001600Y54254400D02*
X216001600Y42875200D01*
X215646000Y61671200D02*
X215646000Y54610000D01*
X215646000Y54610000D02*
X216001600Y54254400D01*
X212191600Y31597600D02*
X212191600Y21488400D01*
X212191600Y21488400D02*
X212445600Y21234400D01*
X212775800Y33299400D02*
X212775800Y32181800D01*
X212775800Y32181800D02*
X212191600Y31597600D01*
%TO.N,5_NEOPIXEL*%
X218897200Y36830000D02*
X218897200Y41198800D01*
X218897200Y41198800D02*
X218795600Y41198800D01*
X218795600Y41198800D02*
X217678000Y42316400D01*
X217678000Y42316400D02*
X217678000Y48564800D01*
X215239600Y33375600D02*
X215315800Y33299400D01*
X215239600Y36118800D02*
X215239600Y33375600D01*
X217678000Y48564800D02*
X217678000Y48615600D01*
X217678000Y48615600D02*
X217779600Y48717200D01*
X221691200Y51714400D02*
X221691200Y55473600D01*
X221691200Y55473600D02*
X221589600Y55575200D01*
%TO.N,2_ESP_GPIO0*%
X225475800Y18059400D02*
X225475800Y15925800D01*
X225475800Y15925800D02*
X225247200Y15697200D01*
X207619600Y15138400D02*
X207619600Y13512800D01*
X216605799Y33899401D02*
X216605799Y32466601D01*
X216377199Y34128001D02*
X216605799Y33899401D01*
X216306400Y40233600D02*
X216377199Y40162801D01*
X216377199Y40162801D02*
X216377199Y34128001D01*
X216605799Y32466601D02*
X216605799Y30891801D01*
X216605799Y30891801D02*
X216916000Y30581600D01*
X227228400Y29311600D02*
X227228400Y20015200D01*
X225475800Y18262600D02*
X225475800Y18059400D01*
X227228400Y20015200D02*
X225475800Y18262600D01*
%TO.N,ESP_MISO*%
X200609200Y62230000D02*
X200050400Y61671200D01*
X200050400Y61671200D02*
X200050400Y47752000D01*
X200050400Y47752000D02*
X199288400Y46990000D01*
X199288400Y46990000D02*
X199288400Y46177200D01*
X194005200Y45567600D02*
X194005200Y43332400D01*
X194005200Y43332400D02*
X193954400Y43281600D01*
D21*
%TO.N,VBAT*%
X217525600Y-13817600D02*
X217525600Y-7670800D01*
X215544400Y-5689600D02*
X214731600Y-5689600D01*
X217525600Y-7670800D02*
X215544400Y-5689600D01*
X188010800Y31445200D02*
X188010800Y14122400D01*
X188010800Y14122400D02*
X188010800Y13055600D01*
X188010800Y13055600D02*
X189230000Y11836400D01*
X189230000Y11836400D02*
X189230000Y1676400D01*
X189230000Y1676400D02*
X190246000Y660400D01*
X190246000Y-1879600D02*
X190347600Y-1981200D01*
X190246000Y660400D02*
X190246000Y-1879600D01*
X190347600Y-1981200D02*
X190347600Y-7874000D01*
X190347600Y-7874000D02*
X192786000Y-10312400D01*
X192786000Y-10312400D02*
X194462400Y-10312400D01*
X194462400Y-10312400D02*
X195478400Y-11328400D01*
D22*
%TO.N,13_LORA_SCK*%
X189687200Y80365600D02*
X189687200Y74168000D01*
X189687200Y74168000D02*
X189382400Y73863200D01*
X189382400Y73863200D02*
X189382400Y41148000D01*
X189382400Y41081598D02*
X191973200Y38490798D01*
X189382400Y41148000D02*
X189382400Y41081598D01*
X191973200Y38490798D02*
X191973200Y37490400D01*
X191973200Y37490400D02*
X190703200Y36220400D01*
X190703200Y36220400D02*
X190703200Y31851600D01*
X190703200Y31851600D02*
X190703200Y31800800D01*
X190703200Y31800800D02*
X191160400Y31343600D01*
%TO.N,11_LORA_MOSI*%
X204978000Y46990000D02*
X204470000Y46482000D01*
X200456800Y46177200D02*
X200456800Y36830000D01*
X205130400Y33324800D02*
X205155800Y33299400D01*
X200456800Y36830000D02*
X200456800Y36677600D01*
X200456800Y36677600D02*
X200863200Y36271200D01*
X205028800Y33426400D02*
X205155800Y33299400D01*
X205028800Y36169600D02*
X205028800Y33426400D01*
X203962000Y82600800D02*
X203962000Y75895200D01*
X204978000Y74879200D02*
X204978000Y72491600D01*
X203962000Y75895200D02*
X204978000Y74879200D01*
X204978000Y72491600D02*
X204978000Y46990000D01*
%TO.N,12_LORA_MISO*%
X208584800Y80873600D02*
X209092800Y80365600D01*
X209092800Y80365600D02*
X209092800Y57607200D01*
X209092800Y57607200D02*
X208330800Y56845200D01*
X203047600Y37134800D02*
X202590400Y36677600D01*
X202590400Y33324800D02*
X202615800Y33299400D01*
X202590400Y36677600D02*
X202590400Y33324800D01*
X208330800Y56845200D02*
X208330800Y56388000D01*
X207822800Y37947600D02*
X207111600Y37236400D01*
X207635202Y43688000D02*
X207822800Y43688000D01*
X207365600Y43957602D02*
X207635202Y43688000D01*
X207822800Y43688000D02*
X207822800Y37947600D01*
X207365600Y55880000D02*
X207365600Y43957602D01*
X208330800Y56845200D02*
X207365600Y55880000D01*
%TO.N,A5_BUTTON_B*%
X215290400Y18034000D02*
X215315800Y18059400D01*
X227177600Y18338800D02*
X227177600Y16916400D01*
X227177600Y16916400D02*
X226771200Y16510000D01*
X215341200Y18034000D02*
X215315800Y18059400D01*
X215341200Y15849600D02*
X215341200Y18034000D01*
X215696800Y22910800D02*
X215950800Y22656800D01*
X215950800Y18694400D02*
X215315800Y18059400D01*
X215950800Y22656800D02*
X215950800Y18694400D01*
X213817200Y28803600D02*
X215696800Y26924000D01*
X215696800Y26924000D02*
X215696800Y26822400D01*
X215696800Y26822400D02*
X215696800Y22910800D01*
%TO.N,A4_LORA_CS*%
X209346800Y89814400D02*
X208635600Y90525600D01*
X208635600Y90525600D02*
X208635600Y93878400D01*
X208635600Y93878400D02*
X207873600Y94640400D01*
X199745600Y93827600D02*
X199745600Y87477600D01*
X199745600Y87477600D02*
X200304400Y86918800D01*
X200304400Y86918800D02*
X200304400Y77114400D01*
X200304400Y77114400D02*
X199644000Y76454000D01*
X188417200Y75742800D02*
X187909200Y75234800D01*
X187909200Y75234800D02*
X187909200Y35102800D01*
X187909200Y35102800D02*
X188264800Y34747200D01*
X211429600Y34798000D02*
X211429600Y33955602D01*
X211429600Y33955602D02*
X211485801Y33899401D01*
X211485801Y19349399D02*
X212775800Y18059400D01*
X211485801Y22854599D02*
X211485801Y19349399D01*
X211485801Y22854599D02*
X211485801Y22651399D01*
X211485801Y33899401D02*
X211485801Y22854599D01*
%TO.N,A3_BUTTON_A*%
X221843600Y49834800D02*
X221843600Y40182800D01*
X221645801Y33899401D02*
X221645801Y29672601D01*
X221417201Y34128001D02*
X221645801Y33899401D01*
X221843600Y40182800D02*
X221417201Y39756401D01*
X221417201Y39756401D02*
X221417201Y34128001D01*
X221645801Y29672601D02*
X220472000Y28498800D01*
X220472000Y28498800D02*
X220472000Y20066000D01*
X220472000Y20066000D02*
X221645801Y18892199D01*
X221645801Y18892199D02*
X221645801Y16820201D01*
X223672400Y56184338D02*
X223773538Y56083200D01*
X223672400Y72694800D02*
X223672400Y56184338D01*
X223773538Y56083200D02*
X223773538Y51815538D01*
X223773538Y51815538D02*
X223723200Y51765200D01*
D21*
X195580000Y66954400D02*
X195580000Y73454400D01*
D22*
X223773538Y51764738D02*
X223773538Y51815538D01*
X221843600Y49834800D02*
X223773538Y51764738D01*
%TO.N,A2_LORA_IRQ*%
X243738400Y79197200D02*
X243738400Y71323200D01*
X243738400Y71323200D02*
X243890800Y71170800D01*
X243890800Y71170800D02*
X243890800Y60553600D01*
X243890800Y60553600D02*
X243382800Y60045600D01*
X240030000Y59639200D02*
X240030000Y42164000D01*
X240030000Y42164000D02*
X242519200Y39674800D01*
X207518000Y18237200D02*
X207695800Y18059400D01*
X207518000Y23926800D02*
X207518000Y18237200D01*
X242519200Y39674800D02*
X242519200Y25450800D01*
X242519200Y25450800D02*
X242366800Y25298400D01*
D21*
%TO.N,VHI*%
X243789200Y-14732000D02*
X243789200Y-1676400D01*
X243789200Y-1676400D02*
X243382800Y-1270000D01*
X199999600Y1168400D02*
X199085200Y2082800D01*
X199085200Y2082800D02*
X199085200Y6858000D01*
X199085200Y6858000D02*
X198323200Y7620000D01*
X190347600Y8432800D02*
X190347600Y20269200D01*
X190347600Y20269200D02*
X190347600Y20320000D01*
X190347600Y20320000D02*
X190703200Y20675600D01*
X199440800Y20675600D02*
X200050400Y20066000D01*
X200050400Y18084800D02*
X200075800Y18059400D01*
X200050400Y20066000D02*
X200050400Y18084800D01*
X235534200Y75336400D02*
X235534200Y72212200D01*
X235534200Y72212200D02*
X236067600Y71678800D01*
X244805200Y69799200D02*
X245211600Y69392800D01*
X245211600Y558800D02*
X243382800Y-1270000D01*
X245211600Y69392800D02*
X245211600Y558800D01*
X235534200Y74134980D02*
X235557060Y74112120D01*
X235534200Y75336400D02*
X235534200Y74134980D01*
D22*
%TO.N,3_LDO_ENABLE*%
X235864400Y16256000D02*
X235864400Y28498800D01*
X235864400Y28498800D02*
X235712000Y28651200D01*
X217982800Y29006800D02*
X217474800Y28498800D01*
X217474800Y28498800D02*
X217474800Y25958800D01*
X217474800Y25958800D02*
X217170000Y25654000D01*
X214884000Y22250400D02*
X215025000Y22109400D01*
X213817200Y25298400D02*
X213817200Y22656800D01*
X214364600Y22109400D02*
X215025000Y22109400D01*
X213817200Y22656800D02*
X214364600Y22109400D01*
%TO.N,A0_LORAWAN*%
X234289600Y63957200D02*
X233883200Y63550800D01*
X233883200Y63550800D02*
X233883200Y20777200D01*
X233883200Y20777200D02*
X233680000Y20574000D01*
X201249601Y16693201D02*
X202615800Y18059400D01*
X201249601Y10038401D02*
X201249601Y16693201D01*
X201168000Y9956800D02*
X201249601Y10038401D01*
X228041200Y19862800D02*
X228041200Y8432800D01*
X228041200Y8432800D02*
X227838000Y8229600D01*
D21*
%TO.N,4_SERDAT*%
X233375200Y14732000D02*
X233375200Y2997200D01*
X233375200Y2997200D02*
X233019600Y2641600D01*
D22*
X232054400Y30276800D02*
X232054400Y16611600D01*
X232054400Y16611600D02*
X231800400Y16357600D01*
%TO.N,A1_SD_CS*%
X226314000Y49784000D02*
X225856800Y50241200D01*
X213918800Y53035200D02*
X213664800Y52781200D01*
X213797201Y34128001D02*
X214025801Y33899401D01*
X213664800Y52781200D02*
X213797201Y52648799D01*
X213797201Y52648799D02*
X213797201Y34128001D01*
X205079600Y18135600D02*
X205155800Y18059400D01*
X205079600Y19812000D02*
X205079600Y18135600D01*
X225856800Y52882800D02*
X225856800Y52019200D01*
X225856800Y50241200D02*
X225856800Y52019200D01*
X225856800Y52019200D02*
X225856800Y52273200D01*
X213817200Y20015200D02*
X213817200Y21336000D01*
X213817200Y21336000D02*
X213004400Y22148800D01*
X213004400Y22148800D02*
X213004400Y31038800D01*
X214025801Y32060201D02*
X214025801Y33899401D01*
X213004400Y31038800D02*
X214025801Y32060201D01*
%TD*%
M02*
