%TF.GenerationSoftware,KiCad,Pcbnew,5.1.6-c6e7f7d~87~ubuntu18.04.1*%
%TF.CreationDate,2021-11-17T15:22:13-05:00*%
%TF.ProjectId,remote,72656d6f-7465-42e6-9b69-6361645f7063,rev?*%
%TF.SameCoordinates,Original*%
%TF.FileFunction,Copper,L2,Bot*%
%TF.FilePolarity,Positive*%
%FSLAX46Y46*%
G04 Gerber Fmt 4.6, Leading zero omitted, Abs format (unit mm)*
G04 Created by KiCad (PCBNEW 5.1.6-c6e7f7d~87~ubuntu18.04.1) date 2021-11-17 15:22:13*
%MOMM*%
%LPD*%
G01*
G04 APERTURE LIST*
%TA.AperFunction,ComponentPad*%
%ADD10O,1.200000X1.750000*%
%TD*%
%TA.AperFunction,ComponentPad*%
%ADD11R,1.700000X1.700000*%
%TD*%
%TA.AperFunction,ComponentPad*%
%ADD12O,1.700000X1.700000*%
%TD*%
%TA.AperFunction,ComponentPad*%
%ADD13C,1.600000*%
%TD*%
%TA.AperFunction,ComponentPad*%
%ADD14O,1.600000X1.600000*%
%TD*%
%TA.AperFunction,ComponentPad*%
%ADD15C,5.400000*%
%TD*%
%TA.AperFunction,ComponentPad*%
%ADD16C,2.100000*%
%TD*%
%TA.AperFunction,ComponentPad*%
%ADD17C,1.750000*%
%TD*%
%TA.AperFunction,ComponentPad*%
%ADD18O,1.750000X1.200000*%
%TD*%
%TA.AperFunction,ComponentPad*%
%ADD19R,2.800000X2.800000*%
%TD*%
%TA.AperFunction,ComponentPad*%
%ADD20O,2.800000X2.800000*%
%TD*%
%TA.AperFunction,ComponentPad*%
%ADD21R,1.600000X1.600000*%
%TD*%
%TA.AperFunction,ComponentPad*%
%ADD22R,3.500000X3.500000*%
%TD*%
%TA.AperFunction,ComponentPad*%
%ADD23R,2.600000X2.600000*%
%TD*%
%TA.AperFunction,ComponentPad*%
%ADD24C,2.600000*%
%TD*%
%TA.AperFunction,ViaPad*%
%ADD25C,0.800000*%
%TD*%
%TA.AperFunction,Conductor*%
%ADD26C,0.700000*%
%TD*%
%TA.AperFunction,Conductor*%
%ADD27C,0.250000*%
%TD*%
G04 APERTURE END LIST*
D10*
%TO.P,J15,2*%
%TO.N,VBAT_EXT*%
X38068000Y-131318000D03*
%TO.P,J15,1*%
%TO.N,GND*%
%TA.AperFunction,ComponentPad*%
G36*
G01*
X35468000Y-131943001D02*
X35468000Y-130692999D01*
G75*
G02*
X35717999Y-130443000I249999J0D01*
G01*
X36418001Y-130443000D01*
G75*
G02*
X36668000Y-130692999I0J-249999D01*
G01*
X36668000Y-131943001D01*
G75*
G02*
X36418001Y-132193000I-249999J0D01*
G01*
X35717999Y-132193000D01*
G75*
G02*
X35468000Y-131943001I0J249999D01*
G01*
G37*
%TD.AperFunction*%
%TD*%
D11*
%TO.P,J13,1*%
%TO.N,+3V3*%
X60452000Y-138176000D03*
D12*
%TO.P,J13,2*%
%TO.N,GND*%
X57912000Y-138176000D03*
%TO.P,J13,3*%
%TO.N,A0*%
X55372000Y-138176000D03*
%TO.P,J13,4*%
%TO.N,A1*%
X52832000Y-138176000D03*
%TO.P,J13,5*%
%TO.N,RX_D0*%
X50292000Y-138176000D03*
%TO.P,J13,6*%
%TO.N,TX_D1*%
X47752000Y-138176000D03*
%TD*%
D13*
%TO.P,R5,1*%
%TO.N,Net-(J19-Pad3)*%
X64770000Y-97282000D03*
D14*
%TO.P,R5,2*%
%TO.N,GND*%
X64770000Y-84582000D03*
%TD*%
D11*
%TO.P,J19,1*%
%TO.N,N/C*%
X36950000Y-142250000D03*
D12*
%TO.P,J19,2*%
%TO.N,A2*%
X39490000Y-142250000D03*
%TO.P,J19,3*%
%TO.N,Net-(J19-Pad3)*%
X42030000Y-142250000D03*
%TD*%
D15*
%TO.P,H6,1*%
%TO.N,SCL*%
X29908000Y-76390000D03*
%TD*%
%TO.P,H5,1*%
%TO.N,SDA*%
X73968000Y-76410000D03*
%TD*%
D11*
%TO.P,J9,1*%
%TO.N,VBAT*%
X60780000Y-101742000D03*
D12*
%TO.P,J9,2*%
%TO.N,EN*%
X58240000Y-101742000D03*
%TO.P,J9,3*%
%TO.N,VBUS*%
X55700000Y-101742000D03*
%TO.P,J9,4*%
%TO.N,D13*%
X53160000Y-101742000D03*
%TO.P,J9,5*%
%TO.N,D12*%
X50620000Y-101742000D03*
%TO.P,J9,6*%
%TO.N,D11*%
X48080000Y-101742000D03*
%TO.P,J9,7*%
%TO.N,D10*%
X45540000Y-101742000D03*
%TO.P,J9,8*%
%TO.N,D9*%
X43000000Y-101742000D03*
%TO.P,J9,9*%
%TO.N,D6*%
X40460000Y-101742000D03*
%TO.P,J9,10*%
%TO.N,D5*%
X37920000Y-101742000D03*
%TO.P,J9,11*%
%TO.N,SCL*%
X35380000Y-101742000D03*
%TO.P,J9,12*%
%TO.N,SDA*%
X32840000Y-101742000D03*
%TD*%
D11*
%TO.P,J16,1*%
%TO.N,GND*%
X31028000Y-47842000D03*
D12*
%TO.P,J16,2*%
%TO.N,+3V3*%
X33568000Y-47842000D03*
%TO.P,J16,3*%
%TO.N,SCL*%
X36108000Y-47842000D03*
%TO.P,J16,4*%
%TO.N,SDA*%
X38648000Y-47842000D03*
%TD*%
D11*
%TO.P,J14,1*%
%TO.N,N/C*%
X73000000Y-56000000D03*
D12*
%TO.P,J14,2*%
X73000000Y-58540000D03*
%TO.P,J14,3*%
X73000000Y-61080000D03*
%TO.P,J14,4*%
X73000000Y-63620000D03*
%TO.P,J14,5*%
X73000000Y-66160000D03*
%TO.P,J14,6*%
X73000000Y-68700000D03*
%TO.P,J14,7*%
X73000000Y-71240000D03*
%TD*%
%TO.P,J11,7*%
%TO.N,N/C*%
X30500000Y-71240000D03*
%TO.P,J11,6*%
X30500000Y-68700000D03*
%TO.P,J11,5*%
X30500000Y-66160000D03*
%TO.P,J11,4*%
X30500000Y-63620000D03*
%TO.P,J11,3*%
X30500000Y-61080000D03*
%TO.P,J11,2*%
X30500000Y-58540000D03*
D11*
%TO.P,J11,1*%
X30500000Y-56000000D03*
%TD*%
%TO.P,J6,1*%
%TO.N,N/C*%
X34010000Y-52042000D03*
D12*
%TO.P,J6,2*%
X36550000Y-52042000D03*
%TO.P,J6,3*%
X39090000Y-52042000D03*
%TO.P,J6,4*%
X41630000Y-52042000D03*
%TO.P,J6,5*%
X44170000Y-52042000D03*
%TO.P,J6,6*%
X46710000Y-52042000D03*
%TO.P,J6,7*%
X49250000Y-52042000D03*
%TO.P,J6,8*%
X51790000Y-52042000D03*
%TO.P,J6,9*%
X54330000Y-52042000D03*
%TO.P,J6,10*%
X56870000Y-52042000D03*
%TO.P,J6,11*%
X59410000Y-52042000D03*
%TO.P,J6,12*%
X61950000Y-52042000D03*
%TO.P,J6,13*%
X64490000Y-52042000D03*
%TO.P,J6,14*%
X67030000Y-52042000D03*
%TO.P,J6,15*%
X69570000Y-52042000D03*
%TD*%
D11*
%TO.P,J17,1*%
%TO.N,+3V3*%
X67860000Y-76952000D03*
D12*
%TO.P,J17,2*%
%TO.N,GND*%
X65320000Y-76952000D03*
%TO.P,J17,3*%
%TO.N,SCL*%
X62780000Y-76952000D03*
%TO.P,J17,4*%
%TO.N,SDA*%
X60240000Y-76952000D03*
%TO.P,J17,5*%
%TO.N,N/C*%
X57700000Y-76952000D03*
%TO.P,J17,6*%
X55160000Y-76952000D03*
%TO.P,J17,7*%
X52620000Y-76952000D03*
%TD*%
D15*
%TO.P,H4,1*%
%TO.N,D5*%
X73908000Y-107914000D03*
%TD*%
%TO.P,H3,1*%
%TO.N,A3*%
X29908000Y-107914000D03*
%TD*%
%TO.P,H2,1*%
%TO.N,+3V3*%
X73908000Y-140054000D03*
%TD*%
%TO.P,H1,1*%
%TO.N,GND*%
X29908000Y-140054000D03*
%TD*%
D11*
%TO.P,J5,1*%
%TO.N,GND*%
X27686000Y-100076000D03*
D12*
%TO.P,J5,2*%
%TO.N,VBAT*%
X27686000Y-97536000D03*
%TO.P,J5,3*%
%TO.N,VBAT_EXT*%
X27686000Y-94996000D03*
%TD*%
D16*
%TO.P,SW2,*%
%TO.N,*%
X69160000Y-118250000D03*
D17*
%TO.P,SW2,1*%
%TO.N,A5*%
X71650000Y-119500000D03*
%TO.P,SW2,2*%
%TO.N,GND*%
X71650000Y-124000000D03*
D16*
%TO.P,SW2,*%
%TO.N,*%
X69160000Y-125260000D03*
%TD*%
%TO.P,SW1,*%
%TO.N,*%
X69138000Y-88412000D03*
D17*
%TO.P,SW1,1*%
%TO.N,A4*%
X71628000Y-89662000D03*
%TO.P,SW1,2*%
%TO.N,GND*%
X71628000Y-94162000D03*
D16*
%TO.P,SW1,*%
%TO.N,*%
X69138000Y-95422000D03*
%TD*%
%TO.P,J1,1*%
%TO.N,GND*%
%TA.AperFunction,ComponentPad*%
G36*
G01*
X28819001Y-88992000D02*
X27568999Y-88992000D01*
G75*
G02*
X27319000Y-88742001I0J249999D01*
G01*
X27319000Y-88041999D01*
G75*
G02*
X27568999Y-87792000I249999J0D01*
G01*
X28819001Y-87792000D01*
G75*
G02*
X29069000Y-88041999I0J-249999D01*
G01*
X29069000Y-88742001D01*
G75*
G02*
X28819001Y-88992000I-249999J0D01*
G01*
G37*
%TD.AperFunction*%
D18*
%TO.P,J1,2*%
%TO.N,VBAT_EXT*%
X28194000Y-86392000D03*
%TD*%
D11*
%TO.P,J10,1*%
%TO.N,D4*%
X32830000Y-81458000D03*
D12*
%TO.P,J10,2*%
%TO.N,TX_D1*%
X35370000Y-81458000D03*
%TO.P,J10,3*%
%TO.N,RX_D0*%
X37910000Y-81458000D03*
%TO.P,J10,4*%
%TO.N,MISO*%
X40450000Y-81458000D03*
%TO.P,J10,5*%
%TO.N,MOSI*%
X42990000Y-81458000D03*
%TO.P,J10,6*%
%TO.N,SCK*%
X45530000Y-81458000D03*
%TO.P,J10,7*%
%TO.N,A5*%
X48070000Y-81458000D03*
%TO.P,J10,8*%
%TO.N,A4*%
X50610000Y-81458000D03*
%TO.P,J10,9*%
%TO.N,A3*%
X53150000Y-81458000D03*
%TO.P,J10,10*%
%TO.N,A2*%
X55690000Y-81458000D03*
%TO.P,J10,11*%
%TO.N,A1*%
X58230000Y-81458000D03*
%TO.P,J10,12*%
%TO.N,A0*%
X60770000Y-81458000D03*
%TO.P,J10,13*%
%TO.N,GND*%
X63310000Y-81458000D03*
%TO.P,J10,14*%
%TO.N,AREF*%
X65850000Y-81458000D03*
%TO.P,J10,15*%
%TO.N,+3V3*%
X68390000Y-81458000D03*
%TO.P,J10,16*%
%TO.N,~RESET*%
X70930000Y-81458000D03*
%TD*%
%TO.P,J2,12*%
%TO.N,SDA*%
X32890000Y-134474000D03*
%TO.P,J2,11*%
%TO.N,SCL*%
X35430000Y-134474000D03*
%TO.P,J2,10*%
%TO.N,D5*%
X37970000Y-134474000D03*
%TO.P,J2,9*%
%TO.N,D6*%
X40510000Y-134474000D03*
%TO.P,J2,8*%
%TO.N,D9*%
X43050000Y-134474000D03*
%TO.P,J2,7*%
%TO.N,D10*%
X45590000Y-134474000D03*
%TO.P,J2,6*%
%TO.N,D11*%
X48130000Y-134474000D03*
%TO.P,J2,5*%
%TO.N,D12*%
X50670000Y-134474000D03*
%TO.P,J2,4*%
%TO.N,D13*%
X53210000Y-134474000D03*
%TO.P,J2,3*%
%TO.N,VBUS*%
X55750000Y-134474000D03*
%TO.P,J2,2*%
%TO.N,EN*%
X58290000Y-134474000D03*
D11*
%TO.P,J2,1*%
%TO.N,VBAT*%
X60830000Y-134474000D03*
%TD*%
D12*
%TO.P,J3,16*%
%TO.N,~RESET*%
X70950000Y-114184000D03*
%TO.P,J3,15*%
%TO.N,+3V3*%
X68410000Y-114184000D03*
%TO.P,J3,14*%
%TO.N,AREF*%
X65870000Y-114184000D03*
%TO.P,J3,13*%
%TO.N,GND*%
X63330000Y-114184000D03*
%TO.P,J3,12*%
%TO.N,A0*%
X60790000Y-114184000D03*
%TO.P,J3,11*%
%TO.N,A1*%
X58250000Y-114184000D03*
%TO.P,J3,10*%
%TO.N,A2*%
X55710000Y-114184000D03*
%TO.P,J3,9*%
%TO.N,A3*%
X53170000Y-114184000D03*
%TO.P,J3,8*%
%TO.N,A4*%
X50630000Y-114184000D03*
%TO.P,J3,7*%
%TO.N,A5*%
X48090000Y-114184000D03*
%TO.P,J3,6*%
%TO.N,SCK*%
X45550000Y-114184000D03*
%TO.P,J3,5*%
%TO.N,MOSI*%
X43010000Y-114184000D03*
%TO.P,J3,4*%
%TO.N,MISO*%
X40470000Y-114184000D03*
%TO.P,J3,3*%
%TO.N,RX_D0*%
X37930000Y-114184000D03*
%TO.P,J3,2*%
%TO.N,TX_D1*%
X35390000Y-114184000D03*
D11*
%TO.P,J3,1*%
%TO.N,D4*%
X32850000Y-114184000D03*
%TD*%
D19*
%TO.P,D1,1*%
%TO.N,VBUS*%
X42250000Y-118000000D03*
D20*
%TO.P,D1,2*%
%TO.N,VOUT_DCDC*%
X42250000Y-130700000D03*
%TD*%
D21*
%TO.P,C2,1*%
%TO.N,VOUT_DCDC*%
X71718000Y-130584000D03*
D13*
%TO.P,C2,2*%
%TO.N,GND*%
X74218000Y-130584000D03*
%TD*%
D21*
%TO.P,C1,1*%
%TO.N,VIN_DCDC*%
X65448000Y-130584000D03*
D13*
%TO.P,C1,2*%
%TO.N,GND*%
X67948000Y-130584000D03*
%TD*%
D11*
%TO.P,J4,1*%
%TO.N,VIN_DCDC*%
X60892000Y-126774000D03*
D12*
%TO.P,J4,2*%
%TO.N,GND*%
X60892000Y-124234000D03*
%TO.P,J4,3*%
%TO.N,VOUT_DCDC*%
X60892000Y-121694000D03*
%TD*%
D13*
%TO.P,R4,1*%
%TO.N,+3V3*%
X60960000Y-97282000D03*
D14*
%TO.P,R4,2*%
%TO.N,A4*%
X60960000Y-84582000D03*
%TD*%
%TO.P,J7,3*%
%TO.N,N/C*%
%TA.AperFunction,ComponentPad*%
G36*
G01*
X48075000Y-123194000D02*
X46325000Y-123194000D01*
G75*
G02*
X45450000Y-122319000I0J875000D01*
G01*
X45450000Y-120569000D01*
G75*
G02*
X46325000Y-119694000I875000J0D01*
G01*
X48075000Y-119694000D01*
G75*
G02*
X48950000Y-120569000I0J-875000D01*
G01*
X48950000Y-122319000D01*
G75*
G02*
X48075000Y-123194000I-875000J0D01*
G01*
G37*
%TD.AperFunction*%
%TO.P,J7,2*%
%TO.N,GND*%
%TA.AperFunction,ComponentPad*%
G36*
G01*
X52900000Y-125944000D02*
X50900000Y-125944000D01*
G75*
G02*
X50150000Y-125194000I0J750000D01*
G01*
X50150000Y-123694000D01*
G75*
G02*
X50900000Y-122944000I750000J0D01*
G01*
X52900000Y-122944000D01*
G75*
G02*
X53650000Y-123694000I0J-750000D01*
G01*
X53650000Y-125194000D01*
G75*
G02*
X52900000Y-125944000I-750000J0D01*
G01*
G37*
%TD.AperFunction*%
D22*
%TO.P,J7,1*%
%TO.N,VIN_DCDC*%
X51900000Y-118444000D03*
%TD*%
D23*
%TO.P,J8,1*%
%TO.N,GND*%
X31750000Y-122174000D03*
D24*
%TO.P,J8,2*%
%TO.N,VIN_DCDC*%
X31750000Y-127174000D03*
%TD*%
D14*
%TO.P,R2,2*%
%TO.N,SCL*%
X53340000Y-84582000D03*
D13*
%TO.P,R2,1*%
%TO.N,+3V3*%
X53340000Y-97282000D03*
%TD*%
D14*
%TO.P,R1,2*%
%TO.N,SDA*%
X49530000Y-84582000D03*
D13*
%TO.P,R1,1*%
%TO.N,+3V3*%
X49530000Y-97282000D03*
%TD*%
D14*
%TO.P,R3,2*%
%TO.N,A5*%
X57150000Y-84582000D03*
D13*
%TO.P,R3,1*%
%TO.N,+3V3*%
X57150000Y-97282000D03*
%TD*%
D25*
%TO.N,+3V3*%
X70000000Y-127500000D03*
X73500000Y-126750000D03*
X73250000Y-116500000D03*
X61000000Y-89500000D03*
X67000000Y-89500000D03*
X72000000Y-46750000D03*
X69000000Y-46750000D03*
X62000000Y-47000000D03*
X61250000Y-50000000D03*
X33500000Y-49750000D03*
%TO.N,GND*%
X65000000Y-134000000D03*
X68000000Y-133750000D03*
X73750000Y-134000000D03*
X63500000Y-138250000D03*
X43670000Y-121920000D03*
X44000000Y-125250000D03*
X63516000Y-124234000D03*
X30750000Y-88750000D03*
X30250000Y-100000000D03*
X65250000Y-93000000D03*
X31500000Y-45250000D03*
X42000000Y-45250000D03*
X60500000Y-48750000D03*
X70000000Y-50000000D03*
X36068000Y-122428000D03*
X29972000Y-131318000D03*
X36068000Y-126492000D03*
X66766000Y-124234000D03*
X71400000Y-104000000D03*
X63800000Y-105200000D03*
X65200000Y-72800000D03*
%TO.N,SDA*%
X33000000Y-99000000D03*
X47800000Y-98600000D03*
X67000000Y-136200000D03*
X45600000Y-141200000D03*
X44400000Y-139000000D03*
X35200000Y-139000000D03*
X35000000Y-137000000D03*
X32800000Y-137000000D03*
X61400000Y-79600000D03*
X74800000Y-85400000D03*
X47800000Y-86800000D03*
X73400000Y-45400000D03*
X68000000Y-45600000D03*
X38400000Y-53800000D03*
X68200000Y-53600000D03*
%TO.N,SCL*%
X35400000Y-92000000D03*
X53200000Y-91800000D03*
X36000000Y-136400000D03*
X40600000Y-137200000D03*
X40800000Y-140800000D03*
X68600000Y-136200000D03*
X36400000Y-106600000D03*
X34800000Y-106600000D03*
X34800000Y-85400000D03*
X29200000Y-83600000D03*
X54600000Y-78800000D03*
X29000000Y-46200000D03*
X65400000Y-48600000D03*
X74400000Y-49000000D03*
X72600000Y-73000000D03*
X63000000Y-74600000D03*
%TO.N,VIN_DCDC*%
X65250000Y-127000000D03*
X55750000Y-127000000D03*
X55800000Y-119000000D03*
%TO.N,VOUT_DCDC*%
X71750000Y-132750000D03*
X58750000Y-132250000D03*
X58750000Y-121750000D03*
%TO.N,D4*%
X32600000Y-103800000D03*
X31200000Y-103400000D03*
X31400000Y-92800000D03*
X33200000Y-92600000D03*
%TO.N,TX_D1*%
X34036000Y-138176000D03*
%TO.N,RX_D0*%
X36800000Y-140000000D03*
X50200000Y-140000000D03*
X45200000Y-112000000D03*
X44200000Y-84400000D03*
X37800000Y-84200000D03*
%TO.N,MOSI*%
X41600000Y-109400000D03*
X43000000Y-109600000D03*
%TO.N,A5*%
X48200000Y-112400000D03*
X69800000Y-112600000D03*
X48200000Y-109400000D03*
X50200000Y-109200000D03*
X51000000Y-83200000D03*
X48000000Y-83200000D03*
X57200000Y-87800000D03*
X51000000Y-88600000D03*
%TO.N,A4*%
X52000000Y-109400000D03*
X66800000Y-108800000D03*
X67000000Y-101000000D03*
X75000000Y-100800000D03*
X74600000Y-89600000D03*
X62200000Y-91200000D03*
X59400000Y-79600000D03*
X50600000Y-79800000D03*
%TO.N,A3*%
X53000000Y-108000000D03*
%TO.N,A2*%
X55626000Y-115824000D03*
X39600000Y-120200000D03*
X45025000Y-118600000D03*
X45025000Y-116000000D03*
%TO.N,A1*%
X58166000Y-117348000D03*
X55000000Y-117400000D03*
X58200000Y-107400000D03*
X60400000Y-106800000D03*
%TO.N,A0*%
X57404000Y-119380000D03*
X60706000Y-118364000D03*
X60400000Y-110400000D03*
X69600000Y-109800000D03*
X69000000Y-97400000D03*
X65400000Y-95600000D03*
%TO.N,~RESET*%
X70400000Y-98000000D03*
X73400000Y-97600000D03*
X73200000Y-81600000D03*
%TO.N,VBAT*%
X33000000Y-97500000D03*
X33500000Y-94000000D03*
X62750000Y-94250000D03*
X62750000Y-101500000D03*
X62750000Y-111500000D03*
X75500000Y-116000000D03*
X75000000Y-127750000D03*
X60750000Y-130000000D03*
%TO.N,EN*%
X59200000Y-135927000D03*
X62600000Y-135800000D03*
X61400000Y-104200000D03*
X58400000Y-103800000D03*
%TO.N,VBUS*%
X55750000Y-110750000D03*
X30250000Y-118250000D03*
X55500000Y-128750000D03*
X42250000Y-128250000D03*
X32675000Y-110744000D03*
%TO.N,D12*%
X50400000Y-122200000D03*
X57650001Y-122200000D03*
X57800000Y-120400000D03*
X59400000Y-120000000D03*
X59400000Y-105400000D03*
X50800000Y-104400000D03*
%TO.N,D10*%
X45600000Y-103600000D03*
X47000000Y-105600000D03*
%TO.N,D6*%
X41800000Y-115800000D03*
X40000000Y-116000000D03*
%TO.N,D5*%
X38200000Y-99800000D03*
X73600000Y-99800000D03*
%TO.N,VBAT_EXT*%
X32500000Y-86500000D03*
X32250000Y-91500000D03*
X27750000Y-91500000D03*
X38100000Y-124968000D03*
X28194000Y-124714000D03*
X28194000Y-112014000D03*
X37592000Y-112014000D03*
X37592000Y-104902000D03*
X29464000Y-103886000D03*
%TO.N,Net-(J19-Pad3)*%
X63500000Y-136652000D03*
X41910000Y-137160000D03*
%TD*%
D26*
%TO.N,+3V3*%
X70000000Y-127500000D02*
X72750000Y-127500000D01*
X72750000Y-127500000D02*
X73500000Y-126750000D01*
X73250000Y-116500000D02*
X72750000Y-116000000D01*
X72750000Y-116000000D02*
X68750000Y-116000000D01*
X68410000Y-115660000D02*
X68410000Y-114184000D01*
X68750000Y-116000000D02*
X68410000Y-115660000D01*
X60960000Y-97282000D02*
X57150000Y-97282000D01*
X57150000Y-97282000D02*
X53340000Y-97282000D01*
X53340000Y-97282000D02*
X49530000Y-97282000D01*
X61000000Y-89500000D02*
X67000000Y-89500000D01*
X72000000Y-46750000D02*
X69000000Y-46750000D01*
X69000000Y-46750000D02*
X62250000Y-46750000D01*
X62250000Y-46750000D02*
X62000000Y-47000000D01*
X61250000Y-50000000D02*
X33750000Y-50000000D01*
X33750000Y-50000000D02*
X33500000Y-49750000D01*
%TO.N,GND*%
X65000000Y-134000000D02*
X67750000Y-134000000D01*
X67750000Y-134000000D02*
X68000000Y-133750000D01*
X73750000Y-134000000D02*
X67750000Y-134000000D01*
X57912000Y-138176000D02*
X57912000Y-139412000D01*
X57912000Y-139412000D02*
X58500000Y-140000000D01*
X58500000Y-140000000D02*
X61750000Y-140000000D01*
X61750000Y-140000000D02*
X63500000Y-138250000D01*
X44806000Y-124444000D02*
X51900000Y-124444000D01*
X44000000Y-125250000D02*
X44806000Y-124444000D01*
X60682000Y-124444000D02*
X60892000Y-124234000D01*
X51900000Y-124444000D02*
X60682000Y-124444000D01*
X66766000Y-124234000D02*
X67750000Y-123250000D01*
X70900000Y-123250000D02*
X71650000Y-124000000D01*
X67750000Y-123250000D02*
X70900000Y-123250000D01*
X60892000Y-124234000D02*
X63516000Y-124234000D01*
X63516000Y-124234000D02*
X66766000Y-124234000D01*
X28194000Y-88392000D02*
X30392000Y-88392000D01*
X30392000Y-88392000D02*
X30750000Y-88750000D01*
X27762000Y-100000000D02*
X27686000Y-100076000D01*
X30250000Y-100000000D02*
X27762000Y-100000000D01*
X70466000Y-93000000D02*
X71628000Y-94162000D01*
X65250000Y-93000000D02*
X70466000Y-93000000D01*
X31500000Y-45250000D02*
X40250000Y-45250000D01*
X40250000Y-45250000D02*
X42000000Y-45250000D01*
X60500000Y-48750000D02*
X63000000Y-48750000D01*
X63000000Y-48750000D02*
X63000000Y-49000000D01*
X63000000Y-49000000D02*
X64000000Y-50000000D01*
X64000000Y-50000000D02*
X70000000Y-50000000D01*
X32004000Y-122428000D02*
X31750000Y-122174000D01*
X36068000Y-122428000D02*
X32004000Y-122428000D01*
X36576000Y-121920000D02*
X36068000Y-122428000D01*
X43670000Y-121920000D02*
X36576000Y-121920000D01*
X29972000Y-131318000D02*
X36068000Y-131318000D01*
X44000000Y-125250000D02*
X41882000Y-125250000D01*
X40640000Y-126492000D02*
X36068000Y-126492000D01*
X41882000Y-125250000D02*
X40640000Y-126492000D01*
X70970001Y-50970001D02*
X70970001Y-54505999D01*
X70000000Y-50000000D02*
X70970001Y-50970001D01*
X70970001Y-54505999D02*
X70866000Y-54610000D01*
X71400000Y-104000000D02*
X70800000Y-104600000D01*
X70800000Y-104600000D02*
X64400000Y-104600000D01*
X64400000Y-104600000D02*
X63800000Y-105200000D01*
X70970001Y-54505999D02*
X70970001Y-70429999D01*
X70970001Y-70429999D02*
X68800000Y-72600000D01*
X68800000Y-72600000D02*
X66846000Y-72600000D01*
X66846000Y-72600000D02*
X65400000Y-72600000D01*
X65400000Y-72600000D02*
X65200000Y-72800000D01*
D27*
%TO.N,SDA*%
X33000000Y-99000000D02*
X33400000Y-98600000D01*
X33400000Y-98600000D02*
X47800000Y-98600000D01*
X49312000Y-84800000D02*
X49530000Y-84582000D01*
X67000000Y-136200000D02*
X67000000Y-138600000D01*
X67000000Y-138600000D02*
X64600000Y-141000000D01*
X64600000Y-141000000D02*
X45800000Y-141000000D01*
X45800000Y-141000000D02*
X45600000Y-141200000D01*
X44400000Y-139000000D02*
X35200000Y-139000000D01*
X35000000Y-137000000D02*
X32800000Y-137000000D01*
X61400000Y-79600000D02*
X73000000Y-79600000D01*
X73968000Y-78632000D02*
X73968000Y-76410000D01*
X73000000Y-79600000D02*
X73968000Y-78632000D01*
X49530000Y-86130000D02*
X49530000Y-84582000D01*
X49600000Y-86200000D02*
X49530000Y-86130000D01*
X74800000Y-85400000D02*
X74000000Y-86200000D01*
X74000000Y-86200000D02*
X49600000Y-86200000D01*
X49600000Y-86200000D02*
X48400000Y-86200000D01*
X48400000Y-86200000D02*
X47800000Y-86800000D01*
X73400000Y-45400000D02*
X68200000Y-45400000D01*
X68200000Y-45400000D02*
X68000000Y-45600000D01*
X38400000Y-53800000D02*
X61800000Y-53800000D01*
X61800000Y-53800000D02*
X68000000Y-53800000D01*
X68000000Y-53800000D02*
X68200000Y-53600000D01*
%TO.N,SCL*%
X35400000Y-92000000D02*
X53000000Y-92000000D01*
X53000000Y-92000000D02*
X53200000Y-91800000D01*
X36000000Y-136400000D02*
X36800000Y-137200000D01*
X36800000Y-137200000D02*
X40600000Y-137200000D01*
X43400000Y-140800000D02*
X44800000Y-142200000D01*
X40800000Y-140800000D02*
X42400000Y-140800000D01*
X41200000Y-140800000D02*
X42400000Y-140800000D01*
X42400000Y-140800000D02*
X43400000Y-140800000D01*
X44800000Y-142200000D02*
X46200000Y-142200000D01*
X46200000Y-142200000D02*
X67000000Y-142200000D01*
X67000000Y-142200000D02*
X67800000Y-141400000D01*
X67800000Y-141400000D02*
X67800000Y-137000000D01*
X67800000Y-137000000D02*
X68600000Y-136200000D01*
X36400000Y-106600000D02*
X34800000Y-106600000D01*
X34800000Y-85400000D02*
X33800000Y-84400000D01*
X33800000Y-84400000D02*
X30000000Y-84400000D01*
X30000000Y-84400000D02*
X29200000Y-83600000D01*
X62780000Y-76952000D02*
X62780000Y-78220000D01*
X62780000Y-78220000D02*
X62200000Y-78800000D01*
X62200000Y-78800000D02*
X54600000Y-78800000D01*
X34466000Y-46200000D02*
X36108000Y-47842000D01*
X29000000Y-46200000D02*
X34466000Y-46200000D01*
X65400000Y-48600000D02*
X71800000Y-48600000D01*
X71800000Y-48600000D02*
X74000000Y-48600000D01*
X74000000Y-48600000D02*
X74400000Y-49000000D01*
X72600000Y-73000000D02*
X70800000Y-73000000D01*
X70800000Y-73000000D02*
X69600000Y-74200000D01*
X69600000Y-74200000D02*
X63400000Y-74200000D01*
X63400000Y-74200000D02*
X63000000Y-74600000D01*
D26*
%TO.N,VIN_DCDC*%
X60892000Y-126774000D02*
X65024000Y-126774000D01*
X65024000Y-126774000D02*
X65250000Y-127000000D01*
X60892000Y-126774000D02*
X55976000Y-126774000D01*
X55976000Y-126774000D02*
X55750000Y-127000000D01*
X52206000Y-118750000D02*
X51900000Y-118444000D01*
X34464000Y-127174000D02*
X31750000Y-127174000D01*
X41148000Y-127762000D02*
X35052000Y-127762000D01*
X55750000Y-127000000D02*
X41910000Y-127000000D01*
X35052000Y-127762000D02*
X34464000Y-127174000D01*
X41910000Y-127000000D02*
X41148000Y-127762000D01*
X55550000Y-118750000D02*
X55800000Y-119000000D01*
X54650000Y-118750000D02*
X55550000Y-118750000D01*
X54650000Y-118750000D02*
X52206000Y-118750000D01*
X55500000Y-118750000D02*
X54650000Y-118750000D01*
%TO.N,VOUT_DCDC*%
X71750000Y-132750000D02*
X71250000Y-132250000D01*
X71250000Y-132250000D02*
X58750000Y-132250000D01*
X60836000Y-121750000D02*
X60892000Y-121694000D01*
X58750000Y-121750000D02*
X60836000Y-121750000D01*
X57200000Y-130700000D02*
X58750000Y-132250000D01*
X42250000Y-130700000D02*
X57200000Y-130700000D01*
D27*
%TO.N,D4*%
X32600000Y-103800000D02*
X31600000Y-103800000D01*
X31600000Y-103800000D02*
X31200000Y-103400000D01*
X31400000Y-92800000D02*
X33000000Y-92800000D01*
X33000000Y-92800000D02*
X33200000Y-92600000D01*
%TO.N,TX_D1*%
X47752000Y-138176000D02*
X34036000Y-138176000D01*
%TO.N,RX_D0*%
X36800000Y-140000000D02*
X50000000Y-140000000D01*
X50000000Y-140000000D02*
X50200000Y-140000000D01*
X37930000Y-114184000D02*
X37930000Y-113070000D01*
X37930000Y-113070000D02*
X39000000Y-112000000D01*
X39000000Y-112000000D02*
X45200000Y-112000000D01*
X44200000Y-84400000D02*
X38000000Y-84400000D01*
X38000000Y-84400000D02*
X37800000Y-84200000D01*
%TO.N,MOSI*%
X41600000Y-109400000D02*
X42800000Y-109400000D01*
X42800000Y-109400000D02*
X43000000Y-109600000D01*
%TO.N,A5*%
X48200000Y-112400000D02*
X69600000Y-112400000D01*
X69600000Y-112400000D02*
X69800000Y-112600000D01*
X48200000Y-109400000D02*
X50000000Y-109400000D01*
X50000000Y-109400000D02*
X50200000Y-109200000D01*
X51000000Y-83200000D02*
X48000000Y-83200000D01*
X56400000Y-88600000D02*
X51000000Y-88600000D01*
X57200000Y-87800000D02*
X56400000Y-88600000D01*
%TO.N,A4*%
X52000000Y-109400000D02*
X52600000Y-108800000D01*
X52600000Y-108800000D02*
X66800000Y-108800000D01*
X67000000Y-101000000D02*
X74800000Y-101000000D01*
X74800000Y-101000000D02*
X75000000Y-100800000D01*
X71690000Y-89600000D02*
X71628000Y-89662000D01*
X74600000Y-89600000D02*
X71690000Y-89600000D01*
X71628000Y-89662000D02*
X70090000Y-91200000D01*
X70090000Y-91200000D02*
X62200000Y-91200000D01*
X59400000Y-79600000D02*
X50800000Y-79600000D01*
X50800000Y-79600000D02*
X50600000Y-79800000D01*
%TO.N,A3*%
X29908000Y-107914000D02*
X52914000Y-107914000D01*
X52914000Y-107914000D02*
X53000000Y-108000000D01*
%TO.N,A2*%
X39742000Y-120142000D02*
X39658000Y-120142000D01*
X39658000Y-120142000D02*
X39600000Y-120200000D01*
X39600000Y-120200000D02*
X43425000Y-120200000D01*
X43425000Y-120200000D02*
X45025000Y-118600000D01*
X49248000Y-116000000D02*
X49424000Y-115824000D01*
X45025000Y-116000000D02*
X49248000Y-116000000D01*
X49424000Y-115824000D02*
X55626000Y-115824000D01*
%TO.N,A1*%
X58166000Y-117348000D02*
X55052000Y-117348000D01*
X55052000Y-117348000D02*
X55000000Y-117400000D01*
X58200000Y-107400000D02*
X59800000Y-107400000D01*
X59800000Y-107400000D02*
X60400000Y-106800000D01*
%TO.N,A0*%
X57404000Y-119380000D02*
X57912000Y-118872000D01*
X57912000Y-118872000D02*
X60198000Y-118872000D01*
X60198000Y-118872000D02*
X60706000Y-118364000D01*
X60400000Y-110400000D02*
X69000000Y-110400000D01*
X69000000Y-110400000D02*
X69600000Y-109800000D01*
X69000000Y-97400000D02*
X68600000Y-97000000D01*
X68600000Y-97000000D02*
X66800000Y-97000000D01*
X66800000Y-97000000D02*
X65400000Y-95600000D01*
%TO.N,~RESET*%
X70400000Y-98000000D02*
X73000000Y-98000000D01*
X73000000Y-98000000D02*
X73400000Y-97600000D01*
X71072000Y-81600000D02*
X70930000Y-81458000D01*
X73200000Y-81600000D02*
X71072000Y-81600000D01*
D26*
%TO.N,VBAT*%
X27686000Y-97536000D02*
X32964000Y-97536000D01*
X32964000Y-97536000D02*
X33000000Y-97500000D01*
X33500000Y-94000000D02*
X58500000Y-94000000D01*
X58500000Y-94000000D02*
X62500000Y-94000000D01*
X62500000Y-94000000D02*
X62750000Y-94250000D01*
X61022000Y-101500000D02*
X60780000Y-101742000D01*
X62750000Y-101500000D02*
X61022000Y-101500000D01*
X62750000Y-111500000D02*
X71250000Y-111500000D01*
X71250000Y-111500000D02*
X75500000Y-115750000D01*
X75500000Y-115750000D02*
X75500000Y-116000000D01*
X75000000Y-127750000D02*
X74000000Y-128750000D01*
X74000000Y-128750000D02*
X62000000Y-128750000D01*
X62000000Y-128750000D02*
X60750000Y-130000000D01*
D27*
%TO.N,EN*%
X59200000Y-135927000D02*
X62473000Y-135927000D01*
X62473000Y-135927000D02*
X62600000Y-135800000D01*
X61400000Y-104200000D02*
X61000000Y-103800000D01*
X61000000Y-103800000D02*
X58400000Y-103800000D01*
D26*
%TO.N,VBUS*%
X55750000Y-110750000D02*
X40000000Y-110750000D01*
X40000000Y-110750000D02*
X33500000Y-110750000D01*
X33500000Y-110750000D02*
X32750000Y-110750000D01*
X42000000Y-118250000D02*
X42250000Y-118000000D01*
X30250000Y-118250000D02*
X42000000Y-118250000D01*
X55500000Y-128750000D02*
X55000000Y-128250000D01*
X55000000Y-128250000D02*
X42250000Y-128250000D01*
X32750000Y-110750000D02*
X32681000Y-110750000D01*
X32681000Y-110750000D02*
X32675000Y-110744000D01*
D27*
%TO.N,D12*%
X50400000Y-122200000D02*
X57650001Y-122200000D01*
X57800000Y-120400000D02*
X59000000Y-120400000D01*
X59000000Y-120400000D02*
X59400000Y-120000000D01*
X59400000Y-105400000D02*
X58600000Y-104600000D01*
X58600000Y-104600000D02*
X51000000Y-104600000D01*
X51000000Y-104600000D02*
X50800000Y-104400000D01*
%TO.N,D10*%
X45600000Y-103600000D02*
X45600000Y-104200000D01*
X45600000Y-104200000D02*
X47000000Y-105600000D01*
%TO.N,D6*%
X41800000Y-115800000D02*
X40200000Y-115800000D01*
X40200000Y-115800000D02*
X40000000Y-116000000D01*
%TO.N,D5*%
X38200000Y-99800000D02*
X45600000Y-99800000D01*
X45600000Y-99800000D02*
X54800000Y-99800000D01*
X54800000Y-99800000D02*
X73600000Y-99800000D01*
D26*
%TO.N,VBAT_EXT*%
X28194000Y-86392000D02*
X32392000Y-86392000D01*
X32392000Y-86392000D02*
X32500000Y-86500000D01*
X32250000Y-91500000D02*
X27750000Y-91500000D01*
X38100000Y-124968000D02*
X28448000Y-124968000D01*
X28448000Y-124968000D02*
X28194000Y-124714000D01*
X28194000Y-112014000D02*
X37592000Y-112014000D01*
X37592000Y-104902000D02*
X32004000Y-104902000D01*
X31765999Y-104663999D02*
X30749999Y-104663999D01*
X32004000Y-104902000D02*
X31765999Y-104663999D01*
X30749999Y-104663999D02*
X30734000Y-104648000D01*
X30734000Y-104648000D02*
X30226000Y-104648000D01*
X30226000Y-104648000D02*
X29464000Y-103886000D01*
D27*
%TO.N,Net-(J19-Pad3)*%
X63500000Y-136652000D02*
X42418000Y-136652000D01*
X42418000Y-136652000D02*
X41910000Y-137160000D01*
%TD*%
M02*
