EESchema Schematic File Version 4
EELAYER 30 0
EELAYER END
$Descr A4 11693 8268
encoding utf-8
Sheet 1 1
Title "PVOS CO2 Monitor REV_T: Cover"
Date ""
Rev "T"
Comp ""
Comment1 "pvos.org/co2/rev_t/"
Comment2 ""
Comment3 ""
Comment4 ""
$EndDescr
$Comp
L Mechanical:MountingHole_Pad H1
U 1 1 614A1FDA
P 1075 3100
F 0 "H1" H 1175 3149 50  0000 L CNN
F 1 "MountingHole_Pad" H 1175 3058 50  0000 L CNN
F 2 "MountingHole:MountingHole_2.7mm_M2.5_Pad" H 1075 3100 50  0001 C CNN
F 3 "~" H 1075 3100 50  0001 C CNN
	1    1075 3100
	1    0    0    -1  
$EndComp
$Comp
L Mechanical:MountingHole_Pad H2
U 1 1 614A5606
P 1325 3425
F 0 "H2" H 1425 3474 50  0000 L CNN
F 1 "MountingHole_Pad" H 1425 3383 50  0000 L CNN
F 2 "MountingHole:MountingHole_2.7mm_M2.5_Pad" H 1325 3425 50  0001 C CNN
F 3 "~" H 1325 3425 50  0001 C CNN
	1    1325 3425
	1    0    0    -1  
$EndComp
$Comp
L Mechanical:MountingHole_Pad H3
U 1 1 614A5CC9
P 2550 3050
F 0 "H3" H 2650 3099 50  0000 L CNN
F 1 "MountingHole_Pad" H 2650 3008 50  0000 L CNN
F 2 "MountingHole:MountingHole_2.7mm_M2.5_Pad" H 2550 3050 50  0001 C CNN
F 3 "~" H 2550 3050 50  0001 C CNN
	1    2550 3050
	1    0    0    -1  
$EndComp
$Comp
L Mechanical:MountingHole_Pad H4
U 1 1 614A5FBB
P 2550 3400
F 0 "H4" H 2650 3449 50  0000 L CNN
F 1 "MountingHole_Pad" H 2650 3358 50  0000 L CNN
F 2 "MountingHole:MountingHole_2.7mm_M2.5_Pad" H 2550 3400 50  0001 C CNN
F 3 "~" H 2550 3400 50  0001 C CNN
	1    2550 3400
	1    0    0    -1  
$EndComp
$Comp
L Mechanical:MountingHole_Pad H5
U 1 1 614E3462
P 3725 3075
F 0 "H5" H 3825 3124 50  0000 L CNN
F 1 "MountingHole_Pad" H 3825 3033 50  0000 L CNN
F 2 "MountingHole:MountingHole_2.7mm_M2.5_Pad" H 3725 3075 50  0001 C CNN
F 3 "~" H 3725 3075 50  0001 C CNN
	1    3725 3075
	1    0    0    -1  
$EndComp
$Comp
L Mechanical:MountingHole_Pad H6
U 1 1 614E3468
P 3725 3425
F 0 "H6" H 3825 3474 50  0000 L CNN
F 1 "MountingHole_Pad" H 3825 3383 50  0000 L CNN
F 2 "MountingHole:MountingHole_2.7mm_M2.5_Pad" H 3725 3425 50  0001 C CNN
F 3 "~" H 3725 3425 50  0001 C CNN
	1    3725 3425
	1    0    0    -1  
$EndComp
$Comp
L power:GND #PWR0101
U 1 1 615C33CE
P 1075 3200
F 0 "#PWR0101" H 1075 2950 50  0001 C CNN
F 1 "GND" H 1080 3027 50  0000 C CNN
F 2 "" H 1075 3200 50  0001 C CNN
F 3 "" H 1075 3200 50  0001 C CNN
	1    1075 3200
	0    1    1    0   
$EndComp
$Comp
L power:+3V3 #PWR0102
U 1 1 615C451F
P 1325 3525
F 0 "#PWR0102" H 1325 3375 50  0001 C CNN
F 1 "+3V3" H 1340 3698 50  0000 C CNN
F 2 "" H 1325 3525 50  0001 C CNN
F 3 "" H 1325 3525 50  0001 C CNN
	1    1325 3525
	0    -1   -1   0   
$EndComp
Text GLabel 2550 3150 0    50   Input ~ 0
SCL
Text GLabel 2550 3500 0    50   Input ~ 0
SDA
Text GLabel 3725 3175 0    50   Input ~ 0
A3
Text GLabel 3725 3525 0    50   Input ~ 0
D5
$Comp
L Connector:Conn_01x04_Female J1
U 1 1 614ECAD9
P 1700 2275
F 0 "J1" H 1728 2251 50  0000 L CNN
F 1 "Conn_01x04_Female" H 1728 2160 50  0000 L CNN
F 2 "Connector_PinSocket_2.54mm:PinSocket_1x04_P2.54mm_Vertical" H 1700 2275 50  0001 C CNN
F 3 "~" H 1700 2275 50  0001 C CNN
	1    1700 2275
	1    0    0    -1  
$EndComp
$Comp
L power:GND #PWR0103
U 1 1 614ED3DE
P 1500 2175
F 0 "#PWR0103" H 1500 1925 50  0001 C CNN
F 1 "GND" H 1505 2002 50  0000 C CNN
F 2 "" H 1500 2175 50  0001 C CNN
F 3 "" H 1500 2175 50  0001 C CNN
	1    1500 2175
	0    1    1    0   
$EndComp
$Comp
L power:+3V3 #PWR0104
U 1 1 614EDD86
P 1275 2275
F 0 "#PWR0104" H 1275 2125 50  0001 C CNN
F 1 "+3V3" H 1290 2448 50  0000 C CNN
F 2 "" H 1275 2275 50  0001 C CNN
F 3 "" H 1275 2275 50  0001 C CNN
	1    1275 2275
	0    -1   -1   0   
$EndComp
Wire Wire Line
	1500 2275 1275 2275
Text GLabel 1500 2375 0    50   Input ~ 0
SCL
Text GLabel 1500 2475 0    50   Input ~ 0
SDA
$Comp
L Connector:Conn_01x04_Female J2
U 1 1 614F3DE0
P 1700 1450
F 0 "J2" H 1728 1426 50  0000 L CNN
F 1 "Conn_01x04_Female" H 1728 1335 50  0000 L CNN
F 2 "Connector_PinSocket_2.54mm:PinSocket_1x04_P2.54mm_Vertical" H 1700 1450 50  0001 C CNN
F 3 "~" H 1700 1450 50  0001 C CNN
	1    1700 1450
	1    0    0    -1  
$EndComp
$Comp
L power:GND #PWR0105
U 1 1 614F3DE6
P 1500 1350
F 0 "#PWR0105" H 1500 1100 50  0001 C CNN
F 1 "GND" H 1505 1177 50  0000 C CNN
F 2 "" H 1500 1350 50  0001 C CNN
F 3 "" H 1500 1350 50  0001 C CNN
	1    1500 1350
	0    1    1    0   
$EndComp
$Comp
L power:+3V3 #PWR0106
U 1 1 614F3DEC
P 1275 1450
F 0 "#PWR0106" H 1275 1300 50  0001 C CNN
F 1 "+3V3" H 1290 1623 50  0000 C CNN
F 2 "" H 1275 1450 50  0001 C CNN
F 3 "" H 1275 1450 50  0001 C CNN
	1    1275 1450
	0    -1   -1   0   
$EndComp
Wire Wire Line
	1500 1450 1275 1450
Text GLabel 1500 1550 0    50   Input ~ 0
SCL
Text GLabel 1500 1650 0    50   Input ~ 0
SDA
$EndSCHEMATC
