M48
; DRILL file {KiCad 5.1.6-c6e7f7d~87~ubuntu18.04.1} date Mon Aug 30 12:36:42 2021
; FORMAT={-:-/ absolute / inch / decimal}
; #@! TF.CreationDate,2021-08-30T12:36:42-04:00
; #@! TF.GenerationSoftware,Kicad,Pcbnew,5.1.6-c6e7f7d~87~ubuntu18.04.1
; #@! TF.FileFunction,Plated,1,2,PTH
FMAT,2
INCH
T1C0.0157
T2C0.0394
%
G90
G05
T1
X7.4498Y-1.7766
X7.4567Y-2.5591
X7.5394Y-2.1181
X7.5827Y-1.8189
X7.5906Y-2.2362
X7.5984Y-1.2756
X7.6024Y-2.5276
X7.6142Y-2.6102
X7.6732Y-1.0039
X7.7244Y-2.4528
X7.7717Y-1.7283
X7.7717Y-2.0276
X7.811Y-1.815
X7.8386Y-2.1181
X7.8549Y-2.4594
X7.9961Y-2.6299
X8.0079Y-1.0039
X8.1378Y-2.6732
X8.7136Y-2.4724
X8.811Y-2.6467
X8.815Y-2.1575
X8.9252Y-2.1142
X9.0079Y-2.6457
X9.185Y-2.1063
X9.2441Y-1.8228
X9.2598Y-2.5
X9.3661Y-2.126
X9.378Y-1.9646
X9.4252Y-1.9488
X9.4488Y-2.3819
X9.4567Y-2.5591
X9.5Y-1.8976
X9.5276Y-1.7441
X9.5315Y-2.6024
X9.5866Y-1.7323
X9.6024Y-2.4843
X9.6693Y-1.6654
X9.6693Y-2.4488
X9.6693Y-2.6102
T2
X7.8161Y-1.0925
X7.9161Y-1.0925
X8.0161Y-1.0925
X8.1161Y-1.0925
X8.5319Y-2.2303
X8.6319Y-2.2303
X8.7319Y-2.2303
X8.8319Y-2.2303
X8.9319Y-2.2303
X9.0319Y-2.2303
X9.1319Y-2.2303
X7.8091Y-1.2776
X7.9091Y-1.2776
X8.0091Y-1.2776
X8.1091Y-1.2776
X8.2091Y-1.2776
X8.3091Y-1.2776
X8.4091Y-1.2776
X8.5091Y-1.2776
X8.6091Y-1.2776
X8.7091Y-1.2776
X8.8091Y-1.2776
X8.9091Y-1.2776
X9.0091Y-1.2776
X9.1091Y-1.2776
X9.2091Y-1.2776
X9.3091Y-1.2776
X9.3091Y-1.2776
X9.3091Y-1.3776
X9.3091Y-1.4776
X9.3091Y-1.5776
X9.3091Y-1.6776
X9.3091Y-1.7776
X9.3091Y-1.8776
X9.3091Y-1.9776
X9.3091Y-2.0776
X9.3091Y-2.1776
X9.3091Y-2.2776
X9.3091Y-2.3776
X7.8339Y-2.5384
X7.9339Y-2.5384
X8.0339Y-2.5384
X8.1339Y-2.5384
X7.7087Y-2.378
X7.8087Y-2.378
X7.9087Y-2.378
X8.0087Y-2.378
X8.1087Y-2.378
X8.2087Y-2.378
X8.3087Y-2.378
X8.4087Y-2.378
X8.5087Y-2.378
X8.6087Y-2.378
X8.7087Y-2.378
X8.8087Y-2.378
X8.9087Y-2.378
X9.0087Y-2.378
X9.1087Y-2.378
X9.2087Y-2.378
X7.7087Y-1.2776
X7.7087Y-1.3776
X7.7087Y-1.4776
X7.7087Y-1.5776
X7.7087Y-1.6776
X7.7087Y-1.7776
X7.7087Y-1.8776
X7.7087Y-1.9776
X7.7087Y-2.0776
X7.7087Y-2.1776
X7.7087Y-2.2776
X7.7087Y-2.3776
T0
M30
