%TF.GenerationSoftware,KiCad,Pcbnew,5.1.6-c6e7f7d~87~ubuntu18.04.1*%
%TF.CreationDate,2021-07-21T15:50:48-04:00*%
%TF.ProjectId,remote,72656d6f-7465-42e6-9b69-6361645f7063,rev?*%
%TF.SameCoordinates,Original*%
%TF.FileFunction,Legend,Top*%
%TF.FilePolarity,Positive*%
%FSLAX46Y46*%
G04 Gerber Fmt 4.6, Leading zero omitted, Abs format (unit mm)*
G04 Created by KiCad (PCBNEW 5.1.6-c6e7f7d~87~ubuntu18.04.1) date 2021-07-21 15:50:48*
%MOMM*%
%LPD*%
G01*
G04 APERTURE LIST*
%ADD10C,0.120000*%
%ADD11C,0.150000*%
G04 APERTURE END LIST*
D10*
X214000000Y2400000D02*
X214000000Y3800000D01*
X195400000Y22600000D02*
X194600000Y22600000D01*
X194600000Y30600000D02*
X195400000Y30600000D01*
X190000000Y22600000D02*
X190400000Y22600000D01*
X190000000Y30600000D02*
X190000000Y22600000D01*
X190400000Y30600000D02*
X190000000Y30600000D01*
X194600000Y30600000D02*
X190400000Y30600000D01*
D11*
X192392857Y29621428D02*
X192992857Y29621428D01*
X192907142Y29621428D02*
X192950000Y29578571D01*
X192992857Y29492857D01*
X192992857Y29364285D01*
X192950000Y29278571D01*
X192864285Y29235714D01*
X192392857Y29235714D01*
X192864285Y29235714D02*
X192950000Y29192857D01*
X192992857Y29107142D01*
X192992857Y28978571D01*
X192950000Y28892857D01*
X192864285Y28850000D01*
X192392857Y28850000D01*
X192392857Y28421428D02*
X192992857Y28421428D01*
X193292857Y28421428D02*
X193250000Y28464285D01*
X193207142Y28421428D01*
X193250000Y28378571D01*
X193292857Y28421428D01*
X193207142Y28421428D01*
X192435714Y27607142D02*
X192392857Y27692857D01*
X192392857Y27864285D01*
X192435714Y27950000D01*
X192478571Y27992857D01*
X192564285Y28035714D01*
X192821428Y28035714D01*
X192907142Y27992857D01*
X192950000Y27950000D01*
X192992857Y27864285D01*
X192992857Y27692857D01*
X192950000Y27607142D01*
X192392857Y27221428D02*
X192992857Y27221428D01*
X192821428Y27221428D02*
X192907142Y27178571D01*
X192950000Y27135714D01*
X192992857Y27050000D01*
X192992857Y26964285D01*
X192392857Y26535714D02*
X192435714Y26621428D01*
X192478571Y26664285D01*
X192564285Y26707142D01*
X192821428Y26707142D01*
X192907142Y26664285D01*
X192950000Y26621428D01*
X192992857Y26535714D01*
X192992857Y26407142D01*
X192950000Y26321428D01*
X192907142Y26278571D01*
X192821428Y26235714D01*
X192564285Y26235714D01*
X192478571Y26278571D01*
X192435714Y26321428D01*
X192392857Y26407142D01*
X192392857Y26535714D01*
X193292857Y25850000D02*
X192564285Y25850000D01*
X192478571Y25807142D01*
X192435714Y25764285D01*
X192392857Y25678571D01*
X192392857Y25507142D01*
X192435714Y25421428D01*
X192478571Y25378571D01*
X192564285Y25335714D01*
X193292857Y25335714D01*
X192435714Y24950000D02*
X192392857Y24821428D01*
X192392857Y24607142D01*
X192435714Y24521428D01*
X192478571Y24478571D01*
X192564285Y24435714D01*
X192650000Y24435714D01*
X192735714Y24478571D01*
X192778571Y24521428D01*
X192821428Y24607142D01*
X192864285Y24778571D01*
X192907142Y24864285D01*
X192950000Y24907142D01*
X193035714Y24950000D01*
X193121428Y24950000D01*
X193207142Y24907142D01*
X193250000Y24864285D01*
X193292857Y24778571D01*
X193292857Y24564285D01*
X193250000Y24435714D01*
X192864285Y23750000D02*
X192821428Y23621428D01*
X192778571Y23578571D01*
X192692857Y23535714D01*
X192564285Y23535714D01*
X192478571Y23578571D01*
X192435714Y23621428D01*
X192392857Y23707142D01*
X192392857Y24050000D01*
X193292857Y24050000D01*
X193292857Y23750000D01*
X193250000Y23664285D01*
X193207142Y23621428D01*
X193121428Y23578571D01*
X193035714Y23578571D01*
X192950000Y23621428D01*
X192907142Y23664285D01*
X192864285Y23750000D01*
X192864285Y24050000D01*
D10*
X194600000Y22600000D02*
X190400000Y22600000D01*
X195400000Y30600000D02*
X195400000Y22600000D01*
D11*
X221785714Y5257142D02*
X222452380Y5447619D01*
X221976190Y5638095D01*
X222452380Y5828571D01*
X221785714Y6019047D01*
X222452380Y6400000D02*
X221785714Y6400000D01*
X221452380Y6400000D02*
X221500000Y6352380D01*
X221547619Y6400000D01*
X221500000Y6447619D01*
X221452380Y6400000D01*
X221547619Y6400000D01*
X221785714Y6733333D02*
X221785714Y7114285D01*
X222452380Y6876190D02*
X221595238Y6876190D01*
X221500000Y6923809D01*
X221452380Y7019047D01*
X221452380Y7114285D01*
X222452380Y7447619D02*
X221785714Y7447619D01*
X221452380Y7447619D02*
X221500000Y7400000D01*
X221547619Y7447619D01*
X221500000Y7495238D01*
X221452380Y7447619D01*
X221547619Y7447619D01*
D10*
X225800000Y10400000D02*
X226000000Y10400000D01*
X225800000Y3400000D02*
X225800000Y10400000D01*
X226000000Y10400000D02*
X226800000Y10400000D01*
X225000000Y3400000D02*
X225800000Y3400000D01*
X225000000Y10400000D02*
X225000000Y3400000D01*
X224000000Y10400000D02*
X225000000Y10400000D01*
X224000000Y10400000D02*
X224000000Y2400000D01*
X214000000Y11000000D02*
X214000000Y8800000D01*
X226800000Y2400000D02*
X214000000Y2400000D01*
X226800000Y11000000D02*
X226800000Y2400000D01*
X214000000Y11000000D02*
X226800000Y11000000D01*
X190550800Y-762000D02*
X190550800Y14376400D01*
X190652400Y18618200D02*
X190652400Y33756600D01*
X224285200Y17627600D02*
X224285200Y32766000D01*
D11*
X226429436Y31597600D02*
G75*
G03*
X226429436Y31597600I-975836J0D01*
G01*
D10*
X226571200Y17627600D02*
X226571200Y32918400D01*
D11*
X226429436Y21437600D02*
G75*
G03*
X226429436Y21437600I-975836J0D01*
G01*
X226429436Y26506964D02*
G75*
G03*
X226429436Y26506964I-975836J0D01*
G01*
X226429436Y29046964D02*
G75*
G03*
X226429436Y29046964I-975836J0D01*
G01*
X226429436Y23966964D02*
G75*
G03*
X226429436Y23966964I-975836J0D01*
G01*
X199625671Y26789114D02*
X199625671Y28589114D01*
X200225671Y27989114D02*
X200911385Y27989114D01*
X200482814Y28589114D02*
X200482814Y27046257D01*
X200568528Y26874828D01*
X200739957Y26789114D01*
X200911385Y26789114D01*
X201425671Y26874828D02*
X201597100Y26789114D01*
X201939957Y26789114D01*
X202111385Y26874828D01*
X202197100Y27046257D01*
X202197100Y27131971D01*
X202111385Y27303400D01*
X201939957Y27389114D01*
X201682814Y27389114D01*
X201511385Y27474828D01*
X201425671Y27646257D01*
X201425671Y27731971D01*
X201511385Y27903400D01*
X201682814Y27989114D01*
X201939957Y27989114D01*
X202111385Y27903400D01*
X202797100Y27989114D02*
X203225671Y26789114D01*
X203654242Y27989114D02*
X203225671Y26789114D01*
X203054242Y26360542D01*
X202968528Y26274828D01*
X202797100Y26189114D01*
X204939957Y27731971D02*
X205197100Y27646257D01*
X205282814Y27560542D01*
X205368528Y27389114D01*
X205368528Y27131971D01*
X205282814Y26960542D01*
X205197100Y26874828D01*
X205025671Y26789114D01*
X204339957Y26789114D01*
X204339957Y28589114D01*
X204939957Y28589114D01*
X205111385Y28503400D01*
X205197100Y28417685D01*
X205282814Y28246257D01*
X205282814Y28074828D01*
X205197100Y27903400D01*
X205111385Y27817685D01*
X204939957Y27731971D01*
X204339957Y27731971D01*
X206139957Y26789114D02*
X206139957Y27989114D01*
X206139957Y28589114D02*
X206054242Y28503400D01*
X206139957Y28417685D01*
X206225671Y28503400D01*
X206139957Y28589114D01*
X206139957Y28417685D01*
X206739957Y27989114D02*
X207425671Y27989114D01*
X206997100Y28589114D02*
X206997100Y27046257D01*
X207082814Y26874828D01*
X207254242Y26789114D01*
X207425671Y26789114D01*
X207939957Y26874828D02*
X208111385Y26789114D01*
X208454242Y26789114D01*
X208625671Y26874828D01*
X208711385Y27046257D01*
X208711385Y27131971D01*
X208625671Y27303400D01*
X208454242Y27389114D01*
X208197100Y27389114D01*
X208025671Y27474828D01*
X207939957Y27646257D01*
X207939957Y27731971D01*
X208025671Y27903400D01*
X208197100Y27989114D01*
X208454242Y27989114D01*
X208625671Y27903400D01*
X209311385Y27989114D02*
X209739957Y26789114D01*
X210168528Y27989114D02*
X209739957Y26789114D01*
X209568528Y26360542D01*
X209482814Y26274828D01*
X209311385Y26189114D01*
X212225671Y26789114D02*
X212225671Y28589114D01*
X212825671Y27303400D01*
X213425671Y28589114D01*
X213425671Y26789114D01*
X215054242Y27989114D02*
X215054242Y26789114D01*
X214625671Y28674828D02*
X214197100Y27389114D01*
X215311385Y27389114D01*
X222257200Y41021085D02*
X222214342Y40935371D01*
X222214342Y40806800D01*
X222257200Y40678228D01*
X222342914Y40592514D01*
X222428628Y40549657D01*
X222600057Y40506800D01*
X222728628Y40506800D01*
X222900057Y40549657D01*
X222985771Y40592514D01*
X223071485Y40678228D01*
X223114342Y40806800D01*
X223114342Y40892514D01*
X223071485Y41021085D01*
X223028628Y41063942D01*
X222728628Y41063942D01*
X222728628Y40892514D01*
X223114342Y41449657D02*
X222214342Y41449657D01*
X223114342Y41963942D01*
X222214342Y41963942D01*
X223114342Y42392514D02*
X222214342Y42392514D01*
X222214342Y42606800D01*
X222257200Y42735371D01*
X222342914Y42821085D01*
X222428628Y42863942D01*
X222600057Y42906800D01*
X222728628Y42906800D01*
X222900057Y42863942D01*
X222985771Y42821085D01*
X223071485Y42735371D01*
X223114342Y42606800D01*
X223114342Y42392514D01*
X217991485Y40512342D02*
X218034342Y40640914D01*
X218034342Y40855200D01*
X217991485Y40940914D01*
X217948628Y40983771D01*
X217862914Y41026628D01*
X217777200Y41026628D01*
X217691485Y40983771D01*
X217648628Y40940914D01*
X217605771Y40855200D01*
X217562914Y40683771D01*
X217520057Y40598057D01*
X217477200Y40555200D01*
X217391485Y40512342D01*
X217305771Y40512342D01*
X217220057Y40555200D01*
X217177200Y40598057D01*
X217134342Y40683771D01*
X217134342Y40898057D01*
X217177200Y41026628D01*
X218034342Y41412342D02*
X217134342Y41412342D01*
X217134342Y41626628D01*
X217177200Y41755200D01*
X217262914Y41840914D01*
X217348628Y41883771D01*
X217520057Y41926628D01*
X217648628Y41926628D01*
X217820057Y41883771D01*
X217905771Y41840914D01*
X217991485Y41755200D01*
X218034342Y41626628D01*
X218034342Y41412342D01*
X217777200Y42269485D02*
X217777200Y42698057D01*
X218034342Y42183771D02*
X217134342Y42483771D01*
X218034342Y42783771D01*
X224703542Y40614685D02*
X224703542Y41171828D01*
X225046400Y40871828D01*
X225046400Y41000400D01*
X225089257Y41086114D01*
X225132114Y41128971D01*
X225217828Y41171828D01*
X225432114Y41171828D01*
X225517828Y41128971D01*
X225560685Y41086114D01*
X225603542Y41000400D01*
X225603542Y40743257D01*
X225560685Y40657542D01*
X225517828Y40614685D01*
X224703542Y41428971D02*
X225603542Y41728971D01*
X224703542Y42028971D01*
X220531485Y40533771D02*
X220574342Y40662342D01*
X220574342Y40876628D01*
X220531485Y40962342D01*
X220488628Y41005200D01*
X220402914Y41048057D01*
X220317200Y41048057D01*
X220231485Y41005200D01*
X220188628Y40962342D01*
X220145771Y40876628D01*
X220102914Y40705200D01*
X220060057Y40619485D01*
X220017200Y40576628D01*
X219931485Y40533771D01*
X219845771Y40533771D01*
X219760057Y40576628D01*
X219717200Y40619485D01*
X219674342Y40705200D01*
X219674342Y40919485D01*
X219717200Y41048057D01*
X220488628Y41948057D02*
X220531485Y41905200D01*
X220574342Y41776628D01*
X220574342Y41690914D01*
X220531485Y41562342D01*
X220445771Y41476628D01*
X220360057Y41433771D01*
X220188628Y41390914D01*
X220060057Y41390914D01*
X219888628Y41433771D01*
X219802914Y41476628D01*
X219717200Y41562342D01*
X219674342Y41690914D01*
X219674342Y41776628D01*
X219717200Y41905200D01*
X219760057Y41948057D01*
X220574342Y42762342D02*
X220574342Y42333771D01*
X219674342Y42333771D01*
X225224014Y80069428D02*
X225224014Y79783714D01*
X225795442Y80069428D02*
X225795442Y79783714D01*
X227295442Y78569428D02*
X226795442Y79283714D01*
X226438300Y78569428D02*
X226438300Y80069428D01*
X227009728Y80069428D01*
X227152585Y79998000D01*
X227224014Y79926571D01*
X227295442Y79783714D01*
X227295442Y79569428D01*
X227224014Y79426571D01*
X227152585Y79355142D01*
X227009728Y79283714D01*
X226438300Y79283714D01*
X227938300Y79355142D02*
X228438300Y79355142D01*
X228652585Y78569428D02*
X227938300Y78569428D01*
X227938300Y80069428D01*
X228652585Y80069428D01*
X229081157Y80069428D02*
X229581157Y78569428D01*
X230081157Y80069428D01*
X231724014Y78569428D02*
X231724014Y80069428D01*
X232224014Y78998000D01*
X232724014Y80069428D01*
X232724014Y78569428D01*
X233366871Y80069428D02*
X233366871Y79783714D01*
X233938300Y80069428D02*
X233938300Y79783714D01*
X239085333Y47793733D02*
X239037714Y47746114D01*
X238894857Y47650876D01*
X238799619Y47603257D01*
X238656761Y47555638D01*
X238418666Y47508019D01*
X238228190Y47508019D01*
X237990095Y47555638D01*
X237847238Y47603257D01*
X237752000Y47650876D01*
X237609142Y47746114D01*
X237561523Y47793733D01*
X238037714Y48174685D02*
X238704380Y48174685D01*
X238132952Y48174685D02*
X238085333Y48222304D01*
X238037714Y48317542D01*
X238037714Y48460400D01*
X238085333Y48555638D01*
X238180571Y48603257D01*
X238704380Y48603257D01*
X238656761Y49460400D02*
X238704380Y49365161D01*
X238704380Y49174685D01*
X238656761Y49079447D01*
X238561523Y49031828D01*
X238180571Y49031828D01*
X238085333Y49079447D01*
X238037714Y49174685D01*
X238037714Y49365161D01*
X238085333Y49460400D01*
X238180571Y49508019D01*
X238275809Y49508019D01*
X238371047Y49031828D01*
X238704380Y50079447D02*
X238656761Y49984209D01*
X238609142Y49936590D01*
X238513904Y49888971D01*
X238228190Y49888971D01*
X238132952Y49936590D01*
X238085333Y49984209D01*
X238037714Y50079447D01*
X238037714Y50222304D01*
X238085333Y50317542D01*
X238132952Y50365161D01*
X238228190Y50412780D01*
X238513904Y50412780D01*
X238609142Y50365161D01*
X238656761Y50317542D01*
X238704380Y50222304D01*
X238704380Y50079447D01*
X238037714Y50841352D02*
X239037714Y50841352D01*
X238085333Y50841352D02*
X238037714Y50936590D01*
X238037714Y51127066D01*
X238085333Y51222304D01*
X238132952Y51269923D01*
X238228190Y51317542D01*
X238513904Y51317542D01*
X238609142Y51269923D01*
X238656761Y51222304D01*
X238704380Y51127066D01*
X238704380Y50936590D01*
X238656761Y50841352D01*
X238704380Y51746114D02*
X238037714Y51746114D01*
X237704380Y51746114D02*
X237752000Y51698495D01*
X237799619Y51746114D01*
X237752000Y51793733D01*
X237704380Y51746114D01*
X237799619Y51746114D01*
X238704380Y52127066D02*
X238037714Y52650876D01*
X238037714Y52127066D02*
X238704380Y52650876D01*
X238656761Y53412780D02*
X238704380Y53317542D01*
X238704380Y53127066D01*
X238656761Y53031828D01*
X238561523Y52984209D01*
X238180571Y52984209D01*
X238085333Y53031828D01*
X238037714Y53127066D01*
X238037714Y53317542D01*
X238085333Y53412780D01*
X238180571Y53460400D01*
X238275809Y53460400D01*
X238371047Y52984209D01*
X238704380Y54031828D02*
X238656761Y53936590D01*
X238561523Y53888971D01*
X237704380Y53888971D01*
X238656761Y54365161D02*
X238704380Y54460400D01*
X238704380Y54650876D01*
X238656761Y54746114D01*
X238561523Y54793733D01*
X238513904Y54793733D01*
X238418666Y54746114D01*
X238371047Y54650876D01*
X238371047Y54508019D01*
X238323428Y54412780D01*
X238228190Y54365161D01*
X238180571Y54365161D01*
X238085333Y54412780D01*
X238037714Y54508019D01*
X238037714Y54650876D01*
X238085333Y54746114D01*
X239085333Y55127066D02*
X239037714Y55174685D01*
X238894857Y55269923D01*
X238799619Y55317542D01*
X238656761Y55365161D01*
X238418666Y55412780D01*
X238228190Y55412780D01*
X237990095Y55365161D01*
X237847238Y55317542D01*
X237752000Y55269923D01*
X237609142Y55174685D01*
X237561523Y55127066D01*
X240787180Y46209580D02*
X240263371Y46209580D01*
X240168133Y46161961D01*
X240120514Y46066723D01*
X240120514Y45876247D01*
X240168133Y45781009D01*
X240739561Y46209580D02*
X240787180Y46114342D01*
X240787180Y45876247D01*
X240739561Y45781009D01*
X240644323Y45733390D01*
X240549085Y45733390D01*
X240453847Y45781009D01*
X240406228Y45876247D01*
X240406228Y46114342D01*
X240358609Y46209580D01*
X240787180Y47114342D02*
X239787180Y47114342D01*
X240739561Y47114342D02*
X240787180Y47019104D01*
X240787180Y46828628D01*
X240739561Y46733390D01*
X240691942Y46685771D01*
X240596704Y46638152D01*
X240310990Y46638152D01*
X240215752Y46685771D01*
X240168133Y46733390D01*
X240120514Y46828628D01*
X240120514Y47019104D01*
X240168133Y47114342D01*
X240787180Y48019104D02*
X240263371Y48019104D01*
X240168133Y47971485D01*
X240120514Y47876247D01*
X240120514Y47685771D01*
X240168133Y47590533D01*
X240739561Y48019104D02*
X240787180Y47923866D01*
X240787180Y47685771D01*
X240739561Y47590533D01*
X240644323Y47542914D01*
X240549085Y47542914D01*
X240453847Y47590533D01*
X240406228Y47685771D01*
X240406228Y47923866D01*
X240358609Y48019104D01*
X240120514Y48352438D02*
X240120514Y48733390D01*
X240787180Y48495295D02*
X239930038Y48495295D01*
X239834800Y48542914D01*
X239787180Y48638152D01*
X239787180Y48733390D01*
X240787180Y49066723D02*
X240120514Y49066723D01*
X240310990Y49066723D02*
X240215752Y49114342D01*
X240168133Y49161961D01*
X240120514Y49257200D01*
X240120514Y49352438D01*
X240120514Y50114342D02*
X240787180Y50114342D01*
X240120514Y49685771D02*
X240644323Y49685771D01*
X240739561Y49733390D01*
X240787180Y49828628D01*
X240787180Y49971485D01*
X240739561Y50066723D01*
X240691942Y50114342D01*
X240787180Y50590533D02*
X240120514Y50590533D01*
X239787180Y50590533D02*
X239834800Y50542914D01*
X239882419Y50590533D01*
X239834800Y50638152D01*
X239787180Y50590533D01*
X239882419Y50590533D01*
X240120514Y50923866D02*
X240120514Y51304819D01*
X239787180Y51066723D02*
X240644323Y51066723D01*
X240739561Y51114342D01*
X240787180Y51209580D01*
X240787180Y51304819D01*
X240120514Y52352438D02*
X240120514Y53066723D01*
X239691942Y52638152D02*
X240977657Y52352438D01*
X240549085Y52971485D02*
X240549085Y52257200D01*
X240977657Y52685771D02*
X239691942Y52971485D01*
X240787180Y53923866D02*
X240787180Y53352438D01*
X240787180Y53638152D02*
X239787180Y53638152D01*
X239930038Y53542914D01*
X240025276Y53447676D01*
X240072895Y53352438D01*
X240120514Y54781009D02*
X240787180Y54781009D01*
X239739561Y54542914D02*
X240453847Y54304819D01*
X240453847Y54923866D01*
X239882419Y55257200D02*
X239834800Y55304819D01*
X239787180Y55400057D01*
X239787180Y55638152D01*
X239834800Y55733390D01*
X239882419Y55781009D01*
X239977657Y55828628D01*
X240072895Y55828628D01*
X240215752Y55781009D01*
X240787180Y55209580D01*
X240787180Y55828628D01*
X239787180Y56685771D02*
X239787180Y56495295D01*
X239834800Y56400057D01*
X239882419Y56352438D01*
X240025276Y56257200D01*
X240215752Y56209580D01*
X240596704Y56209580D01*
X240691942Y56257200D01*
X240739561Y56304819D01*
X240787180Y56400057D01*
X240787180Y56590533D01*
X240739561Y56685771D01*
X240691942Y56733390D01*
X240596704Y56781009D01*
X240358609Y56781009D01*
X240263371Y56733390D01*
X240215752Y56685771D01*
X240168133Y56590533D01*
X240168133Y56400057D01*
X240215752Y56304819D01*
X240263371Y56257200D01*
X240358609Y56209580D01*
X227661942Y84551342D02*
X227576228Y84465628D01*
X227319085Y84379914D01*
X227147657Y84379914D01*
X226890514Y84465628D01*
X226719085Y84637057D01*
X226633371Y84808485D01*
X226547657Y85151342D01*
X226547657Y85408485D01*
X226633371Y85751342D01*
X226719085Y85922771D01*
X226890514Y86094200D01*
X227147657Y86179914D01*
X227319085Y86179914D01*
X227576228Y86094200D01*
X227661942Y86008485D01*
X228776228Y86179914D02*
X229119085Y86179914D01*
X229290514Y86094200D01*
X229461942Y85922771D01*
X229547657Y85579914D01*
X229547657Y84979914D01*
X229461942Y84637057D01*
X229290514Y84465628D01*
X229119085Y84379914D01*
X228776228Y84379914D01*
X228604800Y84465628D01*
X228433371Y84637057D01*
X228347657Y84979914D01*
X228347657Y85579914D01*
X228433371Y85922771D01*
X228604800Y86094200D01*
X228776228Y86179914D01*
X230233371Y86008485D02*
X230319085Y86094200D01*
X230490514Y86179914D01*
X230919085Y86179914D01*
X231090514Y86094200D01*
X231176228Y86008485D01*
X231261942Y85837057D01*
X231261942Y85665628D01*
X231176228Y85408485D01*
X230147657Y84379914D01*
X231261942Y84379914D01*
X224361942Y81529914D02*
X224361942Y83329914D01*
X224961942Y82044200D01*
X225561942Y83329914D01*
X225561942Y81529914D01*
X226676228Y81529914D02*
X226504800Y81615628D01*
X226419085Y81701342D01*
X226333371Y81872771D01*
X226333371Y82387057D01*
X226419085Y82558485D01*
X226504800Y82644200D01*
X226676228Y82729914D01*
X226933371Y82729914D01*
X227104800Y82644200D01*
X227190514Y82558485D01*
X227276228Y82387057D01*
X227276228Y81872771D01*
X227190514Y81701342D01*
X227104800Y81615628D01*
X226933371Y81529914D01*
X226676228Y81529914D01*
X228047657Y82729914D02*
X228047657Y81529914D01*
X228047657Y82558485D02*
X228133371Y82644200D01*
X228304800Y82729914D01*
X228561942Y82729914D01*
X228733371Y82644200D01*
X228819085Y82472771D01*
X228819085Y81529914D01*
X229676228Y81529914D02*
X229676228Y82729914D01*
X229676228Y83329914D02*
X229590514Y83244200D01*
X229676228Y83158485D01*
X229761942Y83244200D01*
X229676228Y83329914D01*
X229676228Y83158485D01*
X230276228Y82729914D02*
X230961942Y82729914D01*
X230533371Y83329914D02*
X230533371Y81787057D01*
X230619085Y81615628D01*
X230790514Y81529914D01*
X230961942Y81529914D01*
X231819085Y81529914D02*
X231647657Y81615628D01*
X231561942Y81701342D01*
X231476228Y81872771D01*
X231476228Y82387057D01*
X231561942Y82558485D01*
X231647657Y82644200D01*
X231819085Y82729914D01*
X232076228Y82729914D01*
X232247657Y82644200D01*
X232333371Y82558485D01*
X232419085Y82387057D01*
X232419085Y81872771D01*
X232333371Y81701342D01*
X232247657Y81615628D01*
X232076228Y81529914D01*
X231819085Y81529914D01*
X233190514Y81529914D02*
X233190514Y82729914D01*
X233190514Y82387057D02*
X233276228Y82558485D01*
X233361942Y82644200D01*
X233533371Y82729914D01*
X233704800Y82729914D01*
X194284685Y32250800D02*
X194198971Y32293657D01*
X194070400Y32293657D01*
X193941828Y32250800D01*
X193856114Y32165085D01*
X193813257Y32079371D01*
X193770400Y31907942D01*
X193770400Y31779371D01*
X193813257Y31607942D01*
X193856114Y31522228D01*
X193941828Y31436514D01*
X194070400Y31393657D01*
X194156114Y31393657D01*
X194284685Y31436514D01*
X194327542Y31479371D01*
X194327542Y31779371D01*
X194156114Y31779371D01*
X194713257Y31393657D02*
X194713257Y32293657D01*
X195227542Y31393657D01*
X195227542Y32293657D01*
X195656114Y31393657D02*
X195656114Y32293657D01*
X195870400Y32293657D01*
X195998971Y32250800D01*
X196084685Y32165085D01*
X196127542Y32079371D01*
X196170400Y31907942D01*
X196170400Y31779371D01*
X196127542Y31607942D01*
X196084685Y31522228D01*
X195998971Y31436514D01*
X195870400Y31393657D01*
X195656114Y31393657D01*
X194183085Y12438800D02*
X194097371Y12481657D01*
X193968800Y12481657D01*
X193840228Y12438800D01*
X193754514Y12353085D01*
X193711657Y12267371D01*
X193668800Y12095942D01*
X193668800Y11967371D01*
X193711657Y11795942D01*
X193754514Y11710228D01*
X193840228Y11624514D01*
X193968800Y11581657D01*
X194054514Y11581657D01*
X194183085Y11624514D01*
X194225942Y11667371D01*
X194225942Y11967371D01*
X194054514Y11967371D01*
X194611657Y11581657D02*
X194611657Y12481657D01*
X195125942Y11581657D01*
X195125942Y12481657D01*
X195554514Y11581657D02*
X195554514Y12481657D01*
X195768800Y12481657D01*
X195897371Y12438800D01*
X195983085Y12353085D01*
X196025942Y12267371D01*
X196068800Y12095942D01*
X196068800Y11967371D01*
X196025942Y11795942D01*
X195983085Y11710228D01*
X195897371Y11624514D01*
X195768800Y11581657D01*
X195554514Y11581657D01*
X203379180Y4383819D02*
X203379180Y4907628D01*
X203331561Y5002866D01*
X203236323Y5050485D01*
X203045847Y5050485D01*
X202950609Y5002866D01*
X203379180Y4431438D02*
X203283942Y4383819D01*
X203045847Y4383819D01*
X202950609Y4431438D01*
X202902990Y4526676D01*
X202902990Y4621914D01*
X202950609Y4717152D01*
X203045847Y4764771D01*
X203283942Y4764771D01*
X203379180Y4812390D01*
X204283942Y4383819D02*
X204283942Y5383819D01*
X204283942Y4431438D02*
X204188704Y4383819D01*
X203998228Y4383819D01*
X203902990Y4431438D01*
X203855371Y4479057D01*
X203807752Y4574295D01*
X203807752Y4860009D01*
X203855371Y4955247D01*
X203902990Y5002866D01*
X203998228Y5050485D01*
X204188704Y5050485D01*
X204283942Y5002866D01*
X205188704Y4383819D02*
X205188704Y4907628D01*
X205141085Y5002866D01*
X205045847Y5050485D01*
X204855371Y5050485D01*
X204760133Y5002866D01*
X205188704Y4431438D02*
X205093466Y4383819D01*
X204855371Y4383819D01*
X204760133Y4431438D01*
X204712514Y4526676D01*
X204712514Y4621914D01*
X204760133Y4717152D01*
X204855371Y4764771D01*
X205093466Y4764771D01*
X205188704Y4812390D01*
X205522038Y5050485D02*
X205902990Y5050485D01*
X205664895Y4383819D02*
X205664895Y5240961D01*
X205712514Y5336200D01*
X205807752Y5383819D01*
X205902990Y5383819D01*
X206236323Y4383819D02*
X206236323Y5050485D01*
X206236323Y4860009D02*
X206283942Y4955247D01*
X206331561Y5002866D01*
X206426800Y5050485D01*
X206522038Y5050485D01*
X207283942Y5050485D02*
X207283942Y4383819D01*
X206855371Y5050485D02*
X206855371Y4526676D01*
X206902990Y4431438D01*
X206998228Y4383819D01*
X207141085Y4383819D01*
X207236323Y4431438D01*
X207283942Y4479057D01*
X207760133Y4383819D02*
X207760133Y5050485D01*
X207760133Y5383819D02*
X207712514Y5336200D01*
X207760133Y5288580D01*
X207807752Y5336200D01*
X207760133Y5383819D01*
X207760133Y5288580D01*
X208093466Y5050485D02*
X208474419Y5050485D01*
X208236323Y5383819D02*
X208236323Y4526676D01*
X208283942Y4431438D01*
X208379180Y4383819D01*
X208474419Y4383819D01*
X209522038Y5050485D02*
X210236323Y5050485D01*
X209807752Y5479057D02*
X209522038Y4193342D01*
X210141085Y4621914D02*
X209426800Y4621914D01*
X209855371Y4193342D02*
X210141085Y5479057D01*
X210998228Y5050485D02*
X210998228Y4383819D01*
X210760133Y5431438D02*
X210522038Y4717152D01*
X211141085Y4717152D01*
X211426800Y5383819D02*
X212045847Y5383819D01*
X211712514Y5002866D01*
X211855371Y5002866D01*
X211950609Y4955247D01*
X211998228Y4907628D01*
X212045847Y4812390D01*
X212045847Y4574295D01*
X211998228Y4479057D01*
X211950609Y4431438D01*
X211855371Y4383819D01*
X211569657Y4383819D01*
X211474419Y4431438D01*
X211426800Y4479057D01*
X212902990Y5383819D02*
X212712514Y5383819D01*
X212617276Y5336200D01*
X212569657Y5288580D01*
X212474419Y5145723D01*
X212426800Y4955247D01*
X212426800Y4574295D01*
X212474419Y4479057D01*
X212522038Y4431438D01*
X212617276Y4383819D01*
X212807752Y4383819D01*
X212902990Y4431438D01*
X212950609Y4479057D01*
X212998228Y4574295D01*
X212998228Y4812390D01*
X212950609Y4907628D01*
X212902990Y4955247D01*
X212807752Y5002866D01*
X212617276Y5002866D01*
X212522038Y4955247D01*
X212474419Y4907628D01*
X212426800Y4812390D01*
X213331561Y5383819D02*
X213950609Y5383819D01*
X213617276Y5002866D01*
X213760133Y5002866D01*
X213855371Y4955247D01*
X213902990Y4907628D01*
X213950609Y4812390D01*
X213950609Y4574295D01*
X213902990Y4479057D01*
X213855371Y4431438D01*
X213760133Y4383819D01*
X213474419Y4383819D01*
X213379180Y4431438D01*
X213331561Y4479057D01*
X199072271Y6892114D02*
X199072271Y8692114D01*
X199672271Y8092114D02*
X200357985Y8092114D01*
X199929414Y8692114D02*
X199929414Y7149257D01*
X200015128Y6977828D01*
X200186557Y6892114D01*
X200357985Y6892114D01*
X200872271Y6977828D02*
X201043700Y6892114D01*
X201386557Y6892114D01*
X201557985Y6977828D01*
X201643700Y7149257D01*
X201643700Y7234971D01*
X201557985Y7406400D01*
X201386557Y7492114D01*
X201129414Y7492114D01*
X200957985Y7577828D01*
X200872271Y7749257D01*
X200872271Y7834971D01*
X200957985Y8006400D01*
X201129414Y8092114D01*
X201386557Y8092114D01*
X201557985Y8006400D01*
X202243700Y8092114D02*
X202672271Y6892114D01*
X203100842Y8092114D02*
X202672271Y6892114D01*
X202500842Y6463542D01*
X202415128Y6377828D01*
X202243700Y6292114D01*
X204386557Y7834971D02*
X204643700Y7749257D01*
X204729414Y7663542D01*
X204815128Y7492114D01*
X204815128Y7234971D01*
X204729414Y7063542D01*
X204643700Y6977828D01*
X204472271Y6892114D01*
X203786557Y6892114D01*
X203786557Y8692114D01*
X204386557Y8692114D01*
X204557985Y8606400D01*
X204643700Y8520685D01*
X204729414Y8349257D01*
X204729414Y8177828D01*
X204643700Y8006400D01*
X204557985Y7920685D01*
X204386557Y7834971D01*
X203786557Y7834971D01*
X205586557Y6892114D02*
X205586557Y8092114D01*
X205586557Y8692114D02*
X205500842Y8606400D01*
X205586557Y8520685D01*
X205672271Y8606400D01*
X205586557Y8692114D01*
X205586557Y8520685D01*
X206186557Y8092114D02*
X206872271Y8092114D01*
X206443700Y8692114D02*
X206443700Y7149257D01*
X206529414Y6977828D01*
X206700842Y6892114D01*
X206872271Y6892114D01*
X207386557Y6977828D02*
X207557985Y6892114D01*
X207900842Y6892114D01*
X208072271Y6977828D01*
X208157985Y7149257D01*
X208157985Y7234971D01*
X208072271Y7406400D01*
X207900842Y7492114D01*
X207643700Y7492114D01*
X207472271Y7577828D01*
X207386557Y7749257D01*
X207386557Y7834971D01*
X207472271Y8006400D01*
X207643700Y8092114D01*
X207900842Y8092114D01*
X208072271Y8006400D01*
X208757985Y8092114D02*
X209186557Y6892114D01*
X209615128Y8092114D02*
X209186557Y6892114D01*
X209015128Y6463542D01*
X208929414Y6377828D01*
X208757985Y6292114D01*
X211586557Y7406400D02*
X212443700Y7406400D01*
X211415128Y6892114D02*
X212015128Y8692114D01*
X212615128Y6892114D01*
X213215128Y6892114D02*
X213215128Y8092114D01*
X213215128Y8692114D02*
X213129414Y8606400D01*
X213215128Y8520685D01*
X213300842Y8606400D01*
X213215128Y8692114D01*
X213215128Y8520685D01*
X214072271Y6892114D02*
X214072271Y8092114D01*
X214072271Y7749257D02*
X214157985Y7920685D01*
X214243700Y8006400D01*
X214415128Y8092114D01*
X214586557Y8092114D01*
X215443700Y6892114D02*
X215272271Y6977828D01*
X215186557Y7149257D01*
X215186557Y8692114D01*
X216129414Y6892114D02*
X216129414Y8092114D01*
X216129414Y8692114D02*
X216043700Y8606400D01*
X216129414Y8520685D01*
X216215128Y8606400D01*
X216129414Y8692114D01*
X216129414Y8520685D01*
X216729414Y8092114D02*
X217415128Y8092114D01*
X216986557Y6892114D02*
X216986557Y8434971D01*
X217072271Y8606400D01*
X217243700Y8692114D01*
X217415128Y8692114D01*
X217757985Y8092114D02*
X218443700Y8092114D01*
X218015128Y8692114D02*
X218015128Y7149257D01*
X218100842Y6977828D01*
X218272271Y6892114D01*
X218443700Y6892114D01*
X202459380Y24077619D02*
X202459380Y24601428D01*
X202411761Y24696666D01*
X202316523Y24744285D01*
X202126047Y24744285D01*
X202030809Y24696666D01*
X202459380Y24125238D02*
X202364142Y24077619D01*
X202126047Y24077619D01*
X202030809Y24125238D01*
X201983190Y24220476D01*
X201983190Y24315714D01*
X202030809Y24410952D01*
X202126047Y24458571D01*
X202364142Y24458571D01*
X202459380Y24506190D01*
X203364142Y24077619D02*
X203364142Y25077619D01*
X203364142Y24125238D02*
X203268904Y24077619D01*
X203078428Y24077619D01*
X202983190Y24125238D01*
X202935571Y24172857D01*
X202887952Y24268095D01*
X202887952Y24553809D01*
X202935571Y24649047D01*
X202983190Y24696666D01*
X203078428Y24744285D01*
X203268904Y24744285D01*
X203364142Y24696666D01*
X204268904Y24077619D02*
X204268904Y24601428D01*
X204221285Y24696666D01*
X204126047Y24744285D01*
X203935571Y24744285D01*
X203840333Y24696666D01*
X204268904Y24125238D02*
X204173666Y24077619D01*
X203935571Y24077619D01*
X203840333Y24125238D01*
X203792714Y24220476D01*
X203792714Y24315714D01*
X203840333Y24410952D01*
X203935571Y24458571D01*
X204173666Y24458571D01*
X204268904Y24506190D01*
X204602238Y24744285D02*
X204983190Y24744285D01*
X204745095Y24077619D02*
X204745095Y24934761D01*
X204792714Y25030000D01*
X204887952Y25077619D01*
X204983190Y25077619D01*
X205316523Y24077619D02*
X205316523Y24744285D01*
X205316523Y24553809D02*
X205364142Y24649047D01*
X205411761Y24696666D01*
X205507000Y24744285D01*
X205602238Y24744285D01*
X206364142Y24744285D02*
X206364142Y24077619D01*
X205935571Y24744285D02*
X205935571Y24220476D01*
X205983190Y24125238D01*
X206078428Y24077619D01*
X206221285Y24077619D01*
X206316523Y24125238D01*
X206364142Y24172857D01*
X206840333Y24077619D02*
X206840333Y24744285D01*
X206840333Y25077619D02*
X206792714Y25030000D01*
X206840333Y24982380D01*
X206887952Y25030000D01*
X206840333Y25077619D01*
X206840333Y24982380D01*
X207173666Y24744285D02*
X207554619Y24744285D01*
X207316523Y25077619D02*
X207316523Y24220476D01*
X207364142Y24125238D01*
X207459380Y24077619D01*
X207554619Y24077619D01*
X208602238Y24744285D02*
X209316523Y24744285D01*
X208887952Y25172857D02*
X208602238Y23887142D01*
X209221285Y24315714D02*
X208507000Y24315714D01*
X208935571Y23887142D02*
X209221285Y25172857D01*
X209554619Y25077619D02*
X210173666Y25077619D01*
X209840333Y24696666D01*
X209983190Y24696666D01*
X210078428Y24649047D01*
X210126047Y24601428D01*
X210173666Y24506190D01*
X210173666Y24268095D01*
X210126047Y24172857D01*
X210078428Y24125238D01*
X209983190Y24077619D01*
X209697476Y24077619D01*
X209602238Y24125238D01*
X209554619Y24172857D01*
X210745095Y24649047D02*
X210649857Y24696666D01*
X210602238Y24744285D01*
X210554619Y24839523D01*
X210554619Y24887142D01*
X210602238Y24982380D01*
X210649857Y25030000D01*
X210745095Y25077619D01*
X210935571Y25077619D01*
X211030809Y25030000D01*
X211078428Y24982380D01*
X211126047Y24887142D01*
X211126047Y24839523D01*
X211078428Y24744285D01*
X211030809Y24696666D01*
X210935571Y24649047D01*
X210745095Y24649047D01*
X210649857Y24601428D01*
X210602238Y24553809D01*
X210554619Y24458571D01*
X210554619Y24268095D01*
X210602238Y24172857D01*
X210649857Y24125238D01*
X210745095Y24077619D01*
X210935571Y24077619D01*
X211030809Y24125238D01*
X211078428Y24172857D01*
X211126047Y24268095D01*
X211126047Y24458571D01*
X211078428Y24553809D01*
X211030809Y24601428D01*
X210935571Y24649047D01*
X211745095Y25077619D02*
X211840333Y25077619D01*
X211935571Y25030000D01*
X211983190Y24982380D01*
X212030809Y24887142D01*
X212078428Y24696666D01*
X212078428Y24458571D01*
X212030809Y24268095D01*
X211983190Y24172857D01*
X211935571Y24125238D01*
X211840333Y24077619D01*
X211745095Y24077619D01*
X211649857Y24125238D01*
X211602238Y24172857D01*
X211554619Y24268095D01*
X211507000Y24458571D01*
X211507000Y24696666D01*
X211554619Y24887142D01*
X211602238Y24982380D01*
X211649857Y25030000D01*
X211745095Y25077619D01*
X212697476Y25077619D02*
X212792714Y25077619D01*
X212887952Y25030000D01*
X212935571Y24982380D01*
X212983190Y24887142D01*
X213030809Y24696666D01*
X213030809Y24458571D01*
X212983190Y24268095D01*
X212935571Y24172857D01*
X212887952Y24125238D01*
X212792714Y24077619D01*
X212697476Y24077619D01*
X212602238Y24125238D01*
X212554619Y24172857D01*
X212507000Y24268095D01*
X212459380Y24458571D01*
X212459380Y24696666D01*
X212507000Y24887142D01*
X212554619Y24982380D01*
X212602238Y25030000D01*
X212697476Y25077619D01*
D10*
X236797600Y73355200D02*
G75*
G03*
X236797600Y73355200I-2000000J0D01*
G01*
D11*
X229984323Y29143295D02*
X229793847Y29238533D01*
X229698609Y29333771D01*
X229603371Y29524247D01*
X229603371Y29619485D01*
X229698609Y29809961D01*
X229793847Y29905200D01*
X229984323Y30000438D01*
X230365276Y30000438D01*
X230555752Y29905200D01*
X230650990Y29809961D01*
X230746228Y29619485D01*
X230746228Y29524247D01*
X230650990Y29333771D01*
X230555752Y29238533D01*
X230365276Y29143295D01*
X229984323Y29143295D01*
X229793847Y29048057D01*
X229698609Y28952819D01*
X229603371Y28762342D01*
X229603371Y28381390D01*
X229698609Y28190914D01*
X229793847Y28095676D01*
X229984323Y28000438D01*
X230365276Y28000438D01*
X230555752Y28095676D01*
X230650990Y28190914D01*
X230746228Y28381390D01*
X230746228Y28762342D01*
X230650990Y28952819D01*
X230555752Y29048057D01*
X230365276Y29143295D01*
X229660533Y36198038D02*
X230993866Y36198038D01*
X230136723Y34198038D01*
X230657352Y42751238D02*
X230276400Y42751238D01*
X230085923Y42656000D01*
X229990685Y42560761D01*
X229800209Y42275047D01*
X229704971Y41894095D01*
X229704971Y41132190D01*
X229800209Y40941714D01*
X229895447Y40846476D01*
X230085923Y40751238D01*
X230466876Y40751238D01*
X230657352Y40846476D01*
X230752590Y40941714D01*
X230847828Y41132190D01*
X230847828Y41608380D01*
X230752590Y41798857D01*
X230657352Y41894095D01*
X230466876Y41989333D01*
X230085923Y41989333D01*
X229895447Y41894095D01*
X229800209Y41798857D01*
X229704971Y41608380D01*
X230650990Y49202838D02*
X229698609Y49202838D01*
X229603371Y48250457D01*
X229698609Y48345695D01*
X229889085Y48440933D01*
X230365276Y48440933D01*
X230555752Y48345695D01*
X230650990Y48250457D01*
X230746228Y48059980D01*
X230746228Y47583790D01*
X230650990Y47393314D01*
X230555752Y47298076D01*
X230365276Y47202838D01*
X229889085Y47202838D01*
X229698609Y47298076D01*
X229603371Y47393314D01*
X230606552Y54835371D02*
X230606552Y53502038D01*
X230130361Y55597276D02*
X229654171Y54168704D01*
X230892266Y54168704D01*
X229609733Y61801238D02*
X230847828Y61801238D01*
X230181161Y61039333D01*
X230466876Y61039333D01*
X230657352Y60944095D01*
X230752590Y60848857D01*
X230847828Y60658380D01*
X230847828Y60182190D01*
X230752590Y59991714D01*
X230657352Y59896476D01*
X230466876Y59801238D01*
X229895447Y59801238D01*
X229704971Y59896476D01*
X229609733Y59991714D01*
X229704971Y67808361D02*
X229800209Y67903600D01*
X229990685Y67998838D01*
X230466876Y67998838D01*
X230657352Y67903600D01*
X230752590Y67808361D01*
X230847828Y67617885D01*
X230847828Y67427409D01*
X230752590Y67141695D01*
X229609733Y65998838D01*
X230847828Y65998838D01*
X230797028Y72501238D02*
X229654171Y72501238D01*
X230225600Y72501238D02*
X230225600Y74501238D01*
X230035123Y74215523D01*
X229844647Y74025047D01*
X229654171Y73929809D01*
D10*
X236797600Y28905200D02*
G75*
G03*
X236797600Y28905200I-2000000J0D01*
G01*
X236797600Y35255200D02*
G75*
G03*
X236797600Y35255200I-2000000J0D01*
G01*
X236797600Y41605200D02*
G75*
G03*
X236797600Y41605200I-2000000J0D01*
G01*
X236797600Y47955200D02*
G75*
G03*
X236797600Y47955200I-2000000J0D01*
G01*
X236797600Y54305200D02*
G75*
G03*
X236797600Y54305200I-2000000J0D01*
G01*
X236797600Y60655200D02*
G75*
G03*
X236797600Y60655200I-2000000J0D01*
G01*
X236797600Y67005200D02*
G75*
G03*
X236797600Y67005200I-2000000J0D01*
G01*
X241377600Y38557200D02*
G75*
G03*
X241377600Y38557200I-1500000J0D01*
G01*
X241377600Y63957200D02*
G75*
G03*
X241377600Y63957200I-1500000J0D01*
G01*
X231749600Y76657200D02*
X231749600Y25857200D01*
X241909600Y25857200D02*
X231749600Y25857200D01*
X241909600Y76657200D02*
X231749600Y76657200D01*
X241909600Y76657200D02*
X241909600Y25857200D01*
D11*
X230987714Y95685000D02*
X231559142Y95685000D01*
X230873428Y95342142D02*
X231273428Y96542142D01*
X231673428Y95342142D01*
X232073428Y95342142D02*
X232073428Y96542142D01*
X232759142Y95342142D01*
X232759142Y96542142D01*
X212544576Y101359542D02*
X212492195Y101307161D01*
X212335052Y101254780D01*
X212230290Y101254780D01*
X212073147Y101307161D01*
X211968385Y101411923D01*
X211916004Y101516685D01*
X211863623Y101726209D01*
X211863623Y101883352D01*
X211916004Y102092876D01*
X211968385Y102197638D01*
X212073147Y102302400D01*
X212230290Y102354780D01*
X212335052Y102354780D01*
X212492195Y102302400D01*
X212544576Y102250019D01*
X213225528Y102354780D02*
X213435052Y102354780D01*
X213539814Y102302400D01*
X213644576Y102197638D01*
X213696957Y101988114D01*
X213696957Y101621447D01*
X213644576Y101411923D01*
X213539814Y101307161D01*
X213435052Y101254780D01*
X213225528Y101254780D01*
X213120766Y101307161D01*
X213016004Y101411923D01*
X212963623Y101621447D01*
X212963623Y101988114D01*
X213016004Y102197638D01*
X213120766Y102302400D01*
X213225528Y102354780D01*
X214116004Y102250019D02*
X214168385Y102302400D01*
X214273147Y102354780D01*
X214535052Y102354780D01*
X214639814Y102302400D01*
X214692195Y102250019D01*
X214744576Y102145257D01*
X214744576Y102040495D01*
X214692195Y101883352D01*
X214063623Y101254780D01*
X214744576Y101254780D01*
X216682671Y101254780D02*
X216316004Y101778590D01*
X216054100Y101254780D02*
X216054100Y102354780D01*
X216473147Y102354780D01*
X216577909Y102302400D01*
X216630290Y102250019D01*
X216682671Y102145257D01*
X216682671Y101988114D01*
X216630290Y101883352D01*
X216577909Y101830971D01*
X216473147Y101778590D01*
X216054100Y101778590D01*
X217154100Y101830971D02*
X217520766Y101830971D01*
X217677909Y101254780D02*
X217154100Y101254780D01*
X217154100Y102354780D01*
X217677909Y102354780D01*
X217992195Y102354780D02*
X218358861Y101254780D01*
X218725528Y102354780D01*
X219930290Y101254780D02*
X219930290Y102354780D01*
X220296957Y101569066D01*
X220663623Y102354780D01*
X220663623Y101254780D01*
X191414400Y37369200D02*
X191414400Y60274200D01*
X205564285Y78492857D02*
X205650000Y78492857D01*
X205735714Y78450000D01*
X205778571Y78407142D01*
X205821428Y78321428D01*
X205864285Y78150000D01*
X205864285Y77935714D01*
X205821428Y77764285D01*
X205778571Y77678571D01*
X205735714Y77635714D01*
X205650000Y77592857D01*
X205564285Y77592857D01*
X205478571Y77635714D01*
X205435714Y77678571D01*
X205392857Y77764285D01*
X205350000Y77935714D01*
X205350000Y78150000D01*
X205392857Y78321428D01*
X205435714Y78407142D01*
X205478571Y78450000D01*
X205564285Y78492857D01*
X206250000Y77678571D02*
X206292857Y77635714D01*
X206250000Y77592857D01*
X206207142Y77635714D01*
X206250000Y77678571D01*
X206250000Y77592857D01*
X206721428Y77592857D02*
X206892857Y77592857D01*
X206978571Y77635714D01*
X207021428Y77678571D01*
X207107142Y77807142D01*
X207150000Y77978571D01*
X207150000Y78321428D01*
X207107142Y78407142D01*
X207064285Y78450000D01*
X206978571Y78492857D01*
X206807142Y78492857D01*
X206721428Y78450000D01*
X206678571Y78407142D01*
X206635714Y78321428D01*
X206635714Y78107142D01*
X206678571Y78021428D01*
X206721428Y77978571D01*
X206807142Y77935714D01*
X206978571Y77935714D01*
X207064285Y77978571D01*
X207107142Y78021428D01*
X207150000Y78107142D01*
X207921428Y78492857D02*
X207750000Y78492857D01*
X207664285Y78450000D01*
X207621428Y78407142D01*
X207535714Y78278571D01*
X207492857Y78107142D01*
X207492857Y77764285D01*
X207535714Y77678571D01*
X207578571Y77635714D01*
X207664285Y77592857D01*
X207835714Y77592857D01*
X207921428Y77635714D01*
X207964285Y77678571D01*
X208007142Y77764285D01*
X208007142Y77978571D01*
X207964285Y78064285D01*
X207921428Y78107142D01*
X207835714Y78150000D01*
X207664285Y78150000D01*
X207578571Y78107142D01*
X207535714Y78064285D01*
X207492857Y77978571D01*
X208392857Y77592857D02*
X208392857Y78192857D01*
X208392857Y78492857D02*
X208350000Y78450000D01*
X208392857Y78407142D01*
X208435714Y78450000D01*
X208392857Y78492857D01*
X208392857Y78407142D01*
X208821428Y78192857D02*
X208821428Y77592857D01*
X208821428Y78107142D02*
X208864285Y78150000D01*
X208950000Y78192857D01*
X209078571Y78192857D01*
X209164285Y78150000D01*
X209207142Y78064285D01*
X209207142Y77592857D01*
X210792857Y77592857D02*
X210278571Y77592857D01*
X210535714Y77592857D02*
X210535714Y78492857D01*
X210450000Y78364285D01*
X210364285Y78278571D01*
X210278571Y78235714D01*
X211135714Y78407142D02*
X211178571Y78450000D01*
X211264285Y78492857D01*
X211478571Y78492857D01*
X211564285Y78450000D01*
X211607142Y78407142D01*
X211650000Y78321428D01*
X211650000Y78235714D01*
X211607142Y78107142D01*
X211092857Y77592857D01*
X211650000Y77592857D01*
X212164285Y78107142D02*
X212078571Y78150000D01*
X212035714Y78192857D01*
X211992857Y78278571D01*
X211992857Y78321428D01*
X212035714Y78407142D01*
X212078571Y78450000D01*
X212164285Y78492857D01*
X212335714Y78492857D01*
X212421428Y78450000D01*
X212464285Y78407142D01*
X212507142Y78321428D01*
X212507142Y78278571D01*
X212464285Y78192857D01*
X212421428Y78150000D01*
X212335714Y78107142D01*
X212164285Y78107142D01*
X212078571Y78064285D01*
X212035714Y78021428D01*
X211992857Y77935714D01*
X211992857Y77764285D01*
X212035714Y77678571D01*
X212078571Y77635714D01*
X212164285Y77592857D01*
X212335714Y77592857D01*
X212421428Y77635714D01*
X212464285Y77678571D01*
X212507142Y77764285D01*
X212507142Y77935714D01*
X212464285Y78021428D01*
X212421428Y78064285D01*
X212335714Y78107142D01*
X212807142Y77592857D02*
X213278571Y78192857D01*
X212807142Y78192857D02*
X213278571Y77592857D01*
X214007142Y78492857D02*
X213835714Y78492857D01*
X213750000Y78450000D01*
X213707142Y78407142D01*
X213621428Y78278571D01*
X213578571Y78107142D01*
X213578571Y77764285D01*
X213621428Y77678571D01*
X213664285Y77635714D01*
X213750000Y77592857D01*
X213921428Y77592857D01*
X214007142Y77635714D01*
X214050000Y77678571D01*
X214092857Y77764285D01*
X214092857Y77978571D01*
X214050000Y78064285D01*
X214007142Y78107142D01*
X213921428Y78150000D01*
X213750000Y78150000D01*
X213664285Y78107142D01*
X213621428Y78064285D01*
X213578571Y77978571D01*
X214864285Y78192857D02*
X214864285Y77592857D01*
X214650000Y78535714D02*
X214435714Y77892857D01*
X214992857Y77892857D01*
X202254642Y92021428D02*
X202254642Y93521428D01*
X202897500Y92021428D02*
X202897500Y92807142D01*
X202826071Y92950000D01*
X202683214Y93021428D01*
X202468928Y93021428D01*
X202326071Y92950000D01*
X202254642Y92878571D01*
X203397500Y93021428D02*
X203968928Y93021428D01*
X203611785Y93521428D02*
X203611785Y92235714D01*
X203683214Y92092857D01*
X203826071Y92021428D01*
X203968928Y92021428D01*
X204254642Y93021428D02*
X204826071Y93021428D01*
X204468928Y93521428D02*
X204468928Y92235714D01*
X204540357Y92092857D01*
X204683214Y92021428D01*
X204826071Y92021428D01*
X205326071Y93021428D02*
X205326071Y91521428D01*
X205326071Y92950000D02*
X205468928Y93021428D01*
X205754642Y93021428D01*
X205897500Y92950000D01*
X205968928Y92878571D01*
X206040357Y92735714D01*
X206040357Y92307142D01*
X205968928Y92164285D01*
X205897500Y92092857D01*
X205754642Y92021428D01*
X205468928Y92021428D01*
X205326071Y92092857D01*
X206683214Y92164285D02*
X206754642Y92092857D01*
X206683214Y92021428D01*
X206611785Y92092857D01*
X206683214Y92164285D01*
X206683214Y92021428D01*
X206683214Y92950000D02*
X206754642Y92878571D01*
X206683214Y92807142D01*
X206611785Y92878571D01*
X206683214Y92950000D01*
X206683214Y92807142D01*
X208468928Y93592857D02*
X207183214Y91664285D01*
X210040357Y93592857D02*
X208754642Y91664285D01*
X210540357Y93021428D02*
X210540357Y91521428D01*
X210540357Y92950000D02*
X210683214Y93021428D01*
X210968928Y93021428D01*
X211111785Y92950000D01*
X211183214Y92878571D01*
X211254642Y92735714D01*
X211254642Y92307142D01*
X211183214Y92164285D01*
X211111785Y92092857D01*
X210968928Y92021428D01*
X210683214Y92021428D01*
X210540357Y92092857D01*
X211754642Y93021428D02*
X212111785Y92021428D01*
X212468928Y93021428D01*
X213254642Y92021428D02*
X213111785Y92092857D01*
X213040357Y92164285D01*
X212968928Y92307142D01*
X212968928Y92735714D01*
X213040357Y92878571D01*
X213111785Y92950000D01*
X213254642Y93021428D01*
X213468928Y93021428D01*
X213611785Y92950000D01*
X213683214Y92878571D01*
X213754642Y92735714D01*
X213754642Y92307142D01*
X213683214Y92164285D01*
X213611785Y92092857D01*
X213468928Y92021428D01*
X213254642Y92021428D01*
X214326071Y92092857D02*
X214468928Y92021428D01*
X214754642Y92021428D01*
X214897500Y92092857D01*
X214968928Y92235714D01*
X214968928Y92307142D01*
X214897500Y92450000D01*
X214754642Y92521428D01*
X214540357Y92521428D01*
X214397500Y92592857D01*
X214326071Y92735714D01*
X214326071Y92807142D01*
X214397500Y92950000D01*
X214540357Y93021428D01*
X214754642Y93021428D01*
X214897500Y92950000D01*
X215611785Y92164285D02*
X215683214Y92092857D01*
X215611785Y92021428D01*
X215540357Y92092857D01*
X215611785Y92164285D01*
X215611785Y92021428D01*
X216540357Y92021428D02*
X216397500Y92092857D01*
X216326071Y92164285D01*
X216254642Y92307142D01*
X216254642Y92735714D01*
X216326071Y92878571D01*
X216397500Y92950000D01*
X216540357Y93021428D01*
X216754642Y93021428D01*
X216897500Y92950000D01*
X216968928Y92878571D01*
X217040357Y92735714D01*
X217040357Y92307142D01*
X216968928Y92164285D01*
X216897500Y92092857D01*
X216754642Y92021428D01*
X216540357Y92021428D01*
X217683214Y92021428D02*
X217683214Y93021428D01*
X217683214Y92735714D02*
X217754642Y92878571D01*
X217826071Y92950000D01*
X217968928Y93021428D01*
X218111785Y93021428D01*
X219254642Y93021428D02*
X219254642Y91807142D01*
X219183214Y91664285D01*
X219111785Y91592857D01*
X218968928Y91521428D01*
X218754642Y91521428D01*
X218611785Y91592857D01*
X219254642Y92092857D02*
X219111785Y92021428D01*
X218826071Y92021428D01*
X218683214Y92092857D01*
X218611785Y92164285D01*
X218540357Y92307142D01*
X218540357Y92735714D01*
X218611785Y92878571D01*
X218683214Y92950000D01*
X218826071Y93021428D01*
X219111785Y93021428D01*
X219254642Y92950000D01*
X221040357Y93592857D02*
X219754642Y91664285D01*
X222183214Y92092857D02*
X222040357Y92021428D01*
X221754642Y92021428D01*
X221611785Y92092857D01*
X221540357Y92164285D01*
X221468928Y92307142D01*
X221468928Y92735714D01*
X221540357Y92878571D01*
X221611785Y92950000D01*
X221754642Y93021428D01*
X222040357Y93021428D01*
X222183214Y92950000D01*
X223040357Y92021428D02*
X222897500Y92092857D01*
X222826071Y92164285D01*
X222754642Y92307142D01*
X222754642Y92735714D01*
X222826071Y92878571D01*
X222897500Y92950000D01*
X223040357Y93021428D01*
X223254642Y93021428D01*
X223397500Y92950000D01*
X223468928Y92878571D01*
X223540357Y92735714D01*
X223540357Y92307142D01*
X223468928Y92164285D01*
X223397500Y92092857D01*
X223254642Y92021428D01*
X223040357Y92021428D01*
X224111785Y93378571D02*
X224183214Y93450000D01*
X224326071Y93521428D01*
X224683214Y93521428D01*
X224826071Y93450000D01*
X224897500Y93378571D01*
X224968928Y93235714D01*
X224968928Y93092857D01*
X224897500Y92878571D01*
X224040357Y92021428D01*
X224968928Y92021428D01*
X226683214Y93592857D02*
X225397500Y91664285D01*
X227183214Y92021428D02*
X227183214Y93021428D01*
X227183214Y92878571D02*
X227254642Y92950000D01*
X227397500Y93021428D01*
X227611785Y93021428D01*
X227754642Y92950000D01*
X227826071Y92807142D01*
X227826071Y92021428D01*
X227826071Y92807142D02*
X227897500Y92950000D01*
X228040357Y93021428D01*
X228254642Y93021428D01*
X228397500Y92950000D01*
X228468928Y92807142D01*
X228468928Y92021428D01*
X213415714Y87860238D02*
X213558571Y87812619D01*
X213796666Y87812619D01*
X213891904Y87860238D01*
X213939523Y87907857D01*
X213987142Y88003095D01*
X213987142Y88098333D01*
X213939523Y88193571D01*
X213891904Y88241190D01*
X213796666Y88288809D01*
X213606190Y88336428D01*
X213510952Y88384047D01*
X213463333Y88431666D01*
X213415714Y88526904D01*
X213415714Y88622142D01*
X213463333Y88717380D01*
X213510952Y88765000D01*
X213606190Y88812619D01*
X213844285Y88812619D01*
X213987142Y88765000D01*
X214415714Y87812619D02*
X214415714Y88812619D01*
X214653809Y88812619D01*
X214796666Y88765000D01*
X214891904Y88669761D01*
X214939523Y88574523D01*
X214987142Y88384047D01*
X214987142Y88241190D01*
X214939523Y88050714D01*
X214891904Y87955476D01*
X214796666Y87860238D01*
X214653809Y87812619D01*
X214415714Y87812619D01*
X215368095Y88098333D02*
X215844285Y88098333D01*
X215272857Y87812619D02*
X215606190Y88812619D01*
X215939523Y87812619D01*
X210416923Y87860238D02*
X210559780Y87812619D01*
X210797876Y87812619D01*
X210893114Y87860238D01*
X210940733Y87907857D01*
X210988352Y88003095D01*
X210988352Y88098333D01*
X210940733Y88193571D01*
X210893114Y88241190D01*
X210797876Y88288809D01*
X210607400Y88336428D01*
X210512161Y88384047D01*
X210464542Y88431666D01*
X210416923Y88526904D01*
X210416923Y88622142D01*
X210464542Y88717380D01*
X210512161Y88765000D01*
X210607400Y88812619D01*
X210845495Y88812619D01*
X210988352Y88765000D01*
X211988352Y87907857D02*
X211940733Y87860238D01*
X211797876Y87812619D01*
X211702638Y87812619D01*
X211559780Y87860238D01*
X211464542Y87955476D01*
X211416923Y88050714D01*
X211369304Y88241190D01*
X211369304Y88384047D01*
X211416923Y88574523D01*
X211464542Y88669761D01*
X211559780Y88765000D01*
X211702638Y88812619D01*
X211797876Y88812619D01*
X211940733Y88765000D01*
X211988352Y88717380D01*
X212893114Y87812619D02*
X212416923Y87812619D01*
X212416923Y88812619D01*
X205079695Y88765000D02*
X204984457Y88812619D01*
X204841600Y88812619D01*
X204698742Y88765000D01*
X204603504Y88669761D01*
X204555885Y88574523D01*
X204508266Y88384047D01*
X204508266Y88241190D01*
X204555885Y88050714D01*
X204603504Y87955476D01*
X204698742Y87860238D01*
X204841600Y87812619D01*
X204936838Y87812619D01*
X205079695Y87860238D01*
X205127314Y87907857D01*
X205127314Y88241190D01*
X204936838Y88241190D01*
X205555885Y87812619D02*
X205555885Y88812619D01*
X206127314Y87812619D01*
X206127314Y88812619D01*
X206603504Y87812619D02*
X206603504Y88812619D01*
X206841600Y88812619D01*
X206984457Y88765000D01*
X207079695Y88669761D01*
X207127314Y88574523D01*
X207174933Y88384047D01*
X207174933Y88241190D01*
X207127314Y88050714D01*
X207079695Y87955476D01*
X206984457Y87860238D01*
X206841600Y87812619D01*
X206603504Y87812619D01*
X207949895Y88812619D02*
X208568942Y88812619D01*
X208235609Y88431666D01*
X208378466Y88431666D01*
X208473704Y88384047D01*
X208521323Y88336428D01*
X208568942Y88241190D01*
X208568942Y88003095D01*
X208521323Y87907857D01*
X208473704Y87860238D01*
X208378466Y87812619D01*
X208092752Y87812619D01*
X207997514Y87860238D01*
X207949895Y87907857D01*
X208854657Y88812619D02*
X209187990Y87812619D01*
X209521323Y88812619D01*
X204308000Y79772628D02*
X204565142Y79686914D01*
X204993714Y79686914D01*
X205165142Y79772628D01*
X205250857Y79858342D01*
X205336571Y80029771D01*
X205336571Y80201200D01*
X205250857Y80372628D01*
X205165142Y80458342D01*
X204993714Y80544057D01*
X204650857Y80629771D01*
X204479428Y80715485D01*
X204393714Y80801200D01*
X204308000Y80972628D01*
X204308000Y81144057D01*
X204393714Y81315485D01*
X204479428Y81401200D01*
X204650857Y81486914D01*
X205079428Y81486914D01*
X205336571Y81401200D01*
X206022285Y79772628D02*
X206279428Y79686914D01*
X206708000Y79686914D01*
X206879428Y79772628D01*
X206965142Y79858342D01*
X207050857Y80029771D01*
X207050857Y80201200D01*
X206965142Y80372628D01*
X206879428Y80458342D01*
X206708000Y80544057D01*
X206365142Y80629771D01*
X206193714Y80715485D01*
X206108000Y80801200D01*
X206022285Y80972628D01*
X206022285Y81144057D01*
X206108000Y81315485D01*
X206193714Y81401200D01*
X206365142Y81486914D01*
X206793714Y81486914D01*
X207050857Y81401200D01*
X207822285Y79686914D02*
X207822285Y81486914D01*
X208250857Y81486914D01*
X208508000Y81401200D01*
X208679428Y81229771D01*
X208765142Y81058342D01*
X208850857Y80715485D01*
X208850857Y80458342D01*
X208765142Y80115485D01*
X208679428Y79944057D01*
X208508000Y79772628D01*
X208250857Y79686914D01*
X207822285Y79686914D01*
X210565142Y79686914D02*
X209536571Y79686914D01*
X210050857Y79686914D02*
X210050857Y81486914D01*
X209879428Y81229771D01*
X209708000Y81058342D01*
X209536571Y80972628D01*
X211165142Y81486914D02*
X212279428Y81486914D01*
X211679428Y80801200D01*
X211936571Y80801200D01*
X212108000Y80715485D01*
X212193714Y80629771D01*
X212279428Y80458342D01*
X212279428Y80029771D01*
X212193714Y79858342D01*
X212108000Y79772628D01*
X211936571Y79686914D01*
X211422285Y79686914D01*
X211250857Y79772628D01*
X211165142Y79858342D01*
X213393714Y81486914D02*
X213565142Y81486914D01*
X213736571Y81401200D01*
X213822285Y81315485D01*
X213908000Y81144057D01*
X213993714Y80801200D01*
X213993714Y80372628D01*
X213908000Y80029771D01*
X213822285Y79858342D01*
X213736571Y79772628D01*
X213565142Y79686914D01*
X213393714Y79686914D01*
X213222285Y79772628D01*
X213136571Y79858342D01*
X213050857Y80029771D01*
X212965142Y80372628D01*
X212965142Y80801200D01*
X213050857Y81144057D01*
X213136571Y81315485D01*
X213222285Y81401200D01*
X213393714Y81486914D01*
X215536571Y81486914D02*
X215193714Y81486914D01*
X215022285Y81401200D01*
X214936571Y81315485D01*
X214765142Y81058342D01*
X214679428Y80715485D01*
X214679428Y80029771D01*
X214765142Y79858342D01*
X214850857Y79772628D01*
X215022285Y79686914D01*
X215365142Y79686914D01*
X215536571Y79772628D01*
X215622285Y79858342D01*
X215708000Y80029771D01*
X215708000Y80458342D01*
X215622285Y80629771D01*
X215536571Y80715485D01*
X215365142Y80801200D01*
X215022285Y80801200D01*
X214850857Y80715485D01*
X214765142Y80629771D01*
X214679428Y80458342D01*
D10*
X197637400Y61645800D02*
X222326200Y61645800D01*
X222326200Y87020400D02*
X222326200Y61645800D01*
X197637400Y87020400D02*
X222326200Y87020400D01*
X197764400Y87528400D02*
X197764400Y62153800D01*
D11*
X226720400Y60369200D02*
X191439800Y60369200D01*
X203764285Y48945238D02*
X203859523Y48897619D01*
X204050000Y48897619D01*
X204145238Y48945238D01*
X204192857Y49040476D01*
X204192857Y49088095D01*
X204145238Y49183333D01*
X204050000Y49230952D01*
X203907142Y49230952D01*
X203811904Y49278571D01*
X203764285Y49373809D01*
X203764285Y49421428D01*
X203811904Y49516666D01*
X203907142Y49564285D01*
X204050000Y49564285D01*
X204145238Y49516666D01*
X204621428Y49564285D02*
X204621428Y48564285D01*
X204621428Y49516666D02*
X204716666Y49564285D01*
X204907142Y49564285D01*
X205002380Y49516666D01*
X205050000Y49469047D01*
X205097619Y49373809D01*
X205097619Y49088095D01*
X205050000Y48992857D01*
X205002380Y48945238D01*
X204907142Y48897619D01*
X204716666Y48897619D01*
X204621428Y48945238D01*
X205954761Y48897619D02*
X205954761Y49421428D01*
X205907142Y49516666D01*
X205811904Y49564285D01*
X205621428Y49564285D01*
X205526190Y49516666D01*
X205954761Y48945238D02*
X205859523Y48897619D01*
X205621428Y48897619D01*
X205526190Y48945238D01*
X205478571Y49040476D01*
X205478571Y49135714D01*
X205526190Y49230952D01*
X205621428Y49278571D01*
X205859523Y49278571D01*
X205954761Y49326190D01*
X206430952Y48897619D02*
X206430952Y49564285D01*
X206430952Y49373809D02*
X206478571Y49469047D01*
X206526190Y49516666D01*
X206621428Y49564285D01*
X206716666Y49564285D01*
X207050000Y48897619D02*
X207050000Y49897619D01*
X207145238Y49278571D02*
X207430952Y48897619D01*
X207430952Y49564285D02*
X207050000Y49183333D01*
X207716666Y49564285D02*
X208097619Y49564285D01*
X207859523Y48897619D02*
X207859523Y49754761D01*
X207907142Y49850000D01*
X208002380Y49897619D01*
X208097619Y49897619D01*
X208859523Y49564285D02*
X208859523Y48897619D01*
X208430952Y49564285D02*
X208430952Y49040476D01*
X208478571Y48945238D01*
X208573809Y48897619D01*
X208716666Y48897619D01*
X208811904Y48945238D01*
X208859523Y48992857D01*
X209335714Y49564285D02*
X209335714Y48897619D01*
X209335714Y49469047D02*
X209383333Y49516666D01*
X209478571Y49564285D01*
X209621428Y49564285D01*
X209716666Y49516666D01*
X209764285Y49421428D01*
X209764285Y48897619D01*
X210954761Y49564285D02*
X211669047Y49564285D01*
X211240476Y49992857D02*
X210954761Y48707142D01*
X211573809Y49135714D02*
X210859523Y49135714D01*
X211288095Y48707142D02*
X211573809Y49992857D01*
X212526190Y48897619D02*
X211954761Y48897619D01*
X212240476Y48897619D02*
X212240476Y49897619D01*
X212145238Y49754761D01*
X212050000Y49659523D01*
X211954761Y49611904D01*
X213430952Y49897619D02*
X212954761Y49897619D01*
X212907142Y49421428D01*
X212954761Y49469047D01*
X213050000Y49516666D01*
X213288095Y49516666D01*
X213383333Y49469047D01*
X213430952Y49421428D01*
X213478571Y49326190D01*
X213478571Y49088095D01*
X213430952Y48992857D01*
X213383333Y48945238D01*
X213288095Y48897619D01*
X213050000Y48897619D01*
X212954761Y48945238D01*
X212907142Y48992857D01*
X214430952Y48897619D02*
X213859523Y48897619D01*
X214145238Y48897619D02*
X214145238Y49897619D01*
X214050000Y49754761D01*
X213954761Y49659523D01*
X213859523Y49611904D01*
X215383333Y48897619D02*
X214811904Y48897619D01*
X215097619Y48897619D02*
X215097619Y49897619D01*
X215002380Y49754761D01*
X214907142Y49659523D01*
X214811904Y49611904D01*
X215764285Y49802380D02*
X215811904Y49850000D01*
X215907142Y49897619D01*
X216145238Y49897619D01*
X216240476Y49850000D01*
X216288095Y49802380D01*
X216335714Y49707142D01*
X216335714Y49611904D01*
X216288095Y49469047D01*
X215716666Y48897619D01*
X216335714Y48897619D01*
X205410209Y51241276D02*
X205695923Y51146038D01*
X206172114Y51146038D01*
X206362590Y51241276D01*
X206457828Y51336514D01*
X206553066Y51526990D01*
X206553066Y51717466D01*
X206457828Y51907942D01*
X206362590Y52003180D01*
X206172114Y52098419D01*
X205791161Y52193657D01*
X205600685Y52288895D01*
X205505447Y52384133D01*
X205410209Y52574609D01*
X205410209Y52765085D01*
X205505447Y52955561D01*
X205600685Y53050800D01*
X205791161Y53146038D01*
X206267352Y53146038D01*
X206553066Y53050800D01*
X208553066Y51336514D02*
X208457828Y51241276D01*
X208172114Y51146038D01*
X207981638Y51146038D01*
X207695923Y51241276D01*
X207505447Y51431752D01*
X207410209Y51622228D01*
X207314971Y52003180D01*
X207314971Y52288895D01*
X207410209Y52669847D01*
X207505447Y52860323D01*
X207695923Y53050800D01*
X207981638Y53146038D01*
X208172114Y53146038D01*
X208457828Y53050800D01*
X208553066Y52955561D01*
X209410209Y51146038D02*
X209410209Y53146038D01*
X209886400Y53146038D01*
X210172114Y53050800D01*
X210362590Y52860323D01*
X210457828Y52669847D01*
X210553066Y52288895D01*
X210553066Y52003180D01*
X210457828Y51622228D01*
X210362590Y51431752D01*
X210172114Y51241276D01*
X209886400Y51146038D01*
X209410209Y51146038D01*
X211219733Y53146038D02*
X212457828Y53146038D01*
X211791161Y52384133D01*
X212076876Y52384133D01*
X212267352Y52288895D01*
X212362590Y52193657D01*
X212457828Y52003180D01*
X212457828Y51526990D01*
X212362590Y51336514D01*
X212267352Y51241276D01*
X212076876Y51146038D01*
X211505447Y51146038D01*
X211314971Y51241276D01*
X211219733Y51336514D01*
X213695923Y53146038D02*
X213886400Y53146038D01*
X214076876Y53050800D01*
X214172114Y52955561D01*
X214267352Y52765085D01*
X214362590Y52384133D01*
X214362590Y51907942D01*
X214267352Y51526990D01*
X214172114Y51336514D01*
X214076876Y51241276D01*
X213886400Y51146038D01*
X213695923Y51146038D01*
X213505447Y51241276D01*
X213410209Y51336514D01*
X213314971Y51526990D01*
X213219733Y51907942D01*
X213219733Y52384133D01*
X213314971Y52765085D01*
X213410209Y52955561D01*
X213505447Y53050800D01*
X213695923Y53146038D01*
X226720400Y37338000D02*
X226720400Y60338000D01*
X226720400Y37369200D02*
X191414400Y37369200D01*
D10*
%TO.C,J11*%
X225500000Y32930000D02*
X226830000Y32930000D01*
X226830000Y32930000D02*
X226830000Y31600000D01*
X226830000Y30330000D02*
X226830000Y20110000D01*
X224170000Y20110000D02*
X226830000Y20110000D01*
X224170000Y30330000D02*
X224170000Y20110000D01*
X224170000Y30330000D02*
X226830000Y30330000D01*
%TO.C,JP2*%
X230825000Y-12700000D02*
X230825000Y-14700000D01*
X228025000Y-12700000D02*
X230825000Y-12700000D01*
X228025000Y-14700000D02*
X228025000Y-12700000D01*
X230825000Y-14700000D02*
X228025000Y-14700000D01*
%TO.C,J2*%
X239563600Y10321600D02*
X240893600Y10321600D01*
X239563600Y8991600D02*
X239563600Y10321600D01*
X239563600Y7721600D02*
X242223600Y7721600D01*
X242223600Y7721600D02*
X242223600Y-7578400D01*
X239563600Y7721600D02*
X239563600Y-7578400D01*
X239563600Y-7578400D02*
X242223600Y-7578400D01*
%TO.C,J14*%
X224205800Y20253000D02*
X224205800Y17593000D01*
X224205800Y20253000D02*
X191125800Y20253000D01*
X191125800Y20253000D02*
X191125800Y17593000D01*
X224205800Y17593000D02*
X191125800Y17593000D01*
X226805800Y17593000D02*
X225475800Y17593000D01*
X226805800Y18923000D02*
X226805800Y17593000D01*
%TO.C,J13*%
X224129600Y466400D02*
X224129600Y-2193600D01*
X224129600Y466400D02*
X191049600Y466400D01*
X191049600Y466400D02*
X191049600Y-2193600D01*
X224129600Y-2193600D02*
X191049600Y-2193600D01*
X226729600Y-2193600D02*
X225399600Y-2193600D01*
X226729600Y-863600D02*
X226729600Y-2193600D01*
%TO.C,J12*%
X193649600Y13046400D02*
X193649600Y15706400D01*
X193649600Y13046400D02*
X226729600Y13046400D01*
X226729600Y13046400D02*
X226729600Y15706400D01*
X193649600Y15706400D02*
X226729600Y15706400D01*
X191049600Y15706400D02*
X192379600Y15706400D01*
X191049600Y14376400D02*
X191049600Y15706400D01*
%TO.C,J3*%
X193725800Y32833000D02*
X193725800Y35493000D01*
X193725800Y32833000D02*
X226805800Y32833000D01*
X226805800Y32833000D02*
X226805800Y35493000D01*
X193725800Y35493000D02*
X226805800Y35493000D01*
X191125800Y35493000D02*
X192455800Y35493000D01*
X191125800Y34163000D02*
X191125800Y35493000D01*
%TO.C,J5*%
X233010400Y94478800D02*
X235670400Y94478800D01*
X233010400Y94598800D02*
X233010400Y94478800D01*
X235670400Y94598800D02*
X235670400Y94478800D01*
X235670400Y97138800D02*
X235670400Y95808800D01*
X234340400Y97138800D02*
X235670400Y97138800D01*
%TO.C,J10*%
X204867200Y85674200D02*
X204867200Y87004200D01*
X204867200Y87004200D02*
X206197200Y87004200D01*
X207467200Y87004200D02*
X215147200Y87004200D01*
X215147200Y84344200D02*
X215147200Y87004200D01*
X207467200Y84344200D02*
X215147200Y84344200D01*
X207467200Y84344200D02*
X207467200Y87004200D01*
%TO.C,J8*%
X223977200Y40090400D02*
X223977200Y37430400D01*
X223977200Y40090400D02*
X208677200Y40090400D01*
X208677200Y40090400D02*
X208677200Y37430400D01*
X223977200Y37430400D02*
X208677200Y37430400D01*
X226577200Y37430400D02*
X225247200Y37430400D01*
X226577200Y38760400D02*
X226577200Y37430400D01*
%TO.C,J11*%
D11*
X224690476Y34917619D02*
X224690476Y34203333D01*
X224642857Y34060476D01*
X224547619Y33965238D01*
X224404761Y33917619D01*
X224309523Y33917619D01*
X225690476Y33917619D02*
X225119047Y33917619D01*
X225404761Y33917619D02*
X225404761Y34917619D01*
X225309523Y34774761D01*
X225214285Y34679523D01*
X225119047Y34631904D01*
X226642857Y33917619D02*
X226071428Y33917619D01*
X226357142Y33917619D02*
X226357142Y34917619D01*
X226261904Y34774761D01*
X226166666Y34679523D01*
X226071428Y34631904D01*
%TO.C,JP2*%
X228591666Y-14952380D02*
X228591666Y-15666666D01*
X228544047Y-15809523D01*
X228448809Y-15904761D01*
X228305952Y-15952380D01*
X228210714Y-15952380D01*
X229067857Y-15952380D02*
X229067857Y-14952380D01*
X229448809Y-14952380D01*
X229544047Y-15000000D01*
X229591666Y-15047619D01*
X229639285Y-15142857D01*
X229639285Y-15285714D01*
X229591666Y-15380952D01*
X229544047Y-15428571D01*
X229448809Y-15476190D01*
X229067857Y-15476190D01*
X230020238Y-15047619D02*
X230067857Y-15000000D01*
X230163095Y-14952380D01*
X230401190Y-14952380D01*
X230496428Y-15000000D01*
X230544047Y-15047619D01*
X230591666Y-15142857D01*
X230591666Y-15238095D01*
X230544047Y-15380952D01*
X229972619Y-15952380D01*
X230591666Y-15952380D01*
%TO.C,H6*%
X239090295Y42604819D02*
X239090295Y43604819D01*
X239090295Y43128628D02*
X239661723Y43128628D01*
X239661723Y42604819D02*
X239661723Y43604819D01*
X240566485Y43604819D02*
X240376009Y43604819D01*
X240280771Y43557200D01*
X240233152Y43509580D01*
X240137914Y43366723D01*
X240090295Y43176247D01*
X240090295Y42795295D01*
X240137914Y42700057D01*
X240185533Y42652438D01*
X240280771Y42604819D01*
X240471247Y42604819D01*
X240566485Y42652438D01*
X240614104Y42700057D01*
X240661723Y42795295D01*
X240661723Y43033390D01*
X240614104Y43128628D01*
X240566485Y43176247D01*
X240471247Y43223866D01*
X240280771Y43223866D01*
X240185533Y43176247D01*
X240137914Y43128628D01*
X240090295Y43033390D01*
%TO.C,H5*%
X239115695Y68030219D02*
X239115695Y69030219D01*
X239115695Y68554028D02*
X239687123Y68554028D01*
X239687123Y68030219D02*
X239687123Y69030219D01*
X240639504Y69030219D02*
X240163314Y69030219D01*
X240115695Y68554028D01*
X240163314Y68601647D01*
X240258552Y68649266D01*
X240496647Y68649266D01*
X240591885Y68601647D01*
X240639504Y68554028D01*
X240687123Y68458790D01*
X240687123Y68220695D01*
X240639504Y68125457D01*
X240591885Y68077838D01*
X240496647Y68030219D01*
X240258552Y68030219D01*
X240163314Y68077838D01*
X240115695Y68125457D01*
%TO.C,J2*%
X240560266Y11869219D02*
X240560266Y11154933D01*
X240512647Y11012076D01*
X240417409Y10916838D01*
X240274552Y10869219D01*
X240179314Y10869219D01*
X240988838Y11773980D02*
X241036457Y11821600D01*
X241131695Y11869219D01*
X241369790Y11869219D01*
X241465028Y11821600D01*
X241512647Y11773980D01*
X241560266Y11678742D01*
X241560266Y11583504D01*
X241512647Y11440647D01*
X240941219Y10869219D01*
X241560266Y10869219D01*
%TO.C,J14*%
X189139580Y18037276D02*
X189853866Y18037276D01*
X189996723Y17989657D01*
X190091961Y17894419D01*
X190139580Y17751561D01*
X190139580Y17656323D01*
X190139580Y19037276D02*
X190139580Y18465847D01*
X190139580Y18751561D02*
X189139580Y18751561D01*
X189282438Y18656323D01*
X189377676Y18561085D01*
X189425295Y18465847D01*
X189472914Y19894419D02*
X190139580Y19894419D01*
X189091961Y19656323D02*
X189806247Y19418228D01*
X189806247Y20037276D01*
%TO.C,J13*%
X188987180Y-1774723D02*
X189701466Y-1774723D01*
X189844323Y-1822342D01*
X189939561Y-1917580D01*
X189987180Y-2060438D01*
X189987180Y-2155676D01*
X189987180Y-774723D02*
X189987180Y-1346152D01*
X189987180Y-1060438D02*
X188987180Y-1060438D01*
X189130038Y-1155676D01*
X189225276Y-1250914D01*
X189272895Y-1346152D01*
X188987180Y-441390D02*
X188987180Y177657D01*
X189368133Y-155676D01*
X189368133Y-12819D01*
X189415752Y82419D01*
X189463371Y130038D01*
X189558609Y177657D01*
X189796704Y177657D01*
X189891942Y130038D01*
X189939561Y82419D01*
X189987180Y-12819D01*
X189987180Y-298533D01*
X189939561Y-393771D01*
X189891942Y-441390D01*
%TO.C,J12*%
X189061980Y13566876D02*
X189776266Y13566876D01*
X189919123Y13519257D01*
X190014361Y13424019D01*
X190061980Y13281161D01*
X190061980Y13185923D01*
X190061980Y14566876D02*
X190061980Y13995447D01*
X190061980Y14281161D02*
X189061980Y14281161D01*
X189204838Y14185923D01*
X189300076Y14090685D01*
X189347695Y13995447D01*
X189157219Y14947828D02*
X189109600Y14995447D01*
X189061980Y15090685D01*
X189061980Y15328780D01*
X189109600Y15424019D01*
X189157219Y15471638D01*
X189252457Y15519257D01*
X189347695Y15519257D01*
X189490552Y15471638D01*
X190061980Y14900209D01*
X190061980Y15519257D01*
%TO.C,J3*%
X189138180Y33829666D02*
X189852466Y33829666D01*
X189995323Y33782047D01*
X190090561Y33686809D01*
X190138180Y33543952D01*
X190138180Y33448714D01*
X189138180Y34210619D02*
X189138180Y34829666D01*
X189519133Y34496333D01*
X189519133Y34639190D01*
X189566752Y34734428D01*
X189614371Y34782047D01*
X189709609Y34829666D01*
X189947704Y34829666D01*
X190042942Y34782047D01*
X190090561Y34734428D01*
X190138180Y34639190D01*
X190138180Y34353476D01*
X190090561Y34258238D01*
X190042942Y34210619D01*
%TO.C,J5*%
X233753066Y93765619D02*
X233753066Y93051333D01*
X233705447Y92908476D01*
X233610209Y92813238D01*
X233467352Y92765619D01*
X233372114Y92765619D01*
X234705447Y93765619D02*
X234229257Y93765619D01*
X234181638Y93289428D01*
X234229257Y93337047D01*
X234324495Y93384666D01*
X234562590Y93384666D01*
X234657828Y93337047D01*
X234705447Y93289428D01*
X234753066Y93194190D01*
X234753066Y92956095D01*
X234705447Y92860857D01*
X234657828Y92813238D01*
X234562590Y92765619D01*
X234324495Y92765619D01*
X234229257Y92813238D01*
X234181638Y92860857D01*
%TO.C,H1*%
X191160495Y87253819D02*
X191160495Y88253819D01*
X191160495Y87777628D02*
X191731923Y87777628D01*
X191731923Y87253819D02*
X191731923Y88253819D01*
X192731923Y87253819D02*
X192160495Y87253819D01*
X192446209Y87253819D02*
X192446209Y88253819D01*
X192350971Y88110961D01*
X192255733Y88015723D01*
X192160495Y87968104D01*
%TO.C,H4*%
X239501775Y-16835380D02*
X239501775Y-15835380D01*
X239501775Y-16311571D02*
X240073203Y-16311571D01*
X240073203Y-16835380D02*
X240073203Y-15835380D01*
X240977965Y-16168714D02*
X240977965Y-16835380D01*
X240739870Y-15787761D02*
X240501775Y-16502047D01*
X241120822Y-16502047D01*
%TO.C,H3*%
X191196055Y-17048740D02*
X191196055Y-16048740D01*
X191196055Y-16524931D02*
X191767483Y-16524931D01*
X191767483Y-17048740D02*
X191767483Y-16048740D01*
X192148436Y-16048740D02*
X192767483Y-16048740D01*
X192434150Y-16429693D01*
X192577007Y-16429693D01*
X192672245Y-16477312D01*
X192719864Y-16524931D01*
X192767483Y-16620169D01*
X192767483Y-16858264D01*
X192719864Y-16953502D01*
X192672245Y-17001121D01*
X192577007Y-17048740D01*
X192291293Y-17048740D01*
X192196055Y-17001121D01*
X192148436Y-16953502D01*
%TO.C,H2*%
X239547495Y87248739D02*
X239547495Y88248739D01*
X239547495Y87772548D02*
X240118923Y87772548D01*
X240118923Y87248739D02*
X240118923Y88248739D01*
X240547495Y88153500D02*
X240595114Y88201120D01*
X240690352Y88248739D01*
X240928447Y88248739D01*
X241023685Y88201120D01*
X241071304Y88153500D01*
X241118923Y88058262D01*
X241118923Y87963024D01*
X241071304Y87820167D01*
X240499876Y87248739D01*
X241118923Y87248739D01*
%TO.C,J10*%
X203261980Y84686876D02*
X203976266Y84686876D01*
X204119123Y84639257D01*
X204214361Y84544019D01*
X204261980Y84401161D01*
X204261980Y84305923D01*
X204261980Y85686876D02*
X204261980Y85115447D01*
X204261980Y85401161D02*
X203261980Y85401161D01*
X203404838Y85305923D01*
X203500076Y85210685D01*
X203547695Y85115447D01*
X203261980Y86305923D02*
X203261980Y86401161D01*
X203309600Y86496400D01*
X203357219Y86544019D01*
X203452457Y86591638D01*
X203642933Y86639257D01*
X203881028Y86639257D01*
X204071504Y86591638D01*
X204166742Y86544019D01*
X204214361Y86496400D01*
X204261980Y86401161D01*
X204261980Y86305923D01*
X204214361Y86210685D01*
X204166742Y86163066D01*
X204071504Y86115447D01*
X203881028Y86067828D01*
X203642933Y86067828D01*
X203452457Y86115447D01*
X203357219Y86163066D01*
X203309600Y86210685D01*
X203261980Y86305923D01*
%TO.C,J8*%
X206919580Y38376266D02*
X207633866Y38376266D01*
X207776723Y38328647D01*
X207871961Y38233409D01*
X207919580Y38090552D01*
X207919580Y37995314D01*
X207348152Y38995314D02*
X207300533Y38900076D01*
X207252914Y38852457D01*
X207157676Y38804838D01*
X207110057Y38804838D01*
X207014819Y38852457D01*
X206967200Y38900076D01*
X206919580Y38995314D01*
X206919580Y39185790D01*
X206967200Y39281028D01*
X207014819Y39328647D01*
X207110057Y39376266D01*
X207157676Y39376266D01*
X207252914Y39328647D01*
X207300533Y39281028D01*
X207348152Y39185790D01*
X207348152Y38995314D01*
X207395771Y38900076D01*
X207443390Y38852457D01*
X207538628Y38804838D01*
X207729104Y38804838D01*
X207824342Y38852457D01*
X207871961Y38900076D01*
X207919580Y38995314D01*
X207919580Y39185790D01*
X207871961Y39281028D01*
X207824342Y39328647D01*
X207729104Y39376266D01*
X207538628Y39376266D01*
X207443390Y39328647D01*
X207395771Y39281028D01*
X207348152Y39185790D01*
%TD*%
M02*
