%TF.GenerationSoftware,KiCad,Pcbnew,5.1.6-c6e7f7d~87~ubuntu18.04.1*%
%TF.CreationDate,2021-11-17T17:50:13-05:00*%
%TF.ProjectId,remote,72656d6f-7465-42e6-9b69-6361645f7063,rev?*%
%TF.SameCoordinates,Original*%
%TF.FileFunction,Profile,NP*%
%FSLAX46Y46*%
G04 Gerber Fmt 4.6, Leading zero omitted, Abs format (unit mm)*
G04 Created by KiCad (PCBNEW 5.1.6-c6e7f7d~87~ubuntu18.04.1) date 2021-11-17 17:50:13*
%MOMM*%
%LPD*%
G01*
G04 APERTURE LIST*
%TA.AperFunction,Profile*%
%ADD10C,0.050000*%
%TD*%
G04 APERTURE END LIST*
D10*
X55229736Y-136040000D02*
X48749948Y-136040264D01*
X58250000Y-133020052D02*
G75*
G02*
X55229736Y-136040000I-3020264J316D01*
G01*
X48749948Y-136040264D02*
G75*
G02*
X45730000Y-133020000I316J3020264D01*
G01*
X45725000Y-118075000D02*
X45730000Y-133020000D01*
X74900000Y-144104000D02*
X28930000Y-144104000D01*
X55230052Y-115050000D02*
G75*
G02*
X58250000Y-118070264I-316J-3020264D01*
G01*
X45725000Y-118075000D02*
G75*
G02*
X48745264Y-115055052I3020264J-316D01*
G01*
X55230052Y-115050000D02*
X48745264Y-115055052D01*
X58250000Y-118070264D02*
X58250000Y-133020052D01*
X53350000Y-72802000D02*
G75*
G03*
X53350000Y-72802000I-1500000J0D01*
G01*
X49380000Y-72702000D02*
G75*
G03*
X49380000Y-72702000I-1500000J0D01*
G01*
X45380000Y-72702000D02*
G75*
G03*
X45380000Y-72702000I-1500000J0D01*
G01*
X57350000Y-72802000D02*
G75*
G03*
X57350000Y-72802000I-1500000J0D01*
G01*
X69350000Y-56712000D02*
G75*
G03*
X69350000Y-56712000I-1500000J0D01*
G01*
X37050000Y-56742000D02*
G75*
G03*
X37050000Y-56742000I-1500000J0D01*
G01*
X37050000Y-64742000D02*
G75*
G03*
X37050000Y-64742000I-1500000J0D01*
G01*
X57350000Y-56712000D02*
G75*
G03*
X57350000Y-56712000I-1500000J0D01*
G01*
X53350000Y-56712000D02*
G75*
G03*
X53350000Y-56712000I-1500000J0D01*
G01*
X37050000Y-60742000D02*
G75*
G03*
X37050000Y-60742000I-1500000J0D01*
G01*
X41350000Y-56712000D02*
G75*
G03*
X41350000Y-56712000I-1500000J0D01*
G01*
X45350000Y-56712000D02*
G75*
G03*
X45350000Y-56712000I-1500000J0D01*
G01*
X37080000Y-68732000D02*
G75*
G03*
X37080000Y-68732000I-1500000J0D01*
G01*
X49350000Y-56712000D02*
G75*
G03*
X49350000Y-56712000I-1500000J0D01*
G01*
X65350000Y-56712000D02*
G75*
G03*
X65350000Y-56712000I-1500000J0D01*
G01*
X61350000Y-56712000D02*
G75*
G03*
X61350000Y-56712000I-1500000J0D01*
G01*
X49380000Y-68702000D02*
G75*
G03*
X49380000Y-68702000I-1500000J0D01*
G01*
X41380000Y-68702000D02*
G75*
G03*
X41380000Y-68702000I-1500000J0D01*
G01*
X49350000Y-60712000D02*
G75*
G03*
X49350000Y-60712000I-1500000J0D01*
G01*
X41350000Y-64712000D02*
G75*
G03*
X41350000Y-64712000I-1500000J0D01*
G01*
X57350000Y-64712000D02*
G75*
G03*
X57350000Y-64712000I-1500000J0D01*
G01*
X65350000Y-64712000D02*
G75*
G03*
X65350000Y-64712000I-1500000J0D01*
G01*
X61350000Y-68712000D02*
G75*
G03*
X61350000Y-68712000I-1500000J0D01*
G01*
X49350000Y-64712000D02*
G75*
G03*
X49350000Y-64712000I-1500000J0D01*
G01*
X53350000Y-64712000D02*
G75*
G03*
X53350000Y-64712000I-1500000J0D01*
G01*
X57350000Y-68712000D02*
G75*
G03*
X57350000Y-68712000I-1500000J0D01*
G01*
X69350000Y-68712000D02*
G75*
G03*
X69350000Y-68712000I-1500000J0D01*
G01*
X61350000Y-64712000D02*
G75*
G03*
X61350000Y-64712000I-1500000J0D01*
G01*
X57350000Y-60712000D02*
G75*
G03*
X57350000Y-60712000I-1500000J0D01*
G01*
X65350000Y-60712000D02*
G75*
G03*
X65350000Y-60712000I-1500000J0D01*
G01*
X69350000Y-64712000D02*
G75*
G03*
X69350000Y-64712000I-1500000J0D01*
G01*
X45350000Y-64712000D02*
G75*
G03*
X45350000Y-64712000I-1500000J0D01*
G01*
X61350000Y-60712000D02*
G75*
G03*
X61350000Y-60712000I-1500000J0D01*
G01*
X53350000Y-60712000D02*
G75*
G03*
X53350000Y-60712000I-1500000J0D01*
G01*
X45350000Y-60712000D02*
G75*
G03*
X45350000Y-60712000I-1500000J0D01*
G01*
X65350000Y-68712000D02*
G75*
G03*
X65350000Y-68712000I-1500000J0D01*
G01*
X41350000Y-60712000D02*
G75*
G03*
X41350000Y-60712000I-1500000J0D01*
G01*
X53350000Y-68712000D02*
G75*
G03*
X53350000Y-68712000I-1500000J0D01*
G01*
X69350000Y-60712000D02*
G75*
G03*
X69350000Y-60712000I-1500000J0D01*
G01*
X45350000Y-68712000D02*
G75*
G03*
X45350000Y-68712000I-1500000J0D01*
G01*
X77920264Y-45691948D02*
X77920264Y-141084052D01*
X25910000Y-45691684D02*
X25910052Y-141083736D01*
X57065000Y-49063244D02*
X47395000Y-49065756D01*
X59636244Y-46490756D02*
G75*
G02*
X57065000Y-49062000I-2571244J0D01*
G01*
X57065000Y-43919512D02*
G75*
G02*
X59636244Y-46490756I0J-2571244D01*
G01*
X47395000Y-43920756D02*
X57065000Y-43920756D01*
X47395000Y-49065756D02*
G75*
G02*
X44823756Y-46494512I0J2571244D01*
G01*
X44823756Y-46492000D02*
G75*
G02*
X47395000Y-43920756I2571244J0D01*
G01*
X25910000Y-45691684D02*
G75*
G02*
X28930264Y-42671736I3020264J-316D01*
G01*
X77920264Y-141084052D02*
G75*
G02*
X74900000Y-144104000I-3020264J316D01*
G01*
X77920264Y-45691948D02*
G75*
G03*
X74900000Y-42672000I-3020264J-316D01*
G01*
X28930000Y-144104000D02*
G75*
G02*
X25910052Y-141083736I316J3020264D01*
G01*
X74900000Y-42672000D02*
X28930264Y-42671736D01*
M02*
