%TF.GenerationSoftware,KiCad,Pcbnew,5.1.6-c6e7f7d~87~ubuntu18.04.1*%
%TF.CreationDate,2021-11-17T15:22:13-05:00*%
%TF.ProjectId,remote,72656d6f-7465-42e6-9b69-6361645f7063,rev?*%
%TF.SameCoordinates,Original*%
%TF.FileFunction,Legend,Bot*%
%TF.FilePolarity,Positive*%
%FSLAX46Y46*%
G04 Gerber Fmt 4.6, Leading zero omitted, Abs format (unit mm)*
G04 Created by KiCad (PCBNEW 5.1.6-c6e7f7d~87~ubuntu18.04.1) date 2021-11-17 15:22:13*
%MOMM*%
%LPD*%
G01*
G04 APERTURE LIST*
%ADD10C,0.100000*%
%ADD11C,0.150000*%
%ADD12C,0.120000*%
G04 APERTURE END LIST*
D10*
X70271428Y-141214285D02*
X70271428Y-143014285D01*
X70271428Y-141300000D02*
X70100000Y-141214285D01*
X69757142Y-141214285D01*
X69585714Y-141300000D01*
X69500000Y-141385714D01*
X69414285Y-141557142D01*
X69414285Y-142071428D01*
X69500000Y-142242857D01*
X69585714Y-142328571D01*
X69757142Y-142414285D01*
X70100000Y-142414285D01*
X70271428Y-142328571D01*
X68814285Y-141214285D02*
X68385714Y-142414285D01*
X67957142Y-141214285D01*
X67014285Y-142414285D02*
X67185714Y-142328571D01*
X67271428Y-142242857D01*
X67357142Y-142071428D01*
X67357142Y-141557142D01*
X67271428Y-141385714D01*
X67185714Y-141300000D01*
X67014285Y-141214285D01*
X66757142Y-141214285D01*
X66585714Y-141300000D01*
X66500000Y-141385714D01*
X66414285Y-141557142D01*
X66414285Y-142071428D01*
X66500000Y-142242857D01*
X66585714Y-142328571D01*
X66757142Y-142414285D01*
X67014285Y-142414285D01*
X65728571Y-142328571D02*
X65557142Y-142414285D01*
X65214285Y-142414285D01*
X65042857Y-142328571D01*
X64957142Y-142157142D01*
X64957142Y-142071428D01*
X65042857Y-141900000D01*
X65214285Y-141814285D01*
X65471428Y-141814285D01*
X65642857Y-141728571D01*
X65728571Y-141557142D01*
X65728571Y-141471428D01*
X65642857Y-141300000D01*
X65471428Y-141214285D01*
X65214285Y-141214285D01*
X65042857Y-141300000D01*
X64185714Y-142242857D02*
X64100000Y-142328571D01*
X64185714Y-142414285D01*
X64271428Y-142328571D01*
X64185714Y-142242857D01*
X64185714Y-142414285D01*
X63071428Y-142414285D02*
X63242857Y-142328571D01*
X63328571Y-142242857D01*
X63414285Y-142071428D01*
X63414285Y-141557142D01*
X63328571Y-141385714D01*
X63242857Y-141300000D01*
X63071428Y-141214285D01*
X62814285Y-141214285D01*
X62642857Y-141300000D01*
X62557142Y-141385714D01*
X62471428Y-141557142D01*
X62471428Y-142071428D01*
X62557142Y-142242857D01*
X62642857Y-142328571D01*
X62814285Y-142414285D01*
X63071428Y-142414285D01*
X61700000Y-142414285D02*
X61700000Y-141214285D01*
X61700000Y-141557142D02*
X61614285Y-141385714D01*
X61528571Y-141300000D01*
X61357142Y-141214285D01*
X61185714Y-141214285D01*
X59814285Y-141214285D02*
X59814285Y-142671428D01*
X59900000Y-142842857D01*
X59985714Y-142928571D01*
X60157142Y-143014285D01*
X60414285Y-143014285D01*
X60585714Y-142928571D01*
X59814285Y-142328571D02*
X59985714Y-142414285D01*
X60328571Y-142414285D01*
X60500000Y-142328571D01*
X60585714Y-142242857D01*
X60671428Y-142071428D01*
X60671428Y-141557142D01*
X60585714Y-141385714D01*
X60500000Y-141300000D01*
X60328571Y-141214285D01*
X59985714Y-141214285D01*
X59814285Y-141300000D01*
X57671428Y-140528571D02*
X59214285Y-142842857D01*
X56300000Y-142328571D02*
X56471428Y-142414285D01*
X56814285Y-142414285D01*
X56985714Y-142328571D01*
X57071428Y-142242857D01*
X57157142Y-142071428D01*
X57157142Y-141557142D01*
X57071428Y-141385714D01*
X56985714Y-141300000D01*
X56814285Y-141214285D01*
X56471428Y-141214285D01*
X56300000Y-141300000D01*
X55271428Y-142414285D02*
X55442857Y-142328571D01*
X55528571Y-142242857D01*
X55614285Y-142071428D01*
X55614285Y-141557142D01*
X55528571Y-141385714D01*
X55442857Y-141300000D01*
X55271428Y-141214285D01*
X55014285Y-141214285D01*
X54842857Y-141300000D01*
X54757142Y-141385714D01*
X54671428Y-141557142D01*
X54671428Y-142071428D01*
X54757142Y-142242857D01*
X54842857Y-142328571D01*
X55014285Y-142414285D01*
X55271428Y-142414285D01*
X53985714Y-140785714D02*
X53900000Y-140700000D01*
X53728571Y-140614285D01*
X53300000Y-140614285D01*
X53128571Y-140700000D01*
X53042857Y-140785714D01*
X52957142Y-140957142D01*
X52957142Y-141128571D01*
X53042857Y-141385714D01*
X54071428Y-142414285D01*
X52957142Y-142414285D01*
X50900000Y-140528571D02*
X52442857Y-142842857D01*
X50300000Y-142414285D02*
X50300000Y-141214285D01*
X50300000Y-141557142D02*
X50214285Y-141385714D01*
X50128571Y-141300000D01*
X49957142Y-141214285D01*
X49785714Y-141214285D01*
X48500000Y-142328571D02*
X48671428Y-142414285D01*
X49014285Y-142414285D01*
X49185714Y-142328571D01*
X49271428Y-142157142D01*
X49271428Y-141471428D01*
X49185714Y-141300000D01*
X49014285Y-141214285D01*
X48671428Y-141214285D01*
X48500000Y-141300000D01*
X48414285Y-141471428D01*
X48414285Y-141642857D01*
X49271428Y-141814285D01*
X47814285Y-141214285D02*
X47385714Y-142414285D01*
X46957142Y-141214285D01*
X46700000Y-142585714D02*
X45328571Y-142585714D01*
X44128571Y-141214285D02*
X44128571Y-142414285D01*
X44900000Y-141214285D02*
X44900000Y-142157142D01*
X44814285Y-142328571D01*
X44642857Y-142414285D01*
X44385714Y-142414285D01*
X44214285Y-142328571D01*
X44128571Y-142242857D01*
D11*
X37942857Y-116400000D02*
X39142857Y-116800000D01*
X37942857Y-117200000D01*
X38514285Y-118000000D02*
X38571428Y-118171428D01*
X38628571Y-118228571D01*
X38742857Y-118285714D01*
X38914285Y-118285714D01*
X39028571Y-118228571D01*
X39085714Y-118171428D01*
X39142857Y-118057142D01*
X39142857Y-117600000D01*
X37942857Y-117600000D01*
X37942857Y-118000000D01*
X38000000Y-118114285D01*
X38057142Y-118171428D01*
X38171428Y-118228571D01*
X38285714Y-118228571D01*
X38400000Y-118171428D01*
X38457142Y-118114285D01*
X38514285Y-118000000D01*
X38514285Y-117600000D01*
X38800000Y-118742857D02*
X38800000Y-119314285D01*
X39142857Y-118628571D02*
X37942857Y-119028571D01*
X39142857Y-119428571D01*
X37942857Y-119657142D02*
X37942857Y-120342857D01*
X39142857Y-120000000D02*
X37942857Y-120000000D01*
X39257142Y-120457142D02*
X39257142Y-121371428D01*
X38514285Y-121657142D02*
X38514285Y-122057142D01*
X39142857Y-122228571D02*
X39142857Y-121657142D01*
X37942857Y-121657142D01*
X37942857Y-122228571D01*
X37942857Y-122628571D02*
X39142857Y-123428571D01*
X37942857Y-123428571D02*
X39142857Y-122628571D01*
X37942857Y-123714285D02*
X37942857Y-124400000D01*
X39142857Y-124057142D02*
X37942857Y-124057142D01*
X34800000Y-121685714D02*
X34742857Y-121571428D01*
X34742857Y-121400000D01*
X34800000Y-121228571D01*
X34914285Y-121114285D01*
X35028571Y-121057142D01*
X35257142Y-121000000D01*
X35428571Y-121000000D01*
X35657142Y-121057142D01*
X35771428Y-121114285D01*
X35885714Y-121228571D01*
X35942857Y-121400000D01*
X35942857Y-121514285D01*
X35885714Y-121685714D01*
X35828571Y-121742857D01*
X35428571Y-121742857D01*
X35428571Y-121514285D01*
X35942857Y-122257142D02*
X34742857Y-122257142D01*
X35942857Y-122942857D01*
X34742857Y-122942857D01*
X35942857Y-123514285D02*
X34742857Y-123514285D01*
X34742857Y-123800000D01*
X34800000Y-123971428D01*
X34914285Y-124085714D01*
X35028571Y-124142857D01*
X35257142Y-124200000D01*
X35428571Y-124200000D01*
X35657142Y-124142857D01*
X35771428Y-124085714D01*
X35885714Y-123971428D01*
X35942857Y-123800000D01*
X35942857Y-123514285D01*
D12*
%TO.C,J15*%
X35208000Y-131178000D02*
X34928000Y-131178000D01*
X34928000Y-131178000D02*
X34928000Y-132778000D01*
X34928000Y-132778000D02*
X34008000Y-132778000D01*
X34008000Y-132778000D02*
X34008000Y-124958000D01*
X34008000Y-124958000D02*
X40128000Y-124958000D01*
X40128000Y-124958000D02*
X40128000Y-132778000D01*
X40128000Y-132778000D02*
X39208000Y-132778000D01*
X39208000Y-132778000D02*
X39208000Y-131178000D01*
X39208000Y-131178000D02*
X38928000Y-131178000D01*
X36568000Y-124958000D02*
X36568000Y-129318000D01*
X36568000Y-129318000D02*
X37568000Y-129318000D01*
X37568000Y-129318000D02*
X37568000Y-124958000D01*
X34008000Y-131178000D02*
X34928000Y-131178000D01*
X40128000Y-131178000D02*
X39208000Y-131178000D01*
X34768000Y-128818000D02*
X34768000Y-127218000D01*
X34768000Y-127218000D02*
X35768000Y-127218000D01*
X35768000Y-127218000D02*
X35768000Y-128818000D01*
X35768000Y-128818000D02*
X34768000Y-128818000D01*
X39368000Y-128818000D02*
X39368000Y-127218000D01*
X39368000Y-127218000D02*
X38368000Y-127218000D01*
X38368000Y-127218000D02*
X38368000Y-128818000D01*
X38368000Y-128818000D02*
X39368000Y-128818000D01*
X35768000Y-127218000D02*
X35768000Y-124958000D01*
X35268000Y-127218000D02*
X35268000Y-124958000D01*
X35208000Y-131178000D02*
X35208000Y-132393000D01*
%TO.C,J7*%
X55650000Y-117344000D02*
X56700000Y-117344000D01*
X56700000Y-118394000D02*
X56700000Y-117344000D01*
X47300000Y-123444000D02*
X47300000Y-132244000D01*
X47300000Y-132244000D02*
X56500000Y-132244000D01*
X50000000Y-117544000D02*
X47300000Y-117544000D01*
X47300000Y-117544000D02*
X47300000Y-119444000D01*
X56500000Y-132244000D02*
X56500000Y-117544000D01*
X56500000Y-117544000D02*
X53900000Y-117544000D01*
%TO.C,J15*%
D11*
X32452380Y-129190476D02*
X33166666Y-129190476D01*
X33309523Y-129142857D01*
X33404761Y-129047619D01*
X33452380Y-128904761D01*
X33452380Y-128809523D01*
X33452380Y-130190476D02*
X33452380Y-129619047D01*
X33452380Y-129904761D02*
X32452380Y-129904761D01*
X32595238Y-129809523D01*
X32690476Y-129714285D01*
X32738095Y-129619047D01*
X32452380Y-131095238D02*
X32452380Y-130619047D01*
X32928571Y-130571428D01*
X32880952Y-130619047D01*
X32833333Y-130714285D01*
X32833333Y-130952380D01*
X32880952Y-131047619D01*
X32928571Y-131095238D01*
X33023809Y-131142857D01*
X33261904Y-131142857D01*
X33357142Y-131095238D01*
X33404761Y-131047619D01*
X33452380Y-130952380D01*
X33452380Y-130714285D01*
X33404761Y-130619047D01*
X33357142Y-130571428D01*
%TO.C,J7*%
X58045333Y-130646380D02*
X58045333Y-131360666D01*
X58092952Y-131503523D01*
X58188190Y-131598761D01*
X58331047Y-131646380D01*
X58426285Y-131646380D01*
X57664380Y-130646380D02*
X56997714Y-130646380D01*
X57426285Y-131646380D01*
%TD*%
M02*
