%TF.GenerationSoftware,KiCad,Pcbnew,5.1.6-c6e7f7d~87~ubuntu18.04.1*%
%TF.CreationDate,2021-08-30T08:39:13-04:00*%
%TF.ProjectId,remote,72656d6f-7465-42e6-9b69-6361645f7063,rev?*%
%TF.SameCoordinates,Original*%
%TF.FileFunction,Soldermask,Bot*%
%TF.FilePolarity,Negative*%
%FSLAX46Y46*%
G04 Gerber Fmt 4.6, Leading zero omitted, Abs format (unit mm)*
G04 Created by KiCad (PCBNEW 5.1.6-c6e7f7d~87~ubuntu18.04.1) date 2021-08-30 08:39:13*
%MOMM*%
%LPD*%
G01*
G04 APERTURE LIST*
%ADD10O,1.800000X1.800000*%
%ADD11R,1.800000X1.800000*%
%ADD12C,2.200000*%
%ADD13C,1.850000*%
%ADD14O,1.300000X1.850000*%
%ADD15C,3.800000*%
%ADD16O,2.900000X2.900000*%
%ADD17R,2.900000X2.900000*%
%ADD18R,1.700000X1.700000*%
%ADD19C,1.700000*%
%ADD20O,1.700000X1.700000*%
%ADD21R,3.600000X3.600000*%
%ADD22C,2.700000*%
%ADD23R,2.700000X2.700000*%
%ADD24C,3.600000*%
G04 APERTURE END LIST*
%TO.C,J14*%
G36*
G01*
X226700000Y-21245832D02*
X226700000Y-22604168D01*
G75*
G02*
X226429168Y-22875000I-270832J0D01*
G01*
X225670832Y-22875000D01*
G75*
G02*
X225400000Y-22604168I0J270832D01*
G01*
X225400000Y-21245832D01*
G75*
G02*
X225670832Y-20975000I270832J0D01*
G01*
X226429168Y-20975000D01*
G75*
G02*
X226700000Y-21245832I0J-270832D01*
G01*
G37*
G36*
G01*
X232300000Y-21245832D02*
X232300000Y-22604168D01*
G75*
G02*
X232029168Y-22875000I-270832J0D01*
G01*
X231270832Y-22875000D01*
G75*
G02*
X231000000Y-22604168I0J270832D01*
G01*
X231000000Y-21245832D01*
G75*
G02*
X231270832Y-20975000I270832J0D01*
G01*
X232029168Y-20975000D01*
G75*
G02*
X232300000Y-21245832I0J-270832D01*
G01*
G37*
G36*
G01*
X227700000Y-17400000D02*
X227700000Y-18700000D01*
G75*
G02*
X227525000Y-18875000I-175000J0D01*
G01*
X227175000Y-18875000D01*
G75*
G02*
X227000000Y-18700000I0J175000D01*
G01*
X227000000Y-17400000D01*
G75*
G02*
X227175000Y-17225000I175000J0D01*
G01*
X227525000Y-17225000D01*
G75*
G02*
X227700000Y-17400000I0J-175000D01*
G01*
G37*
G36*
G01*
X228700000Y-17400000D02*
X228700000Y-18700000D01*
G75*
G02*
X228525000Y-18875000I-175000J0D01*
G01*
X228175000Y-18875000D01*
G75*
G02*
X228000000Y-18700000I0J175000D01*
G01*
X228000000Y-17400000D01*
G75*
G02*
X228175000Y-17225000I175000J0D01*
G01*
X228525000Y-17225000D01*
G75*
G02*
X228700000Y-17400000I0J-175000D01*
G01*
G37*
G36*
G01*
X229700000Y-17400000D02*
X229700000Y-18700000D01*
G75*
G02*
X229525000Y-18875000I-175000J0D01*
G01*
X229175000Y-18875000D01*
G75*
G02*
X229000000Y-18700000I0J175000D01*
G01*
X229000000Y-17400000D01*
G75*
G02*
X229175000Y-17225000I175000J0D01*
G01*
X229525000Y-17225000D01*
G75*
G02*
X229700000Y-17400000I0J-175000D01*
G01*
G37*
G36*
G01*
X230700000Y-17400000D02*
X230700000Y-18700000D01*
G75*
G02*
X230525000Y-18875000I-175000J0D01*
G01*
X230175000Y-18875000D01*
G75*
G02*
X230000000Y-18700000I0J175000D01*
G01*
X230000000Y-17400000D01*
G75*
G02*
X230175000Y-17225000I175000J0D01*
G01*
X230525000Y-17225000D01*
G75*
G02*
X230700000Y-17400000I0J-175000D01*
G01*
G37*
%TD*%
D10*
%TO.C,J18*%
X193750000Y72120000D03*
X193750000Y69580000D03*
X193750000Y67040000D03*
D11*
X193750000Y64500000D03*
%TD*%
D10*
%TO.C,J2*%
X193750000Y46870000D03*
X193750000Y44330000D03*
X193750000Y41790000D03*
D11*
X193750000Y39250000D03*
%TD*%
D12*
%TO.C,SW2*%
X237390000Y39810000D03*
D13*
X239880000Y41060000D03*
X239880000Y45560000D03*
D12*
X237390000Y46820000D03*
%TD*%
%TO.C,SW1*%
X237390000Y63780000D03*
D13*
X239880000Y65030000D03*
X239880000Y69530000D03*
D12*
X237390000Y70790000D03*
%TD*%
%TO.C,SW4*%
X237390000Y9000000D03*
D13*
X239880000Y10250000D03*
X239880000Y14750000D03*
D12*
X237390000Y16010000D03*
%TD*%
D14*
%TO.C,J15*%
X192550000Y6550000D03*
G36*
G01*
X189900000Y5895832D02*
X189900000Y7204168D01*
G75*
G02*
X190170832Y7475000I270832J0D01*
G01*
X190929168Y7475000D01*
G75*
G02*
X191200000Y7204168I0J-270832D01*
G01*
X191200000Y5895832D01*
G75*
G02*
X190929168Y5625000I-270832J0D01*
G01*
X190170832Y5625000D01*
G75*
G02*
X189900000Y5895832I0J270832D01*
G01*
G37*
%TD*%
D11*
%TO.C,J5*%
X207100000Y53300000D03*
D10*
X209640000Y53300000D03*
X212180000Y53300000D03*
X214720000Y53300000D03*
X217260000Y53300000D03*
X219800000Y53300000D03*
X222340000Y53300000D03*
X224880000Y53300000D03*
X227420000Y53300000D03*
X229960000Y53300000D03*
X232500000Y53300000D03*
X235040000Y53300000D03*
%TD*%
D11*
%TO.C,J1*%
X235050000Y33016000D03*
D10*
X232510000Y33016000D03*
X229970000Y33016000D03*
X227430000Y33016000D03*
X224890000Y33016000D03*
X222350000Y33016000D03*
X219810000Y33016000D03*
X217270000Y33016000D03*
X214730000Y33016000D03*
X212190000Y33016000D03*
X209650000Y33016000D03*
X207110000Y33016000D03*
X204570000Y33016000D03*
X202030000Y33016000D03*
X199490000Y33016000D03*
X196950000Y33016000D03*
%TD*%
D15*
%TO.C,H5*%
X188225000Y-23600000D03*
%TD*%
%TO.C,H6*%
X243775000Y-23450000D03*
%TD*%
D10*
%TO.C,J13*%
X198530000Y-13400000D03*
X201070000Y-13400000D03*
X203610000Y-13400000D03*
D11*
X206150000Y-13400000D03*
%TD*%
D10*
%TO.C,J12*%
X235040000Y22700000D03*
X232500000Y22700000D03*
X229960000Y22700000D03*
X227420000Y22700000D03*
X224880000Y22700000D03*
X222340000Y22700000D03*
X219800000Y22700000D03*
X217260000Y22700000D03*
X214720000Y22700000D03*
X212180000Y22700000D03*
X209640000Y22700000D03*
D11*
X207100000Y22700000D03*
%TD*%
D10*
%TO.C,J11*%
X196860000Y57762000D03*
X199400000Y57762000D03*
X201940000Y57762000D03*
X204480000Y57762000D03*
X207020000Y57762000D03*
X209560000Y57762000D03*
X212100000Y57762000D03*
X214640000Y57762000D03*
X217180000Y57762000D03*
X219720000Y57762000D03*
X222260000Y57762000D03*
X224800000Y57762000D03*
X227340000Y57762000D03*
X229880000Y57762000D03*
X232420000Y57762000D03*
D11*
X234960000Y57762000D03*
%TD*%
%TO.C,J8*%
X207100000Y78100000D03*
D10*
X209640000Y78100000D03*
X212180000Y78100000D03*
X214720000Y78100000D03*
X217260000Y78100000D03*
X219800000Y78100000D03*
X222340000Y78100000D03*
X224880000Y78100000D03*
X227420000Y78100000D03*
X229960000Y78100000D03*
X232500000Y78100000D03*
X235040000Y78100000D03*
%TD*%
%TO.C,J3*%
X196980000Y2410000D03*
X199520000Y2410000D03*
X202060000Y2410000D03*
X204600000Y2410000D03*
X207140000Y2410000D03*
X209680000Y2410000D03*
X212220000Y2410000D03*
X214760000Y2410000D03*
X217300000Y2410000D03*
X219840000Y2410000D03*
X222380000Y2410000D03*
X224920000Y2410000D03*
X227460000Y2410000D03*
X230000000Y2410000D03*
X232540000Y2410000D03*
D11*
X235080000Y2410000D03*
%TD*%
D16*
%TO.C,D1*%
X199950000Y-2100000D03*
D17*
X212650000Y-2100000D03*
%TD*%
D18*
%TO.C,C2*%
X224400000Y-4400000D03*
D19*
X224400000Y-1900000D03*
%TD*%
D18*
%TO.C,C1*%
X233000000Y-4400000D03*
D19*
X233000000Y-1900000D03*
%TD*%
D11*
%TO.C,J9*%
X225085000Y-9850000D03*
D10*
X227625000Y-9850000D03*
X230165000Y-9850000D03*
%TD*%
D20*
%TO.C,R3*%
X219000000Y7100000D03*
D19*
X219000000Y19800000D03*
%TD*%
%TO.C,J6*%
G36*
G01*
X244465832Y-6180000D02*
X245824168Y-6180000D01*
G75*
G02*
X246095000Y-6450832I0J-270832D01*
G01*
X246095000Y-7209168D01*
G75*
G02*
X245824168Y-7480000I-270832J0D01*
G01*
X244465832Y-7480000D01*
G75*
G02*
X244195000Y-7209168I0J270832D01*
G01*
X244195000Y-6450832D01*
G75*
G02*
X244465832Y-6180000I270832J0D01*
G01*
G37*
G36*
G01*
X244465832Y-580000D02*
X245824168Y-580000D01*
G75*
G02*
X246095000Y-850832I0J-270832D01*
G01*
X246095000Y-1609168D01*
G75*
G02*
X245824168Y-1880000I-270832J0D01*
G01*
X244465832Y-1880000D01*
G75*
G02*
X244195000Y-1609168I0J270832D01*
G01*
X244195000Y-850832D01*
G75*
G02*
X244465832Y-580000I270832J0D01*
G01*
G37*
G36*
G01*
X240620000Y-5180000D02*
X241920000Y-5180000D01*
G75*
G02*
X242095000Y-5355000I0J-175000D01*
G01*
X242095000Y-5705000D01*
G75*
G02*
X241920000Y-5880000I-175000J0D01*
G01*
X240620000Y-5880000D01*
G75*
G02*
X240445000Y-5705000I0J175000D01*
G01*
X240445000Y-5355000D01*
G75*
G02*
X240620000Y-5180000I175000J0D01*
G01*
G37*
G36*
G01*
X240620000Y-4180000D02*
X241920000Y-4180000D01*
G75*
G02*
X242095000Y-4355000I0J-175000D01*
G01*
X242095000Y-4705000D01*
G75*
G02*
X241920000Y-4880000I-175000J0D01*
G01*
X240620000Y-4880000D01*
G75*
G02*
X240445000Y-4705000I0J175000D01*
G01*
X240445000Y-4355000D01*
G75*
G02*
X240620000Y-4180000I175000J0D01*
G01*
G37*
G36*
G01*
X240620000Y-3180000D02*
X241920000Y-3180000D01*
G75*
G02*
X242095000Y-3355000I0J-175000D01*
G01*
X242095000Y-3705000D01*
G75*
G02*
X241920000Y-3880000I-175000J0D01*
G01*
X240620000Y-3880000D01*
G75*
G02*
X240445000Y-3705000I0J175000D01*
G01*
X240445000Y-3355000D01*
G75*
G02*
X240620000Y-3180000I175000J0D01*
G01*
G37*
G36*
G01*
X240620000Y-2180000D02*
X241920000Y-2180000D01*
G75*
G02*
X242095000Y-2355000I0J-175000D01*
G01*
X242095000Y-2705000D01*
G75*
G02*
X241920000Y-2880000I-175000J0D01*
G01*
X240620000Y-2880000D01*
G75*
G02*
X240445000Y-2705000I0J175000D01*
G01*
X240445000Y-2355000D01*
G75*
G02*
X240620000Y-2180000I175000J0D01*
G01*
G37*
%TD*%
%TO.C,J4*%
G36*
G01*
X211338000Y-11800000D02*
X209538000Y-11800000D01*
G75*
G02*
X208638000Y-10900000I0J900000D01*
G01*
X208638000Y-9100000D01*
G75*
G02*
X209538000Y-8200000I900000J0D01*
G01*
X211338000Y-8200000D01*
G75*
G02*
X212238000Y-9100000I0J-900000D01*
G01*
X212238000Y-10900000D01*
G75*
G02*
X211338000Y-11800000I-900000J0D01*
G01*
G37*
G36*
G01*
X216163000Y-14550000D02*
X214113000Y-14550000D01*
G75*
G02*
X213338000Y-13775000I0J775000D01*
G01*
X213338000Y-12225000D01*
G75*
G02*
X214113000Y-11450000I775000J0D01*
G01*
X216163000Y-11450000D01*
G75*
G02*
X216938000Y-12225000I0J-775000D01*
G01*
X216938000Y-13775000D01*
G75*
G02*
X216163000Y-14550000I-775000J0D01*
G01*
G37*
D21*
X215138000Y-7000000D03*
%TD*%
D22*
%TO.C,J7*%
X192850000Y-1650000D03*
D23*
X192850000Y-6650000D03*
%TD*%
D19*
%TO.C,R2*%
X226600000Y7000000D03*
D20*
X226600000Y19700000D03*
%TD*%
D19*
%TO.C,R1*%
X231200000Y7000000D03*
D20*
X231200000Y19700000D03*
%TD*%
D19*
%TO.C,R4*%
X214600000Y19800000D03*
D20*
X214600000Y7100000D03*
%TD*%
D15*
%TO.C,H1*%
X191871600Y84912200D03*
%TD*%
D24*
%TO.C,H4*%
X240271600Y-13387800D03*
%TD*%
%TO.C,H3*%
X191871600Y-13387800D03*
%TD*%
%TO.C,H2*%
X240271600Y84912200D03*
%TD*%
D10*
%TO.C,J10*%
X219660200Y84952200D03*
X217120200Y84952200D03*
X214580200Y84952200D03*
D11*
X212040200Y84952200D03*
%TD*%
M02*
