%TF.GenerationSoftware,KiCad,Pcbnew,5.1.12-84ad8e8a86~92~ubuntu18.04.1*%
%TF.CreationDate,2022-02-03T16:03:31-05:00*%
%TF.ProjectId,remote,72656d6f-7465-42e6-9b69-6361645f7063,rev?*%
%TF.SameCoordinates,Original*%
%TF.FileFunction,Legend,Bot*%
%TF.FilePolarity,Positive*%
%FSLAX46Y46*%
G04 Gerber Fmt 4.6, Leading zero omitted, Abs format (unit mm)*
G04 Created by KiCad (PCBNEW 5.1.12-84ad8e8a86~92~ubuntu18.04.1) date 2022-02-03 16:03:31*
%MOMM*%
%LPD*%
G01*
G04 APERTURE LIST*
%ADD10C,0.150000*%
G04 APERTURE END LIST*
D10*
X38111428Y-81796666D02*
X38206666Y-81701428D01*
X38397142Y-81415714D01*
X38492380Y-81225238D01*
X38587619Y-80939523D01*
X38682857Y-80463333D01*
X38682857Y-80082380D01*
X38587619Y-79606190D01*
X38492380Y-79320476D01*
X38397142Y-79130000D01*
X38206666Y-78844285D01*
X38111428Y-78749047D01*
X36492380Y-80939523D02*
X36682857Y-81034761D01*
X37063809Y-81034761D01*
X37254285Y-80939523D01*
X37349523Y-80844285D01*
X37444761Y-80653809D01*
X37444761Y-80082380D01*
X37349523Y-79891904D01*
X37254285Y-79796666D01*
X37063809Y-79701428D01*
X36682857Y-79701428D01*
X36492380Y-79796666D01*
X35349523Y-81034761D02*
X35540000Y-80939523D01*
X35635238Y-80844285D01*
X35730476Y-80653809D01*
X35730476Y-80082380D01*
X35635238Y-79891904D01*
X35540000Y-79796666D01*
X35349523Y-79701428D01*
X35063809Y-79701428D01*
X34873333Y-79796666D01*
X34778095Y-79891904D01*
X34682857Y-80082380D01*
X34682857Y-80653809D01*
X34778095Y-80844285D01*
X34873333Y-80939523D01*
X35063809Y-81034761D01*
X35349523Y-81034761D01*
X34016190Y-79701428D02*
X33540000Y-81034761D01*
X33063809Y-79701428D01*
X31540000Y-80939523D02*
X31730476Y-81034761D01*
X32111428Y-81034761D01*
X32301904Y-80939523D01*
X32397142Y-80749047D01*
X32397142Y-79987142D01*
X32301904Y-79796666D01*
X32111428Y-79701428D01*
X31730476Y-79701428D01*
X31540000Y-79796666D01*
X31444761Y-79987142D01*
X31444761Y-80177619D01*
X32397142Y-80368095D01*
X30587619Y-81034761D02*
X30587619Y-79701428D01*
X30587619Y-80082380D02*
X30492380Y-79891904D01*
X30397142Y-79796666D01*
X30206666Y-79701428D01*
X30016190Y-79701428D01*
X29254285Y-80939523D02*
X29254285Y-81034761D01*
X29349523Y-81225238D01*
X29444761Y-81320476D01*
X27063809Y-79701428D02*
X26587619Y-81034761D01*
X26111428Y-79701428D01*
X24587619Y-80939523D02*
X24778095Y-81034761D01*
X25159047Y-81034761D01*
X25349523Y-80939523D01*
X25444761Y-80749047D01*
X25444761Y-79987142D01*
X25349523Y-79796666D01*
X25159047Y-79701428D01*
X24778095Y-79701428D01*
X24587619Y-79796666D01*
X24492380Y-79987142D01*
X24492380Y-80177619D01*
X25444761Y-80368095D01*
X23635238Y-81034761D02*
X23635238Y-79701428D01*
X23635238Y-80082380D02*
X23540000Y-79891904D01*
X23444761Y-79796666D01*
X23254285Y-79701428D01*
X23063809Y-79701428D01*
X22492380Y-80939523D02*
X22301904Y-81034761D01*
X21920952Y-81034761D01*
X21730476Y-80939523D01*
X21635238Y-80749047D01*
X21635238Y-80653809D01*
X21730476Y-80463333D01*
X21920952Y-80368095D01*
X22206666Y-80368095D01*
X22397142Y-80272857D01*
X22492380Y-80082380D01*
X22492380Y-79987142D01*
X22397142Y-79796666D01*
X22206666Y-79701428D01*
X21920952Y-79701428D01*
X21730476Y-79796666D01*
X20778095Y-81034761D02*
X20778095Y-79701428D01*
X20778095Y-79034761D02*
X20873333Y-79130000D01*
X20778095Y-79225238D01*
X20682857Y-79130000D01*
X20778095Y-79034761D01*
X20778095Y-79225238D01*
X19540000Y-81034761D02*
X19730476Y-80939523D01*
X19825714Y-80844285D01*
X19920952Y-80653809D01*
X19920952Y-80082380D01*
X19825714Y-79891904D01*
X19730476Y-79796666D01*
X19540000Y-79701428D01*
X19254285Y-79701428D01*
X19063809Y-79796666D01*
X18968571Y-79891904D01*
X18873333Y-80082380D01*
X18873333Y-80653809D01*
X18968571Y-80844285D01*
X19063809Y-80939523D01*
X19254285Y-81034761D01*
X19540000Y-81034761D01*
X18016190Y-79701428D02*
X18016190Y-81034761D01*
X18016190Y-79891904D02*
X17920952Y-79796666D01*
X17730476Y-79701428D01*
X17444761Y-79701428D01*
X17254285Y-79796666D01*
X17159047Y-79987142D01*
X17159047Y-81034761D01*
X14778095Y-79225238D02*
X14682857Y-79130000D01*
X14492380Y-79034761D01*
X14016190Y-79034761D01*
X13825714Y-79130000D01*
X13730476Y-79225238D01*
X13635238Y-79415714D01*
X13635238Y-79606190D01*
X13730476Y-79891904D01*
X14873333Y-81034761D01*
X13635238Y-81034761D01*
X12968571Y-81796666D02*
X12873333Y-81701428D01*
X12682857Y-81415714D01*
X12587619Y-81225238D01*
X12492380Y-80939523D01*
X12397142Y-80463333D01*
X12397142Y-80082380D01*
X12492380Y-79606190D01*
X12587619Y-79320476D01*
X12682857Y-79130000D01*
X12873333Y-78844285D01*
X12968571Y-78749047D01*
X49628571Y-89866666D02*
X47628571Y-89866666D01*
X49533333Y-89866666D02*
X49628571Y-89676190D01*
X49628571Y-89295238D01*
X49533333Y-89104761D01*
X49438095Y-89009523D01*
X49247619Y-88914285D01*
X48676190Y-88914285D01*
X48485714Y-89009523D01*
X48390476Y-89104761D01*
X48295238Y-89295238D01*
X48295238Y-89676190D01*
X48390476Y-89866666D01*
X49628571Y-88247619D02*
X48295238Y-87771428D01*
X49628571Y-87295238D01*
X48295238Y-86247619D02*
X48390476Y-86438095D01*
X48485714Y-86533333D01*
X48676190Y-86628571D01*
X49247619Y-86628571D01*
X49438095Y-86533333D01*
X49533333Y-86438095D01*
X49628571Y-86247619D01*
X49628571Y-85961904D01*
X49533333Y-85771428D01*
X49438095Y-85676190D01*
X49247619Y-85580952D01*
X48676190Y-85580952D01*
X48485714Y-85676190D01*
X48390476Y-85771428D01*
X48295238Y-85961904D01*
X48295238Y-86247619D01*
X48390476Y-84819047D02*
X48295238Y-84628571D01*
X48295238Y-84247619D01*
X48390476Y-84057142D01*
X48580952Y-83961904D01*
X48676190Y-83961904D01*
X48866666Y-84057142D01*
X48961904Y-84247619D01*
X48961904Y-84533333D01*
X49057142Y-84723809D01*
X49247619Y-84819047D01*
X49342857Y-84819047D01*
X49533333Y-84723809D01*
X49628571Y-84533333D01*
X49628571Y-84247619D01*
X49533333Y-84057142D01*
X48485714Y-83104761D02*
X48390476Y-83009523D01*
X48295238Y-83104761D01*
X48390476Y-83200000D01*
X48485714Y-83104761D01*
X48295238Y-83104761D01*
X48295238Y-81866666D02*
X48390476Y-82057142D01*
X48485714Y-82152380D01*
X48676190Y-82247619D01*
X49247619Y-82247619D01*
X49438095Y-82152380D01*
X49533333Y-82057142D01*
X49628571Y-81866666D01*
X49628571Y-81580952D01*
X49533333Y-81390476D01*
X49438095Y-81295238D01*
X49247619Y-81200000D01*
X48676190Y-81200000D01*
X48485714Y-81295238D01*
X48390476Y-81390476D01*
X48295238Y-81580952D01*
X48295238Y-81866666D01*
X48295238Y-80342857D02*
X49628571Y-80342857D01*
X49247619Y-80342857D02*
X49438095Y-80247619D01*
X49533333Y-80152380D01*
X49628571Y-79961904D01*
X49628571Y-79771428D01*
X49628571Y-78247619D02*
X48009523Y-78247619D01*
X47819047Y-78342857D01*
X47723809Y-78438095D01*
X47628571Y-78628571D01*
X47628571Y-78914285D01*
X47723809Y-79104761D01*
X48390476Y-78247619D02*
X48295238Y-78438095D01*
X48295238Y-78819047D01*
X48390476Y-79009523D01*
X48485714Y-79104761D01*
X48676190Y-79200000D01*
X49247619Y-79200000D01*
X49438095Y-79104761D01*
X49533333Y-79009523D01*
X49628571Y-78819047D01*
X49628571Y-78438095D01*
X49533333Y-78247619D01*
X50390476Y-75866666D02*
X47819047Y-77580952D01*
X48390476Y-74342857D02*
X48295238Y-74533333D01*
X48295238Y-74914285D01*
X48390476Y-75104761D01*
X48485714Y-75200000D01*
X48676190Y-75295238D01*
X49247619Y-75295238D01*
X49438095Y-75200000D01*
X49533333Y-75104761D01*
X49628571Y-74914285D01*
X49628571Y-74533333D01*
X49533333Y-74342857D01*
X48295238Y-73200000D02*
X48390476Y-73390476D01*
X48485714Y-73485714D01*
X48676190Y-73580952D01*
X49247619Y-73580952D01*
X49438095Y-73485714D01*
X49533333Y-73390476D01*
X49628571Y-73200000D01*
X49628571Y-72914285D01*
X49533333Y-72723809D01*
X49438095Y-72628571D01*
X49247619Y-72533333D01*
X48676190Y-72533333D01*
X48485714Y-72628571D01*
X48390476Y-72723809D01*
X48295238Y-72914285D01*
X48295238Y-73200000D01*
X50104761Y-71771428D02*
X50200000Y-71676190D01*
X50295238Y-71485714D01*
X50295238Y-71009523D01*
X50200000Y-70819047D01*
X50104761Y-70723809D01*
X49914285Y-70628571D01*
X49723809Y-70628571D01*
X49438095Y-70723809D01*
X48295238Y-71866666D01*
X48295238Y-70628571D01*
X50390476Y-68342857D02*
X47819047Y-70057142D01*
X48295238Y-67676190D02*
X49628571Y-67676190D01*
X49247619Y-67676190D02*
X49438095Y-67580952D01*
X49533333Y-67485714D01*
X49628571Y-67295238D01*
X49628571Y-67104761D01*
X48390476Y-65676190D02*
X48295238Y-65866666D01*
X48295238Y-66247619D01*
X48390476Y-66438095D01*
X48580952Y-66533333D01*
X49342857Y-66533333D01*
X49533333Y-66438095D01*
X49628571Y-66247619D01*
X49628571Y-65866666D01*
X49533333Y-65676190D01*
X49342857Y-65580952D01*
X49152380Y-65580952D01*
X48961904Y-66533333D01*
X49628571Y-64914285D02*
X48295238Y-64438095D01*
X49628571Y-63961904D01*
X48104761Y-63676190D02*
X48104761Y-62152380D01*
X49628571Y-61866666D02*
X48295238Y-61485714D01*
X49247619Y-61104761D01*
X48295238Y-60723809D01*
X49628571Y-60342857D01*
M02*
