%TF.GenerationSoftware,KiCad,Pcbnew,5.1.6-c6e7f7d~87~ubuntu18.04.1*%
%TF.CreationDate,2021-09-22T21:34:05-04:00*%
%TF.ProjectId,remote,72656d6f-7465-42e6-9b69-6361645f7063,rev?*%
%TF.SameCoordinates,Original*%
%TF.FileFunction,Legend,Bot*%
%TF.FilePolarity,Positive*%
%FSLAX46Y46*%
G04 Gerber Fmt 4.6, Leading zero omitted, Abs format (unit mm)*
G04 Created by KiCad (PCBNEW 5.1.6-c6e7f7d~87~ubuntu18.04.1) date 2021-09-22 21:34:05*
%MOMM*%
%LPD*%
G01*
G04 APERTURE LIST*
%ADD10C,0.100000*%
G04 APERTURE END LIST*
D10*
X144477142Y-29130000D02*
X143905714Y-29130000D01*
X144591428Y-29472857D02*
X144191428Y-28272857D01*
X143791428Y-29472857D01*
X143505714Y-28272857D02*
X142762857Y-28272857D01*
X143162857Y-28730000D01*
X142991428Y-28730000D01*
X142877142Y-28787142D01*
X142820000Y-28844285D01*
X142762857Y-28958571D01*
X142762857Y-29244285D01*
X142820000Y-29358571D01*
X142877142Y-29415714D01*
X142991428Y-29472857D01*
X143334285Y-29472857D01*
X143448571Y-29415714D01*
X143505714Y-29358571D01*
X109565714Y-29682857D02*
X109565714Y-28482857D01*
X109280000Y-28482857D01*
X109108571Y-28540000D01*
X108994285Y-28654285D01*
X108937142Y-28768571D01*
X108880000Y-28997142D01*
X108880000Y-29168571D01*
X108937142Y-29397142D01*
X108994285Y-29511428D01*
X109108571Y-29625714D01*
X109280000Y-29682857D01*
X109565714Y-29682857D01*
X107794285Y-28482857D02*
X108365714Y-28482857D01*
X108422857Y-29054285D01*
X108365714Y-28997142D01*
X108251428Y-28940000D01*
X107965714Y-28940000D01*
X107851428Y-28997142D01*
X107794285Y-29054285D01*
X107737142Y-29168571D01*
X107737142Y-29454285D01*
X107794285Y-29568571D01*
X107851428Y-29625714D01*
X107965714Y-29682857D01*
X108251428Y-29682857D01*
X108365714Y-29625714D01*
X108422857Y-29568571D01*
X110274285Y-113380000D02*
X110388571Y-113322857D01*
X110560000Y-113322857D01*
X110731428Y-113380000D01*
X110845714Y-113494285D01*
X110902857Y-113608571D01*
X110960000Y-113837142D01*
X110960000Y-114008571D01*
X110902857Y-114237142D01*
X110845714Y-114351428D01*
X110731428Y-114465714D01*
X110560000Y-114522857D01*
X110445714Y-114522857D01*
X110274285Y-114465714D01*
X110217142Y-114408571D01*
X110217142Y-114008571D01*
X110445714Y-114008571D01*
X109702857Y-114522857D02*
X109702857Y-113322857D01*
X109017142Y-114522857D01*
X109017142Y-113322857D01*
X108445714Y-114522857D02*
X108445714Y-113322857D01*
X108160000Y-113322857D01*
X107988571Y-113380000D01*
X107874285Y-113494285D01*
X107817142Y-113608571D01*
X107760000Y-113837142D01*
X107760000Y-114008571D01*
X107817142Y-114237142D01*
X107874285Y-114351428D01*
X107988571Y-114465714D01*
X108160000Y-114522857D01*
X108445714Y-114522857D01*
X143984285Y-113192857D02*
X143241428Y-113192857D01*
X143641428Y-113650000D01*
X143470000Y-113650000D01*
X143355714Y-113707142D01*
X143298571Y-113764285D01*
X143241428Y-113878571D01*
X143241428Y-114164285D01*
X143298571Y-114278571D01*
X143355714Y-114335714D01*
X143470000Y-114392857D01*
X143812857Y-114392857D01*
X143927142Y-114335714D01*
X143984285Y-114278571D01*
X142898571Y-113192857D02*
X142498571Y-114392857D01*
X142098571Y-113192857D01*
X144217142Y-59395714D02*
X144045714Y-59452857D01*
X143760000Y-59452857D01*
X143645714Y-59395714D01*
X143588571Y-59338571D01*
X143531428Y-59224285D01*
X143531428Y-59110000D01*
X143588571Y-58995714D01*
X143645714Y-58938571D01*
X143760000Y-58881428D01*
X143988571Y-58824285D01*
X144102857Y-58767142D01*
X144160000Y-58710000D01*
X144217142Y-58595714D01*
X144217142Y-58481428D01*
X144160000Y-58367142D01*
X144102857Y-58310000D01*
X143988571Y-58252857D01*
X143702857Y-58252857D01*
X143531428Y-58310000D01*
X143017142Y-59452857D02*
X143017142Y-58252857D01*
X142731428Y-58252857D01*
X142560000Y-58310000D01*
X142445714Y-58424285D01*
X142388571Y-58538571D01*
X142331428Y-58767142D01*
X142331428Y-58938571D01*
X142388571Y-59167142D01*
X142445714Y-59281428D01*
X142560000Y-59395714D01*
X142731428Y-59452857D01*
X143017142Y-59452857D01*
X141874285Y-59110000D02*
X141302857Y-59110000D01*
X141988571Y-59452857D02*
X141588571Y-58252857D01*
X141188571Y-59452857D01*
X110518571Y-59255714D02*
X110347142Y-59312857D01*
X110061428Y-59312857D01*
X109947142Y-59255714D01*
X109890000Y-59198571D01*
X109832857Y-59084285D01*
X109832857Y-58970000D01*
X109890000Y-58855714D01*
X109947142Y-58798571D01*
X110061428Y-58741428D01*
X110290000Y-58684285D01*
X110404285Y-58627142D01*
X110461428Y-58570000D01*
X110518571Y-58455714D01*
X110518571Y-58341428D01*
X110461428Y-58227142D01*
X110404285Y-58170000D01*
X110290000Y-58112857D01*
X110004285Y-58112857D01*
X109832857Y-58170000D01*
X108632857Y-59198571D02*
X108690000Y-59255714D01*
X108861428Y-59312857D01*
X108975714Y-59312857D01*
X109147142Y-59255714D01*
X109261428Y-59141428D01*
X109318571Y-59027142D01*
X109375714Y-58798571D01*
X109375714Y-58627142D01*
X109318571Y-58398571D01*
X109261428Y-58284285D01*
X109147142Y-58170000D01*
X108975714Y-58112857D01*
X108861428Y-58112857D01*
X108690000Y-58170000D01*
X108632857Y-58227142D01*
X107547142Y-59312857D02*
X108118571Y-59312857D01*
X108118571Y-58112857D01*
M02*
