%TF.GenerationSoftware,KiCad,Pcbnew,5.1.6-c6e7f7d~87~ubuntu18.04.1*%
%TF.CreationDate,2021-08-30T08:39:13-04:00*%
%TF.ProjectId,remote,72656d6f-7465-42e6-9b69-6361645f7063,rev?*%
%TF.SameCoordinates,Original*%
%TF.FileFunction,Paste,Bot*%
%TF.FilePolarity,Positive*%
%FSLAX46Y46*%
G04 Gerber Fmt 4.6, Leading zero omitted, Abs format (unit mm)*
G04 Created by KiCad (PCBNEW 5.1.6-c6e7f7d~87~ubuntu18.04.1) date 2021-08-30 08:39:13*
%MOMM*%
%LPD*%
G01*
G04 APERTURE LIST*
G04 APERTURE END LIST*
%TO.C,J14*%
G36*
G01*
X226650000Y-21274999D02*
X226650000Y-22575001D01*
G75*
G02*
X226400001Y-22825000I-249999J0D01*
G01*
X225699999Y-22825000D01*
G75*
G02*
X225450000Y-22575001I0J249999D01*
G01*
X225450000Y-21274999D01*
G75*
G02*
X225699999Y-21025000I249999J0D01*
G01*
X226400001Y-21025000D01*
G75*
G02*
X226650000Y-21274999I0J-249999D01*
G01*
G37*
G36*
G01*
X232250000Y-21274999D02*
X232250000Y-22575001D01*
G75*
G02*
X232000001Y-22825000I-249999J0D01*
G01*
X231299999Y-22825000D01*
G75*
G02*
X231050000Y-22575001I0J249999D01*
G01*
X231050000Y-21274999D01*
G75*
G02*
X231299999Y-21025000I249999J0D01*
G01*
X232000001Y-21025000D01*
G75*
G02*
X232250000Y-21274999I0J-249999D01*
G01*
G37*
G36*
G01*
X227650000Y-17425000D02*
X227650000Y-18675000D01*
G75*
G02*
X227500000Y-18825000I-150000J0D01*
G01*
X227200000Y-18825000D01*
G75*
G02*
X227050000Y-18675000I0J150000D01*
G01*
X227050000Y-17425000D01*
G75*
G02*
X227200000Y-17275000I150000J0D01*
G01*
X227500000Y-17275000D01*
G75*
G02*
X227650000Y-17425000I0J-150000D01*
G01*
G37*
G36*
G01*
X228650000Y-17425000D02*
X228650000Y-18675000D01*
G75*
G02*
X228500000Y-18825000I-150000J0D01*
G01*
X228200000Y-18825000D01*
G75*
G02*
X228050000Y-18675000I0J150000D01*
G01*
X228050000Y-17425000D01*
G75*
G02*
X228200000Y-17275000I150000J0D01*
G01*
X228500000Y-17275000D01*
G75*
G02*
X228650000Y-17425000I0J-150000D01*
G01*
G37*
G36*
G01*
X229650000Y-17425000D02*
X229650000Y-18675000D01*
G75*
G02*
X229500000Y-18825000I-150000J0D01*
G01*
X229200000Y-18825000D01*
G75*
G02*
X229050000Y-18675000I0J150000D01*
G01*
X229050000Y-17425000D01*
G75*
G02*
X229200000Y-17275000I150000J0D01*
G01*
X229500000Y-17275000D01*
G75*
G02*
X229650000Y-17425000I0J-150000D01*
G01*
G37*
G36*
G01*
X230650000Y-17425000D02*
X230650000Y-18675000D01*
G75*
G02*
X230500000Y-18825000I-150000J0D01*
G01*
X230200000Y-18825000D01*
G75*
G02*
X230050000Y-18675000I0J150000D01*
G01*
X230050000Y-17425000D01*
G75*
G02*
X230200000Y-17275000I150000J0D01*
G01*
X230500000Y-17275000D01*
G75*
G02*
X230650000Y-17425000I0J-150000D01*
G01*
G37*
%TD*%
%TO.C,J6*%
G36*
G01*
X244494999Y-6230000D02*
X245795001Y-6230000D01*
G75*
G02*
X246045000Y-6479999I0J-249999D01*
G01*
X246045000Y-7180001D01*
G75*
G02*
X245795001Y-7430000I-249999J0D01*
G01*
X244494999Y-7430000D01*
G75*
G02*
X244245000Y-7180001I0J249999D01*
G01*
X244245000Y-6479999D01*
G75*
G02*
X244494999Y-6230000I249999J0D01*
G01*
G37*
G36*
G01*
X244494999Y-630000D02*
X245795001Y-630000D01*
G75*
G02*
X246045000Y-879999I0J-249999D01*
G01*
X246045000Y-1580001D01*
G75*
G02*
X245795001Y-1830000I-249999J0D01*
G01*
X244494999Y-1830000D01*
G75*
G02*
X244245000Y-1580001I0J249999D01*
G01*
X244245000Y-879999D01*
G75*
G02*
X244494999Y-630000I249999J0D01*
G01*
G37*
G36*
G01*
X240645000Y-5230000D02*
X241895000Y-5230000D01*
G75*
G02*
X242045000Y-5380000I0J-150000D01*
G01*
X242045000Y-5680000D01*
G75*
G02*
X241895000Y-5830000I-150000J0D01*
G01*
X240645000Y-5830000D01*
G75*
G02*
X240495000Y-5680000I0J150000D01*
G01*
X240495000Y-5380000D01*
G75*
G02*
X240645000Y-5230000I150000J0D01*
G01*
G37*
G36*
G01*
X240645000Y-4230000D02*
X241895000Y-4230000D01*
G75*
G02*
X242045000Y-4380000I0J-150000D01*
G01*
X242045000Y-4680000D01*
G75*
G02*
X241895000Y-4830000I-150000J0D01*
G01*
X240645000Y-4830000D01*
G75*
G02*
X240495000Y-4680000I0J150000D01*
G01*
X240495000Y-4380000D01*
G75*
G02*
X240645000Y-4230000I150000J0D01*
G01*
G37*
G36*
G01*
X240645000Y-3230000D02*
X241895000Y-3230000D01*
G75*
G02*
X242045000Y-3380000I0J-150000D01*
G01*
X242045000Y-3680000D01*
G75*
G02*
X241895000Y-3830000I-150000J0D01*
G01*
X240645000Y-3830000D01*
G75*
G02*
X240495000Y-3680000I0J150000D01*
G01*
X240495000Y-3380000D01*
G75*
G02*
X240645000Y-3230000I150000J0D01*
G01*
G37*
G36*
G01*
X240645000Y-2230000D02*
X241895000Y-2230000D01*
G75*
G02*
X242045000Y-2380000I0J-150000D01*
G01*
X242045000Y-2680000D01*
G75*
G02*
X241895000Y-2830000I-150000J0D01*
G01*
X240645000Y-2830000D01*
G75*
G02*
X240495000Y-2680000I0J150000D01*
G01*
X240495000Y-2380000D01*
G75*
G02*
X240645000Y-2230000I150000J0D01*
G01*
G37*
%TD*%
M02*
