EESchema Schematic File Version 4
EELAYER 30 0
EELAYER END
$Descr A3 16535 11693
encoding utf-8
Sheet 1 1
Title ""
Date ""
Rev ""
Comp ""
Comment1 ""
Comment2 ""
Comment3 ""
Comment4 ""
$EndDescr
$Comp
L Device:R R3
U 1 1 5F989DB1
P 2425 9250
F 0 "R3" H 2495 9296 50  0000 L CNN
F 1 "4.7K" H 2495 9205 50  0000 L CNN
F 2 "Resistor_THT:R_Axial_DIN0309_L9.0mm_D3.2mm_P12.70mm_Horizontal" V 2355 9250 50  0001 C CNN
F 3 "~" H 2425 9250 50  0001 C CNN
	1    2425 9250
	1    0    0    -1  
$EndComp
Text GLabel 2800 9425 0    50   Input ~ 0
SCL
$Comp
L power:+3V3 #PWR04
U 1 1 5F98B87C
P 2425 9100
F 0 "#PWR04" H 2425 8950 50  0001 C CNN
F 1 "+3V3" H 2440 9273 50  0000 C CNN
F 2 "" H 2425 9100 50  0001 C CNN
F 3 "" H 2425 9100 50  0001 C CNN
	1    2425 9100
	1    0    0    -1  
$EndComp
$Comp
L Device:R R4
U 1 1 5F98BC9A
P 2800 9275
F 0 "R4" H 2870 9321 50  0000 L CNN
F 1 "4.7K" H 2870 9230 50  0000 L CNN
F 2 "Resistor_THT:R_Axial_DIN0309_L9.0mm_D3.2mm_P12.70mm_Horizontal" V 2730 9275 50  0001 C CNN
F 3 "~" H 2800 9275 50  0001 C CNN
	1    2800 9275
	1    0    0    -1  
$EndComp
$Comp
L power:+3V3 #PWR06
U 1 1 5F98C06B
P 2800 9125
F 0 "#PWR06" H 2800 8975 50  0001 C CNN
F 1 "+3V3" H 2815 9298 50  0000 C CNN
F 2 "" H 2800 9125 50  0001 C CNN
F 3 "" H 2800 9125 50  0001 C CNN
	1    2800 9125
	1    0    0    -1  
$EndComp
Text GLabel 2425 9400 0    50   Input ~ 0
SDA
Text Notes 2300 8725 0    79   ~ 0
i2c pullups
$Comp
L Connector:Conn_01x04_Female J10
U 1 1 60000D99
P 9975 9000
F 0 "J10" H 10003 8976 50  0000 L CNN
F 1 "ssd1306" H 10003 8885 50  0000 L CNN
F 2 "Connector_PinSocket_2.54mm:PinSocket_1x04_P2.54mm_Vertical" H 9975 9000 50  0001 C CNN
F 3 "~" H 9975 9000 50  0001 C CNN
	1    9975 9000
	1    0    0    -1  
$EndComp
$Comp
L power:GND #PWR027
U 1 1 60000DA1
P 9400 8900
F 0 "#PWR027" H 9400 8650 50  0001 C CNN
F 1 "GND" H 9405 8727 50  0000 C CNN
F 2 "" H 9400 8900 50  0001 C CNN
F 3 "" H 9400 8900 50  0001 C CNN
	1    9400 8900
	1    0    0    -1  
$EndComp
$Comp
L power:+3V3 #PWR028
U 1 1 60000DA7
P 9650 8825
F 0 "#PWR028" H 9650 8675 50  0001 C CNN
F 1 "+3V3" V 9665 8953 50  0000 L CNN
F 2 "" H 9650 8825 50  0001 C CNN
F 3 "" H 9650 8825 50  0001 C CNN
	1    9650 8825
	1    0    0    -1  
$EndComp
Wire Wire Line
	9775 9000 9650 9000
Wire Wire Line
	9650 9000 9650 8825
Wire Wire Line
	9775 8900 9400 8900
$Comp
L Switch:SW_Push_Dual SW1
U 1 1 6028B8CB
P 7050 7475
F 0 "SW1" H 7050 7760 50  0000 C CNN
F 1 "SW_Push_Dual" H 7050 7669 50  0000 C CNN
F 2 "Button_Switch_THT:SW_TH_Tactile_Omron_B3F-10xx" H 7050 7675 50  0001 C CNN
F 3 "~" H 7050 7675 50  0001 C CNN
	1    7050 7475
	1    0    0    -1  
$EndComp
Wire Wire Line
	7250 7475 7250 7275
Wire Wire Line
	7250 7275 6850 7275
Wire Wire Line
	6850 7275 6850 7475
Wire Wire Line
	7250 7675 7250 7525
Wire Wire Line
	7250 7525 6850 7525
Wire Wire Line
	6850 7525 6850 7675
$Comp
L power:GND #PWR019
U 1 1 6028DB07
P 7250 7675
F 0 "#PWR019" H 7250 7425 50  0001 C CNN
F 1 "GND" H 7255 7502 50  0000 C CNN
F 2 "" H 7250 7675 50  0001 C CNN
F 3 "" H 7250 7675 50  0001 C CNN
	1    7250 7675
	1    0    0    -1  
$EndComp
Connection ~ 7250 7675
$Comp
L Device:R R2
U 1 1 6028DEF2
P 6600 7325
F 0 "R2" H 6670 7371 50  0000 L CNN
F 1 "4.7K" H 6670 7280 50  0000 L CNN
F 2 "Resistor_THT:R_Axial_DIN0309_L9.0mm_D3.2mm_P12.70mm_Horizontal" V 6530 7325 50  0001 C CNN
F 3 "~" H 6600 7325 50  0001 C CNN
	1    6600 7325
	1    0    0    -1  
$EndComp
$Comp
L power:+3V3 #PWR018
U 1 1 6028E7B5
P 6600 7175
F 0 "#PWR018" H 6600 7025 50  0001 C CNN
F 1 "+3V3" H 6615 7348 50  0000 C CNN
F 2 "" H 6600 7175 50  0001 C CNN
F 3 "" H 6600 7175 50  0001 C CNN
	1    6600 7175
	1    0    0    -1  
$EndComp
Wire Wire Line
	6850 7475 6600 7475
Connection ~ 6850 7475
Text Notes 6700 6925 0    79   ~ 0
BUTTON A
$Comp
L power:GND #PWR07
U 1 1 601B48F9
P 5050 9675
F 0 "#PWR07" H 5050 9425 50  0001 C CNN
F 1 "GND" H 5055 9502 50  0000 C CNN
F 2 "" H 5050 9675 50  0001 C CNN
F 3 "" H 5050 9675 50  0001 C CNN
	1    5050 9675
	0    1    1    0   
$EndComp
Text Notes 4575 8400 0    79   ~ 0
POWER
Connection ~ 6600 7475
Text GLabel 9775 9100 0    50   Input ~ 0
SCL
Text GLabel 9775 9200 0    50   Input ~ 0
SDA
$Comp
L Connector:Barrel_Jack_MountingPin J4
U 1 1 607F42DF
P 5350 9775
F 0 "J4" H 5120 9647 50  0000 R CNN
F 1 "Barrel_Jack_MountingPin" H 5120 9738 50  0000 R CNN
F 2 "Connector_BarrelJack:BarrelJack_Horizontal" H 5400 9735 50  0001 C CNN
F 3 "~" H 5400 9735 50  0001 C CNN
	1    5350 9775
	-1   0    0    1   
$EndComp
Wire Wire Line
	5050 9475 5050 9675
Wire Wire Line
	5050 9475 5350 9475
Connection ~ 5050 9675
$Comp
L mysensors_radios:RFM95HW U1
U 1 1 608564B2
P 10850 5275
F 0 "U1" H 10850 5889 40  0000 C CNN
F 1 "RFM95HW" H 10850 5813 40  0000 C CNN
F 2 "footprints:RFM95" H 10850 5275 30  0001 C CIN
F 3 "https://cdn-learn.adafruit.com/assets/assets/000/031/659/original/RFM95_96_97_98W.pdf?1460518717" H 11650 4125 60  0000 C CNN
	1    10850 5275
	1    0    0    -1  
$EndComp
Text GLabel 10300 5425 0    50   Input ~ 0
11_LORA_MOSI
Text GLabel 10300 5525 0    50   Input ~ 0
12_LORA_MISO
Text GLabel 10300 5625 0    50   Input ~ 0
13_LORA_SCK
$Comp
L power:GND #PWR0103
U 1 1 6086F1E9
P 10750 6125
F 0 "#PWR0103" H 10750 5875 50  0001 C CNN
F 1 "GND" H 10755 5952 50  0000 C CNN
F 2 "" H 10750 6125 50  0001 C CNN
F 3 "" H 10750 6125 50  0001 C CNN
	1    10750 6125
	1    0    0    -1  
$EndComp
Wire Wire Line
	10950 6125 10850 6125
Wire Wire Line
	10850 6125 10750 6125
Connection ~ 10850 6125
Connection ~ 10750 6125
Text GLabel 11400 5375 2    50   Input ~ 0
LORA_DIO1
Text GLabel 10300 5825 0    50   Input ~ 0
A5_LORA_RESET
$Comp
L device:Jumper_NO_Small JP1
U 1 1 608EF379
P 12100 4725
F 0 "JP1" H 12100 4910 50  0000 C CNN
F 1 "Jumper_NO_Small" H 12100 4819 50  0000 C CNN
F 2 "Jumper:SolderJumper-2_P1.3mm_Open_TrianglePad1.0x1.5mm" H 12100 4725 50  0001 C CNN
F 3 "" H 12100 4725 50  0001 C CNN
	1    12100 4725
	-1   0    0    1   
$EndComp
$Comp
L Connector:Conn_01x01_Female J5
U 1 1 609682ED
P 10000 4775
F 0 "J5" V 9938 4687 50  0000 R CNN
F 1 "Conn_01x01_Female" V 9847 4687 50  0000 R CNN
F 2 "Connector_PinSocket_2.54mm:PinSocket_1x01_P2.54mm_Vertical" H 10000 4775 50  0001 C CNN
F 3 "~" H 10000 4775 50  0001 C CNN
	1    10000 4775
	0    -1   -1   0   
$EndComp
Wire Wire Line
	10300 5125 10000 5125
Wire Wire Line
	10000 5125 10000 4975
Text GLabel 12200 4725 2    50   Input ~ 0
LORA_DIO1
$Comp
L power:+3V3 #PWR0104
U 1 1 60954B2C
P 10850 4925
F 0 "#PWR0104" H 10850 4775 50  0001 C CNN
F 1 "+3V3" V 10865 5053 50  0000 L CNN
F 2 "" H 10850 4925 50  0001 C CNN
F 3 "" H 10850 4925 50  0001 C CNN
	1    10850 4925
	1    0    0    -1  
$EndComp
Text GLabel 10300 5325 0    50   Input ~ 0
A4_LORA_CS
Text GLabel 11400 5275 2    50   Input ~ 0
A2_LORA_IRQ
$Comp
L Connector:Conn_01x14_Female J14
U 1 1 60BBE697
P 1225 5675
F 0 "J14" H 1075 4825 50  0000 L CNN
F 1 "Conn_01x14_Female" H 675 6375 50  0000 L CNN
F 2 "Connector_PinSocket_2.54mm:PinSocket_1x14_P2.54mm_Vertical" H 1225 5675 50  0001 C CNN
F 3 "~" H 1225 5675 50  0001 C CNN
	1    1225 5675
	-1   0    0    1   
$EndComp
$Comp
L Connector:Micro_SD_Card J15
U 1 1 60C464D6
P 4450 7425
F 0 "J15" H 4400 8142 50  0000 C CNN
F 1 "Micro_SD_Card" H 4400 8051 50  0000 C CNN
F 2 "footprints:DM3D-SF_outline" H 5600 7725 50  0001 C CNN
F 3 "http://katalog.we-online.de/em/datasheet/693072010801.pdf" H 4450 7425 50  0001 C CNN
	1    4450 7425
	1    0    0    -1  
$EndComp
Text Notes 9350 8475 0    79   ~ 0
SSD1306
Text GLabel 1425 6175 2    50   Input ~ 0
MISO
Text GLabel 1425 6075 2    50   Input ~ 0
MOSI
Text GLabel 1425 5975 2    50   Input ~ 0
SCK
Text GLabel 1425 4975 2    50   Input ~ 0
~RESET
$Comp
L power:+3V3 #PWR0107
U 1 1 60B473C3
P 1875 4875
F 0 "#PWR0107" H 1875 4725 50  0001 C CNN
F 1 "+3V3" H 1890 5048 50  0000 C CNN
F 2 "" H 1875 4875 50  0001 C CNN
F 3 "" H 1875 4875 50  0001 C CNN
	1    1875 4875
	1    0    0    -1  
$EndComp
Wire Wire Line
	1425 5075 1875 5075
Wire Wire Line
	1875 5075 1875 4875
$Comp
L device:C C5
U 1 1 60904288
P 4050 6225
F 0 "C5" H 4165 6271 50  0000 L CNN
F 1 "1u" H 4165 6180 50  0000 L CNN
F 2 "Capacitor_SMD:C_0603_1608Metric_Pad1.05x0.95mm_HandSolder" H 4088 6075 50  0001 C CNN
F 3 "" H 4050 6225 50  0001 C CNN
	1    4050 6225
	1    0    0    -1  
$EndComp
$Comp
L power:+3V3 #PWR0116
U 1 1 60904977
P 4050 6075
F 0 "#PWR0116" H 4050 5925 50  0001 C CNN
F 1 "+3V3" H 4065 6248 50  0000 C CNN
F 2 "" H 4050 6075 50  0001 C CNN
F 3 "" H 4050 6075 50  0001 C CNN
	1    4050 6075
	1    0    0    -1  
$EndComp
$Comp
L power:GND #PWR0117
U 1 1 609055EF
P 4050 6375
F 0 "#PWR0117" H 4050 6125 50  0001 C CNN
F 1 "GND" H 4055 6202 50  0000 C CNN
F 2 "" H 4050 6375 50  0001 C CNN
F 3 "" H 4050 6375 50  0001 C CNN
	1    4050 6375
	1    0    0    -1  
$EndComp
Text Notes 14000 4675 0    79   ~ 0
NEOPIXEL SOLDERING
$Comp
L Connector:Conn_01x04_Female J1
U 1 1 60A7A6C9
P 14950 5475
F 0 "J1" H 14978 5451 50  0000 L CNN
F 1 "Conn_01x04_Female" H 14978 5360 50  0000 L CNN
F 2 "footprints:PinSocket_1x04_P2.54mm_Vertical_no_silk" H 14950 5475 50  0001 C CNN
F 3 "~" H 14950 5475 50  0001 C CNN
	1    14950 5475
	1    0    0    -1  
$EndComp
$Comp
L Connector:TestPoint TP1
U 1 1 60A7F8AD
P 14400 5375
F 0 "TP1" V 14595 5447 50  0000 C CNN
F 1 "TestPoint" V 14504 5447 50  0000 C CNN
F 2 "footprints:TestPoint_Pad_1.0x1.0mm_no_silk" H 14600 5375 50  0001 C CNN
F 3 "~" H 14600 5375 50  0001 C CNN
	1    14400 5375
	0    -1   -1   0   
$EndComp
$Comp
L Connector:TestPoint TP2
U 1 1 60A80254
P 14400 5475
F 0 "TP2" V 14595 5547 50  0000 C CNN
F 1 "TestPoint" V 14504 5547 50  0000 C CNN
F 2 "footprints:TestPoint_Pad_1.0x1.0mm_no_silk" H 14600 5475 50  0001 C CNN
F 3 "~" H 14600 5475 50  0001 C CNN
	1    14400 5475
	0    -1   -1   0   
$EndComp
$Comp
L Connector:TestPoint TP3
U 1 1 60A80559
P 14400 5575
F 0 "TP3" V 14595 5647 50  0000 C CNN
F 1 "TestPoint" V 14504 5647 50  0000 C CNN
F 2 "footprints:TestPoint_Pad_1.0x1.0mm_no_silk" H 14600 5575 50  0001 C CNN
F 3 "~" H 14600 5575 50  0001 C CNN
	1    14400 5575
	0    -1   -1   0   
$EndComp
$Comp
L Connector:TestPoint TP4
U 1 1 60A8079B
P 14400 5675
F 0 "TP4" V 14595 5747 50  0000 C CNN
F 1 "TestPoint" V 14504 5747 50  0000 C CNN
F 2 "footprints:TestPoint_Pad_1.0x1.0mm_no_silk" H 14600 5675 50  0001 C CNN
F 3 "~" H 14600 5675 50  0001 C CNN
	1    14400 5675
	0    -1   -1   0   
$EndComp
Wire Wire Line
	14750 5375 14400 5375
Wire Wire Line
	14750 5575 14500 5575
Wire Wire Line
	14750 5675 14400 5675
$Comp
L power:GND #PWR0118
U 1 1 60983EFA
P 5950 6275
F 0 "#PWR0118" H 5950 6025 50  0001 C CNN
F 1 "GND" H 5955 6102 50  0000 C CNN
F 2 "" H 5950 6275 50  0001 C CNN
F 3 "" H 5950 6275 50  0001 C CNN
	1    5950 6275
	1    0    0    -1  
$EndComp
Text GLabel 5550 6075 0    50   Input ~ 0
~RESET
Text Notes 5550 5675 0    79   ~ 0
RESET
Text GLabel 2775 6075 0    50   Input ~ 0
SDA
Text GLabel 2775 5975 0    50   Input ~ 0
SCL
$Comp
L Adafruit_AirLift_FeatherWing-eagle-import:GND #GND0108
U 1 1 60B3BEBE
P 2075 5175
F 0 "#GND0108" H 2075 5175 50  0001 C CNN
F 1 "GND" H 2075 5054 59  0000 C CNN
F 2 "" H 2075 5175 50  0001 C CNN
F 3 "" H 2075 5175 50  0001 C CNN
	1    2075 5175
	1    0    0    -1  
$EndComp
Text GLabel 2775 5175 0    50   Input ~ 0
VBUS
$Comp
L Connector:Conn_01x14_Female J3
U 1 1 60BBD632
P 2975 5575
F 0 "J3" H 2825 6275 50  0000 L CNN
F 1 "Conn_01x14_Female" H 2525 4775 50  0000 L CNN
F 2 "Connector_PinSocket_2.54mm:PinSocket_1x14_P2.54mm_Vertical" H 2975 5575 50  0001 C CNN
F 3 "~" H 2975 5575 50  0001 C CNN
	1    2975 5575
	1    0    0    -1  
$EndComp
Text GLabel 1425 5475 2    50   Input ~ 0
A1_SD_CS
Text GLabel 2775 5575 0    50   Input ~ 0
10_ESP_CS
Text GLabel 2775 5675 0    50   Input ~ 0
9_ESP_BUSY
Text GLabel 2775 5775 0    50   Input ~ 0
7_ESP_RESET
$Comp
L power:GND #PWR0119
U 1 1 6097278D
P 14900 5825
F 0 "#PWR0119" H 14900 5575 50  0001 C CNN
F 1 "GND" H 14905 5652 50  0000 C CNN
F 2 "" H 14900 5825 50  0001 C CNN
F 3 "" H 14900 5825 50  0001 C CNN
	1    14900 5825
	1    0    0    -1  
$EndComp
Connection ~ 14750 5375
$Comp
L device:R R5
U 1 1 609788EA
P 13900 4825
F 0 "R5" V 13693 4825 50  0000 C CNN
F 1 "500" V 13784 4825 50  0000 C CNN
F 2 "Resistor_THT:R_Axial_DIN0309_L9.0mm_D3.2mm_P12.70mm_Horizontal" V 13830 4825 50  0001 C CNN
F 3 "" H 13900 4825 50  0001 C CNN
	1    13900 4825
	0    1    1    0   
$EndComp
Text GLabel 2775 5875 0    50   Input ~ 0
5_NEOPIXEL
Wire Wire Line
	14400 5475 14650 5475
Wire Wire Line
	14650 5475 14650 5025
Connection ~ 14650 5475
Wire Wire Line
	14650 5475 14750 5475
Wire Wire Line
	14500 5575 14500 4825
Connection ~ 14500 5575
Wire Wire Line
	14500 5575 14400 5575
Wire Wire Line
	14750 5225 15100 5225
Wire Wire Line
	15100 5225 15100 5825
Wire Wire Line
	15100 5825 14900 5825
Wire Wire Line
	14750 5825 14750 5675
Wire Wire Line
	14750 5225 14750 5375
Connection ~ 14750 5675
Connection ~ 14900 5825
Wire Wire Line
	14900 5825 14750 5825
Wire Wire Line
	13750 4675 13600 4675
Wire Wire Line
	13750 4675 13750 4825
Text GLabel 1425 5375 2    50   Input ~ 0
A0_LORAWAN
Text GLabel 3550 7225 0    50   Input ~ 0
A1_SD_CS
Text GLabel 3550 7325 0    50   Input ~ 0
MOSI
Text GLabel 3550 7525 0    50   Input ~ 0
SCK
Text GLabel 3550 7725 0    50   Input ~ 0
MISO
$Comp
L power:GND #PWR0121
U 1 1 60AF12FC
P 3150 7625
F 0 "#PWR0121" H 3150 7375 50  0001 C CNN
F 1 "GND" H 3155 7452 50  0000 C CNN
F 2 "" H 3150 7625 50  0001 C CNN
F 3 "" H 3150 7625 50  0001 C CNN
	1    3150 7625
	1    0    0    -1  
$EndComp
Wire Wire Line
	3550 7625 3150 7625
Wire Wire Line
	3550 7425 3000 7425
Wire Wire Line
	3000 7425 3000 7125
$Comp
L power:+3V3 #PWR0122
U 1 1 60AFC4A9
P 3000 7125
F 0 "#PWR0122" H 3000 6975 50  0001 C CNN
F 1 "+3V3" H 3000 7275 50  0000 C CNN
F 2 "" H 3000 7125 50  0001 C CNN
F 3 "" H 3000 7125 50  0001 C CNN
	1    3000 7125
	1    0    0    -1  
$EndComp
Text GLabel 1425 5775 2    50   Input ~ 0
A4_LORA_CS
Text GLabel 1425 5575 2    50   Input ~ 0
A2_LORA_IRQ
Text GLabel 2775 5475 0    50   Input ~ 0
11_LORA_MOSI
Text GLabel 2775 5375 0    50   Input ~ 0
12_LORA_MISO
Text GLabel 2775 5275 0    50   Input ~ 0
13_LORA_SCK
Wire Wire Line
	2075 5075 2775 5075
Text GLabel 1425 5675 2    50   Input ~ 0
A3_BUTTON_A
Text GLabel 1425 5175 2    50   Input ~ 0
AREF
Text GLabel 1425 5275 2    50   Input ~ 0
VHI
Text GLabel 6100 7475 3    50   Input ~ 0
A3_BUTTON_A
$Comp
L Adafruit_AirLift_FeatherWing-eagle-import:GND #GND0109
U 1 1 60D7FC5C
P 5250 10625
F 0 "#GND0109" H 5250 10625 50  0001 C CNN
F 1 "GND" H 5250 10504 59  0000 C CNN
F 2 "" H 5250 10625 50  0001 C CNN
F 3 "" H 5250 10625 50  0001 C CNN
	1    5250 10625
	1    0    0    -1  
$EndComp
$Comp
L Connector:Screw_Terminal_01x02 J7
U 1 1 60D7B882
P 5450 10525
F 0 "J7" H 5368 10200 50  0000 C CNN
F 1 "Screw_Terminal_01x02" H 5368 10291 50  0000 C CNN
F 2 "TerminalBlock_Phoenix:TerminalBlock_Phoenix_PT-1,5-2-5.0-H_1x02_P5.00mm_Horizontal" H 5450 10525 50  0001 C CNN
F 3 "~" H 5450 10525 50  0001 C CNN
	1    5450 10525
	1    0    0    1   
$EndComp
Text GLabel 12000 4725 0    50   Input ~ 0
A0_LORAWAN
$Comp
L Switch:SW_Push_Dual SW3
U 1 1 60EFEB86
P 5750 6075
F 0 "SW3" H 5750 6360 50  0000 C CNN
F 1 "SW_Push_Dual" H 5750 6269 50  0000 C CNN
F 2 "Button_Switch_THT:SW_TH_Tactile_Omron_B3F-10xx" H 5750 6275 50  0001 C CNN
F 3 "~" H 5750 6275 50  0001 C CNN
	1    5750 6075
	1    0    0    -1  
$EndComp
Wire Wire Line
	5950 6075 5950 5975
Wire Wire Line
	5950 5975 5550 5975
Wire Wire Line
	5550 5975 5550 6075
Wire Wire Line
	5550 6275 5550 6175
Wire Wire Line
	5550 6175 5950 6175
Wire Wire Line
	5950 6175 5950 6275
Connection ~ 5950 6275
$Comp
L Mechanical:MountingHole H5
U 1 1 609D9C6D
P 14700 3875
F 0 "H5" H 14800 3921 50  0000 L CNN
F 1 "MountingHole" H 14800 3830 50  0000 L CNN
F 2 "MountingHole:MountingHole_3.5mm" H 14700 3875 50  0001 C CNN
F 3 "~" H 14700 3875 50  0001 C CNN
	1    14700 3875
	1    0    0    -1  
$EndComp
$Comp
L Mechanical:MountingHole H6
U 1 1 609DA433
P 14700 4175
F 0 "H6" H 14800 4221 50  0000 L CNN
F 1 "MountingHole" H 14800 4130 50  0000 L CNN
F 2 "MountingHole:MountingHole_3.5mm" H 14700 4175 50  0001 C CNN
F 3 "~" H 14700 4175 50  0001 C CNN
	1    14700 4175
	1    0    0    -1  
$EndComp
Text Notes 14500 3625 0    79   ~ 0
Neopixel Holes
Text Notes 4150 3675 0    79   ~ 0
Breakouts
$Comp
L power:+3V3 #PWR014
U 1 1 601BD700
P 3700 4675
F 0 "#PWR014" H 3700 4525 50  0001 C CNN
F 1 "+3V3" H 3715 4848 50  0000 C CNN
F 2 "" H 3700 4675 50  0001 C CNN
F 3 "" H 3700 4675 50  0001 C CNN
	1    3700 4675
	1    0    0    -1  
$EndComp
$Comp
L power:GND #PWR015
U 1 1 601BEB98
P 4150 4775
F 0 "#PWR015" H 4150 4525 50  0001 C CNN
F 1 "GND" H 4155 4602 50  0000 C CNN
F 2 "" H 4150 4775 50  0001 C CNN
F 3 "" H 4150 4775 50  0001 C CNN
	1    4150 4775
	1    0    0    -1  
$EndComp
Wire Wire Line
	4450 4775 4150 4775
Text GLabel 4450 4575 0    50   Input ~ 0
VHI
Wire Wire Line
	3700 4675 4450 4675
Text GLabel 4450 4175 0    50   Input ~ 0
SDA
Text GLabel 4450 4275 0    50   Input ~ 0
SCL
Text GLabel 4450 4375 0    50   Input ~ 0
TX
$Comp
L Connector:Conn_01x07_Female J2
U 1 1 60E65CC9
P 4650 4475
F 0 "J2" H 4678 4501 50  0000 L CNN
F 1 "Conn_01x07_Female" H 4678 4410 50  0000 L CNN
F 2 "Connector_PinHeader_2.54mm:PinHeader_1x07_P2.54mm_Vertical" H 4650 4475 50  0001 C CNN
F 3 "~" H 4650 4475 50  0001 C CNN
	1    4650 4475
	1    0    0    -1  
$EndComp
Text GLabel 4450 4475 0    50   Input ~ 0
RX
$Comp
L power:GND #PWR0111
U 1 1 60F802F8
P 8275 7525
F 0 "#PWR0111" H 8275 7275 50  0001 C CNN
F 1 "GND" H 8280 7352 50  0000 C CNN
F 2 "" H 8275 7525 50  0001 C CNN
F 3 "" H 8275 7525 50  0001 C CNN
	1    8275 7525
	1    0    0    -1  
$EndComp
$Comp
L power:+3V3 #PWR0112
U 1 1 60F802FE
P 8500 7625
F 0 "#PWR0112" H 8500 7475 50  0001 C CNN
F 1 "+3V3" H 8515 7798 50  0000 C CNN
F 2 "" H 8500 7625 50  0001 C CNN
F 3 "" H 8500 7625 50  0001 C CNN
	1    8500 7625
	1    0    0    -1  
$EndComp
Text GLabel 8675 7725 0    50   Input ~ 0
SDA
Text GLabel 8675 7825 0    50   Input ~ 0
SCL
Wire Wire Line
	8675 7525 8275 7525
Wire Wire Line
	8675 7625 8500 7625
$Comp
L Connector:Conn_01x04_Female J6
U 1 1 60F80308
P 8875 7625
F 0 "J6" H 8903 7601 50  0000 L CNN
F 1 "Conn_01x04_Female" V 9050 7175 50  0000 L CNN
F 2 "Connector_JST:JST_SH_SM04B-SRSS-TB_1x04-1MP_P1.00mm_Horizontal" H 8875 7625 50  0001 C CNN
F 3 "~" H 8875 7625 50  0001 C CNN
	1    8875 7625
	1    0    0    -1  
$EndComp
Text Notes 8050 7275 0    79   ~ 0
QWIIC
Text GLabel 1425 5875 2    50   Input ~ 0
A5_LORA_RESET
$Comp
L Switch:SW_Push_Dual SW2
U 1 1 60FBA6AD
P 7100 8925
F 0 "SW2" H 7100 9210 50  0000 C CNN
F 1 "SW_Push_Dual" H 7100 9119 50  0000 C CNN
F 2 "Button_Switch_THT:SW_TH_Tactile_Omron_B3F-10xx" H 7100 9125 50  0001 C CNN
F 3 "~" H 7100 9125 50  0001 C CNN
	1    7100 8925
	1    0    0    -1  
$EndComp
Wire Wire Line
	7300 8925 7300 8725
Wire Wire Line
	7300 8725 6900 8725
Wire Wire Line
	6900 8725 6900 8925
Wire Wire Line
	7300 9125 7300 8975
Wire Wire Line
	7300 8975 6900 8975
Wire Wire Line
	6900 8975 6900 9125
$Comp
L power:GND #PWR0106
U 1 1 60FBA6B9
P 7300 9125
F 0 "#PWR0106" H 7300 8875 50  0001 C CNN
F 1 "GND" H 7305 8952 50  0000 C CNN
F 2 "" H 7300 9125 50  0001 C CNN
F 3 "" H 7300 9125 50  0001 C CNN
	1    7300 9125
	1    0    0    -1  
$EndComp
Connection ~ 7300 9125
$Comp
L Device:R R1
U 1 1 60FBA6C0
P 6650 8775
F 0 "R1" H 6720 8821 50  0000 L CNN
F 1 "4.7K" H 6720 8730 50  0000 L CNN
F 2 "Resistor_THT:R_Axial_DIN0309_L9.0mm_D3.2mm_P12.70mm_Horizontal" V 6580 8775 50  0001 C CNN
F 3 "~" H 6650 8775 50  0001 C CNN
	1    6650 8775
	1    0    0    -1  
$EndComp
$Comp
L power:+3V3 #PWR0108
U 1 1 60FBA6C6
P 6650 8625
F 0 "#PWR0108" H 6650 8475 50  0001 C CNN
F 1 "+3V3" H 6665 8798 50  0000 C CNN
F 2 "" H 6650 8625 50  0001 C CNN
F 3 "" H 6650 8625 50  0001 C CNN
	1    6650 8625
	1    0    0    -1  
$EndComp
Wire Wire Line
	6900 8925 6650 8925
Connection ~ 6900 8925
Text Notes 6750 8375 0    79   ~ 0
BUTTON B
Connection ~ 6650 8925
Text Notes 8100 8725 0    79   ~ 0
QWIIC
Text GLabel 2775 6175 0    50   Input ~ 0
TX
Text GLabel 2775 6275 0    50   Input ~ 0
RX
Wire Wire Line
	6100 7475 6600 7475
Wire Wire Line
	14050 4825 14500 4825
Wire Wire Line
	6150 8925 6650 8925
$Comp
L Connector:Conn_01x03_Female J9
U 1 1 61020F33
P 3850 9725
F 0 "J9" H 3878 9751 50  0000 L CNN
F 1 "Conn_01x03_Female" H 3878 9660 50  0000 L CNN
F 2 "Connector_PinSocket_2.54mm:PinSocket_1x03_P2.54mm_Vertical" H 3850 9725 50  0001 C CNN
F 3 "~" H 3850 9725 50  0001 C CNN
	1    3850 9725
	1    0    0    -1  
$EndComp
Text Notes 3550 9425 0    79   ~ 0
DC-DC
$Comp
L device:C C1
U 1 1 610277F2
P 3450 10275
F 0 "C1" H 3335 10229 50  0000 R CNN
F 1 "10uF" H 3335 10320 50  0000 R CNN
F 2 "Capacitor_THT:CP_Radial_D5.0mm_P2.50mm" H 3488 10125 50  0001 C CNN
F 3 "" H 3450 10275 50  0001 C CNN
	1    3450 10275
	-1   0    0    1   
$EndComp
$Comp
L device:C C2
U 1 1 61051461
P 3950 10275
F 0 "C2" H 3835 10229 50  0000 R CNN
F 1 "22uF" H 3835 10320 50  0000 R CNN
F 2 "Capacitor_THT:CP_Radial_D5.0mm_P2.50mm" H 3988 10125 50  0001 C CNN
F 3 "" H 3950 10275 50  0001 C CNN
	1    3950 10275
	-1   0    0    1   
$EndComp
Text GLabel 3650 9825 0    50   UnSpc ~ 0
VOUT_DCDC
$Comp
L power:GND #PWR0101
U 1 1 6106310F
P 3100 9725
F 0 "#PWR0101" H 3100 9475 50  0001 C CNN
F 1 "GND" H 3105 9552 50  0000 C CNN
F 2 "" H 3100 9725 50  0001 C CNN
F 3 "" H 3100 9725 50  0001 C CNN
	1    3100 9725
	1    0    0    -1  
$EndComp
Wire Wire Line
	3650 9725 3100 9725
$Comp
L device:Jumper_NO_Small JP2
U 1 1 610FFD73
P 4600 9275
F 0 "JP2" H 4600 9460 50  0000 C CNN
F 1 "Jumper_NO_Small" H 4600 9369 50  0000 C CNN
F 2 "Jumper:SolderJumper-2_P1.3mm_Open_TrianglePad1.0x1.5mm" H 4600 9275 50  0001 C CNN
F 3 "" H 4600 9275 50  0001 C CNN
	1    4600 9275
	-1   0    0    1   
$EndComp
Text GLabel 2775 4975 0    50   UnSpc ~ 0
VBAT
$Comp
L power:GND #PWR0102
U 1 1 61125937
P 3450 10425
F 0 "#PWR0102" H 3450 10175 50  0001 C CNN
F 1 "GND" H 3455 10252 50  0000 C CNN
F 2 "" H 3450 10425 50  0001 C CNN
F 3 "" H 3450 10425 50  0001 C CNN
	1    3450 10425
	1    0    0    -1  
$EndComp
$Comp
L power:GND #PWR0109
U 1 1 611261CE
P 3950 10425
F 0 "#PWR0109" H 3950 10175 50  0001 C CNN
F 1 "GND" H 3955 10252 50  0000 C CNN
F 2 "" H 3950 10425 50  0001 C CNN
F 3 "" H 3950 10425 50  0001 C CNN
	1    3950 10425
	1    0    0    -1  
$EndComp
Text GLabel 4850 9025 2    50   Input ~ 0
VHI
Text GLabel 3450 10125 0    50   Input ~ 0
VIN_DCDC
Text GLabel 3950 10125 2    50   UnSpc ~ 0
VOUT_DCDC
Text GLabel 4500 9275 0    50   Input ~ 0
VIN_DCDC
Text GLabel 4700 9275 2    50   UnSpc ~ 0
VOUT_DCDC
$Comp
L Device:D D1
U 1 1 60F73E0C
P 4700 9025
F 0 "D1" H 4700 8808 50  0000 C CNN
F 1 "D" H 4700 8899 50  0000 C CNN
F 2 "Diode_THT:D_5W_P12.70mm_Horizontal" H 4700 9025 50  0001 C CNN
F 3 "~" H 4700 9025 50  0001 C CNN
	1    4700 9025
	-1   0    0    1   
$EndComp
Text GLabel 3650 9625 0    50   Input ~ 0
VIN_DCDC
Text GLabel 5050 9875 0    50   Input ~ 0
VIN_DCDC
Text GLabel 4550 9025 0    50   UnSpc ~ 0
VOUT_DCDC
Text Notes 4200 8675 0    47   ~ 0
diode voltage drop means we should\nadd voltage to min input voltage on DC DC\neither 3.3 or 5V DC DC should work
$Comp
L power:+3V3 #PWR0110
U 1 1 60FD98F6
P 13600 5025
F 0 "#PWR0110" H 13600 4875 50  0001 C CNN
F 1 "+3V3" V 13615 5153 50  0000 L CNN
F 2 "" H 13600 5025 50  0001 C CNN
F 3 "" H 13600 5025 50  0001 C CNN
	1    13600 5025
	1    0    0    -1  
$EndComp
Wire Wire Line
	13600 5025 14650 5025
$Comp
L Connector:Conn_01x05_Female J11
U 1 1 60F84692
P 2075 4475
F 0 "J11" V 1921 4187 50  0000 R CNN
F 1 "Conn_01x05_Female" V 2012 4187 50  0000 R CNN
F 2 "Connector_PinSocket_2.54mm:PinSocket_1x05_P2.54mm_Vertical" H 2075 4475 50  0001 C CNN
F 3 "~" H 2075 4475 50  0001 C CNN
	1    2075 4475
	0    -1   1    0   
$EndComp
Text GLabel 2175 4275 1    50   Input ~ 0
3_BUTTON_B
Text GLabel 6150 8925 3    50   Input ~ 0
3_BUTTON_B
Text GLabel 2275 4275 1    50   Input ~ 0
4
Text GLabel 5250 10425 0    50   UnSpc ~ 0
VBAT
Text GLabel 13600 4675 0    50   Input ~ 0
2_NEOPIXEL
Text GLabel 1425 6275 2    50   Input ~ 0
2_NEOPIXEL
$Comp
L dk_Coaxial-Connectors-RF:5-1814400-1 J20
U 1 1 61147C12
P 6500 4125
F 0 "J20" H 6578 4350 50  0000 C CNN
F 1 "5-1814400-1" H 6578 4259 50  0000 C CNN
F 2 "digikey-footprints:RF_SMA_RightAngle_5-1814400-1" H 6700 4325 60  0001 L CNN
F 3 "https://www.te.com/commerce/DocumentDelivery/DDEController?Action=srchrtrv&DocNm=1814400&DocType=Customer+Drawing&DocLang=English" H 6700 4425 60  0001 L CNN
F 4 "A97593-ND" H 6700 4525 60  0001 L CNN "Digi-Key_PN"
F 5 "5-1814400-1" H 6700 4625 60  0001 L CNN "MPN"
F 6 "Connectors, Interconnects" H 6700 4725 60  0001 L CNN "Category"
F 7 "Coaxial Connectors (RF)" H 6700 4825 60  0001 L CNN "Family"
F 8 "https://www.te.com/commerce/DocumentDelivery/DDEController?Action=srchrtrv&DocNm=1814400&DocType=Customer+Drawing&DocLang=English" H 6700 4925 60  0001 L CNN "DK_Datasheet_Link"
F 9 "/product-detail/en/te-connectivity-amp-connectors/5-1814400-1/A97593-ND/1755981" H 6700 5025 60  0001 L CNN "DK_Detail_Page"
F 10 "CONN SMA JACK R/A 50 OHM PCB" H 6700 5125 60  0001 L CNN "Description"
F 11 "TE Connectivity AMP Connectors" H 6700 5225 60  0001 L CNN "Manufacturer"
F 12 "Active" H 6700 5325 60  0001 L CNN "Status"
	1    6500 4125
	1    0    0    -1  
$EndComp
$Comp
L dk_Coaxial-Connectors-RF:142-0701-801 J21
U 1 1 6114AF2A
P 7675 3675
F 0 "J21" H 7753 3900 50  0000 C CNN
F 1 "142-0701-801" H 7753 3809 50  0000 C CNN
F 2 "digikey-footprints:RF_SMA_BoardEdge_142-0701-801" H 7875 3875 60  0001 L CNN
F 3 "http://www.belfuse.com/resources/Johnson/drawings/dr-1420701801.pdf" H 7875 3975 60  0001 L CNN
F 4 "J502-ND" H 7875 4075 60  0001 L CNN "Digi-Key_PN"
F 5 "142-0701-801" H 7875 4175 60  0001 L CNN "MPN"
F 6 "Connectors, Interconnects" H 7875 4275 60  0001 L CNN "Category"
F 7 "Coaxial Connectors (RF)" H 7875 4375 60  0001 L CNN "Family"
F 8 "http://www.belfuse.com/resources/Johnson/drawings/dr-1420701801.pdf" H 7875 4475 60  0001 L CNN "DK_Datasheet_Link"
F 9 "/product-detail/en/cinch-connectivity-solutions-johnson/142-0701-801/J502-ND/35280" H 7875 4575 60  0001 L CNN "DK_Detail_Page"
F 10 "CONN SMA JACK STR 50OHM EDGE MNT" H 7875 4675 60  0001 L CNN "Description"
F 11 "Cinch Connectivity Solutions Johnson" H 7875 4775 60  0001 L CNN "Manufacturer"
F 12 "Active" H 7875 4875 60  0001 L CNN "Status"
	1    7675 3675
	1    0    0    -1  
$EndComp
$Comp
L Connector:Conn_01x12_Female J22
U 1 1 611F1AB4
P -2225 3250
F 0 "J22" H -2197 3226 50  0000 L CNN
F 1 "Conn_01x12_Female" H -2197 3135 50  0000 L CNN
F 2 "Connector_PinHeader_2.54mm:PinHeader_1x12_P2.54mm_Vertical" H -2225 3250 50  0001 C CNN
F 3 "~" H -2225 3250 50  0001 C CNN
	1    -2225 3250
	1    0    0    -1  
$EndComp
$Comp
L Connector:Conn_01x16_Female J23
U 1 1 611F3B32
P -1125 3450
F 0 "J23" H -1097 3426 50  0000 L CNN
F 1 "Conn_01x16_Female" H -1097 3335 50  0000 L CNN
F 2 "Connector_PinHeader_2.54mm:PinHeader_1x16_P2.54mm_Vertical" H -1125 3450 50  0001 C CNN
F 3 "~" H -1125 3450 50  0001 C CNN
	1    -1125 3450
	1    0    0    -1  
$EndComp
$Comp
L Connector:Conn_01x12_Female J24
U 1 1 6122BDDA
P -5100 3325
F 0 "J24" H -5072 3301 50  0000 L CNN
F 1 "Conn_01x12_Female" H -5072 3210 50  0000 L CNN
F 2 "Connector_PinHeader_2.54mm:PinHeader_1x12_P2.54mm_Vertical" H -5100 3325 50  0001 C CNN
F 3 "~" H -5100 3325 50  0001 C CNN
	1    -5100 3325
	1    0    0    -1  
$EndComp
$Comp
L Connector:Conn_01x16_Female J25
U 1 1 6122BDE4
P -4000 3525
F 0 "J25" H -3972 3501 50  0000 L CNN
F 1 "Conn_01x16_Female" H -3972 3410 50  0000 L CNN
F 2 "Connector_PinHeader_2.54mm:PinHeader_1x16_P2.54mm_Vertical" H -4000 3525 50  0001 C CNN
F 3 "~" H -4000 3525 50  0001 C CNN
	1    -4000 3525
	1    0    0    -1  
$EndComp
$EndSCHEMATC
