%TF.GenerationSoftware,KiCad,Pcbnew,5.1.6-c6e7f7d~87~ubuntu18.04.1*%
%TF.CreationDate,2021-11-17T15:22:13-05:00*%
%TF.ProjectId,remote,72656d6f-7465-42e6-9b69-6361645f7063,rev?*%
%TF.SameCoordinates,Original*%
%TF.FileFunction,Soldermask,Top*%
%TF.FilePolarity,Negative*%
%FSLAX46Y46*%
G04 Gerber Fmt 4.6, Leading zero omitted, Abs format (unit mm)*
G04 Created by KiCad (PCBNEW 5.1.6-c6e7f7d~87~ubuntu18.04.1) date 2021-11-17 15:22:13*
%MOMM*%
%LPD*%
G01*
G04 APERTURE LIST*
%ADD10O,1.300000X1.850000*%
%ADD11R,1.800000X1.800000*%
%ADD12O,1.800000X1.800000*%
%ADD13C,1.700000*%
%ADD14O,1.700000X1.700000*%
%ADD15C,5.500000*%
%ADD16C,2.200000*%
%ADD17C,1.850000*%
%ADD18O,1.850000X1.300000*%
%ADD19R,2.900000X2.900000*%
%ADD20O,2.900000X2.900000*%
%ADD21R,1.700000X1.700000*%
%ADD22R,3.600000X3.600000*%
%ADD23R,2.700000X2.700000*%
%ADD24C,2.700000*%
G04 APERTURE END LIST*
D10*
%TO.C,J15*%
X38068000Y-131318000D03*
G36*
G01*
X35418000Y-131972168D02*
X35418000Y-130663832D01*
G75*
G02*
X35688832Y-130393000I270832J0D01*
G01*
X36447168Y-130393000D01*
G75*
G02*
X36718000Y-130663832I0J-270832D01*
G01*
X36718000Y-131972168D01*
G75*
G02*
X36447168Y-132243000I-270832J0D01*
G01*
X35688832Y-132243000D01*
G75*
G02*
X35418000Y-131972168I0J270832D01*
G01*
G37*
%TD*%
D11*
%TO.C,J13*%
X60452000Y-138176000D03*
D12*
X57912000Y-138176000D03*
X55372000Y-138176000D03*
X52832000Y-138176000D03*
X50292000Y-138176000D03*
X47752000Y-138176000D03*
%TD*%
D13*
%TO.C,R5*%
X64770000Y-97282000D03*
D14*
X64770000Y-84582000D03*
%TD*%
D11*
%TO.C,J19*%
X36950000Y-142250000D03*
D12*
X39490000Y-142250000D03*
X42030000Y-142250000D03*
%TD*%
D15*
%TO.C,H6*%
X29908000Y-76390000D03*
%TD*%
%TO.C,H5*%
X73968000Y-76410000D03*
%TD*%
D11*
%TO.C,J9*%
X60780000Y-101742000D03*
D12*
X58240000Y-101742000D03*
X55700000Y-101742000D03*
X53160000Y-101742000D03*
X50620000Y-101742000D03*
X48080000Y-101742000D03*
X45540000Y-101742000D03*
X43000000Y-101742000D03*
X40460000Y-101742000D03*
X37920000Y-101742000D03*
X35380000Y-101742000D03*
X32840000Y-101742000D03*
%TD*%
D11*
%TO.C,J16*%
X31028000Y-47842000D03*
D12*
X33568000Y-47842000D03*
X36108000Y-47842000D03*
X38648000Y-47842000D03*
%TD*%
D11*
%TO.C,J14*%
X73000000Y-56000000D03*
D12*
X73000000Y-58540000D03*
X73000000Y-61080000D03*
X73000000Y-63620000D03*
X73000000Y-66160000D03*
X73000000Y-68700000D03*
X73000000Y-71240000D03*
%TD*%
%TO.C,J11*%
X30500000Y-71240000D03*
X30500000Y-68700000D03*
X30500000Y-66160000D03*
X30500000Y-63620000D03*
X30500000Y-61080000D03*
X30500000Y-58540000D03*
D11*
X30500000Y-56000000D03*
%TD*%
%TO.C,J6*%
X34010000Y-52042000D03*
D12*
X36550000Y-52042000D03*
X39090000Y-52042000D03*
X41630000Y-52042000D03*
X44170000Y-52042000D03*
X46710000Y-52042000D03*
X49250000Y-52042000D03*
X51790000Y-52042000D03*
X54330000Y-52042000D03*
X56870000Y-52042000D03*
X59410000Y-52042000D03*
X61950000Y-52042000D03*
X64490000Y-52042000D03*
X67030000Y-52042000D03*
X69570000Y-52042000D03*
%TD*%
D11*
%TO.C,J17*%
X67860000Y-76952000D03*
D12*
X65320000Y-76952000D03*
X62780000Y-76952000D03*
X60240000Y-76952000D03*
X57700000Y-76952000D03*
X55160000Y-76952000D03*
X52620000Y-76952000D03*
%TD*%
D15*
%TO.C,H4*%
X73908000Y-107914000D03*
%TD*%
%TO.C,H3*%
X29908000Y-107914000D03*
%TD*%
%TO.C,H2*%
X73908000Y-140054000D03*
%TD*%
%TO.C,H1*%
X29908000Y-140054000D03*
%TD*%
%TO.C,J18*%
G36*
G01*
X68620000Y-142408168D02*
X68620000Y-141049832D01*
G75*
G02*
X68890832Y-140779000I270832J0D01*
G01*
X69649168Y-140779000D01*
G75*
G02*
X69920000Y-141049832I0J-270832D01*
G01*
X69920000Y-142408168D01*
G75*
G02*
X69649168Y-142679000I-270832J0D01*
G01*
X68890832Y-142679000D01*
G75*
G02*
X68620000Y-142408168I0J270832D01*
G01*
G37*
G36*
G01*
X63020000Y-142408168D02*
X63020000Y-141049832D01*
G75*
G02*
X63290832Y-140779000I270832J0D01*
G01*
X64049168Y-140779000D01*
G75*
G02*
X64320000Y-141049832I0J-270832D01*
G01*
X64320000Y-142408168D01*
G75*
G02*
X64049168Y-142679000I-270832J0D01*
G01*
X63290832Y-142679000D01*
G75*
G02*
X63020000Y-142408168I0J270832D01*
G01*
G37*
G36*
G01*
X67620000Y-138504000D02*
X67620000Y-137204000D01*
G75*
G02*
X67795000Y-137029000I175000J0D01*
G01*
X68145000Y-137029000D01*
G75*
G02*
X68320000Y-137204000I0J-175000D01*
G01*
X68320000Y-138504000D01*
G75*
G02*
X68145000Y-138679000I-175000J0D01*
G01*
X67795000Y-138679000D01*
G75*
G02*
X67620000Y-138504000I0J175000D01*
G01*
G37*
G36*
G01*
X66620000Y-138504000D02*
X66620000Y-137204000D01*
G75*
G02*
X66795000Y-137029000I175000J0D01*
G01*
X67145000Y-137029000D01*
G75*
G02*
X67320000Y-137204000I0J-175000D01*
G01*
X67320000Y-138504000D01*
G75*
G02*
X67145000Y-138679000I-175000J0D01*
G01*
X66795000Y-138679000D01*
G75*
G02*
X66620000Y-138504000I0J175000D01*
G01*
G37*
G36*
G01*
X65620000Y-138504000D02*
X65620000Y-137204000D01*
G75*
G02*
X65795000Y-137029000I175000J0D01*
G01*
X66145000Y-137029000D01*
G75*
G02*
X66320000Y-137204000I0J-175000D01*
G01*
X66320000Y-138504000D01*
G75*
G02*
X66145000Y-138679000I-175000J0D01*
G01*
X65795000Y-138679000D01*
G75*
G02*
X65620000Y-138504000I0J175000D01*
G01*
G37*
G36*
G01*
X64620000Y-138504000D02*
X64620000Y-137204000D01*
G75*
G02*
X64795000Y-137029000I175000J0D01*
G01*
X65145000Y-137029000D01*
G75*
G02*
X65320000Y-137204000I0J-175000D01*
G01*
X65320000Y-138504000D01*
G75*
G02*
X65145000Y-138679000I-175000J0D01*
G01*
X64795000Y-138679000D01*
G75*
G02*
X64620000Y-138504000I0J175000D01*
G01*
G37*
%TD*%
D11*
%TO.C,J5*%
X27686000Y-100076000D03*
D12*
X27686000Y-97536000D03*
X27686000Y-94996000D03*
%TD*%
D16*
%TO.C,SW2*%
X69160000Y-118250000D03*
D17*
X71650000Y-119500000D03*
X71650000Y-124000000D03*
D16*
X69160000Y-125260000D03*
%TD*%
%TO.C,SW1*%
X69138000Y-88412000D03*
D17*
X71628000Y-89662000D03*
X71628000Y-94162000D03*
D16*
X69138000Y-95422000D03*
%TD*%
%TO.C,J1*%
G36*
G01*
X28848168Y-89042000D02*
X27539832Y-89042000D01*
G75*
G02*
X27269000Y-88771168I0J270832D01*
G01*
X27269000Y-88012832D01*
G75*
G02*
X27539832Y-87742000I270832J0D01*
G01*
X28848168Y-87742000D01*
G75*
G02*
X29119000Y-88012832I0J-270832D01*
G01*
X29119000Y-88771168D01*
G75*
G02*
X28848168Y-89042000I-270832J0D01*
G01*
G37*
D18*
X28194000Y-86392000D03*
%TD*%
D11*
%TO.C,J10*%
X32830000Y-81458000D03*
D12*
X35370000Y-81458000D03*
X37910000Y-81458000D03*
X40450000Y-81458000D03*
X42990000Y-81458000D03*
X45530000Y-81458000D03*
X48070000Y-81458000D03*
X50610000Y-81458000D03*
X53150000Y-81458000D03*
X55690000Y-81458000D03*
X58230000Y-81458000D03*
X60770000Y-81458000D03*
X63310000Y-81458000D03*
X65850000Y-81458000D03*
X68390000Y-81458000D03*
X70930000Y-81458000D03*
%TD*%
%TO.C,J2*%
X32890000Y-134474000D03*
X35430000Y-134474000D03*
X37970000Y-134474000D03*
X40510000Y-134474000D03*
X43050000Y-134474000D03*
X45590000Y-134474000D03*
X48130000Y-134474000D03*
X50670000Y-134474000D03*
X53210000Y-134474000D03*
X55750000Y-134474000D03*
X58290000Y-134474000D03*
D11*
X60830000Y-134474000D03*
%TD*%
D12*
%TO.C,J3*%
X70950000Y-114184000D03*
X68410000Y-114184000D03*
X65870000Y-114184000D03*
X63330000Y-114184000D03*
X60790000Y-114184000D03*
X58250000Y-114184000D03*
X55710000Y-114184000D03*
X53170000Y-114184000D03*
X50630000Y-114184000D03*
X48090000Y-114184000D03*
X45550000Y-114184000D03*
X43010000Y-114184000D03*
X40470000Y-114184000D03*
X37930000Y-114184000D03*
X35390000Y-114184000D03*
D11*
X32850000Y-114184000D03*
%TD*%
D19*
%TO.C,D1*%
X42250000Y-118000000D03*
D20*
X42250000Y-130700000D03*
%TD*%
D21*
%TO.C,C2*%
X71718000Y-130584000D03*
D13*
X74218000Y-130584000D03*
%TD*%
D21*
%TO.C,C1*%
X65448000Y-130584000D03*
D13*
X67948000Y-130584000D03*
%TD*%
D11*
%TO.C,J4*%
X60892000Y-126774000D03*
D12*
X60892000Y-124234000D03*
X60892000Y-121694000D03*
%TD*%
D13*
%TO.C,R4*%
X60960000Y-97282000D03*
D14*
X60960000Y-84582000D03*
%TD*%
%TO.C,J12*%
G36*
G01*
X70440000Y-47900000D02*
X70440000Y-49200000D01*
G75*
G02*
X70265000Y-49375000I-175000J0D01*
G01*
X69915000Y-49375000D01*
G75*
G02*
X69740000Y-49200000I0J175000D01*
G01*
X69740000Y-47900000D01*
G75*
G02*
X69915000Y-47725000I175000J0D01*
G01*
X70265000Y-47725000D01*
G75*
G02*
X70440000Y-47900000I0J-175000D01*
G01*
G37*
G36*
G01*
X69440000Y-47900000D02*
X69440000Y-49200000D01*
G75*
G02*
X69265000Y-49375000I-175000J0D01*
G01*
X68915000Y-49375000D01*
G75*
G02*
X68740000Y-49200000I0J175000D01*
G01*
X68740000Y-47900000D01*
G75*
G02*
X68915000Y-47725000I175000J0D01*
G01*
X69265000Y-47725000D01*
G75*
G02*
X69440000Y-47900000I0J-175000D01*
G01*
G37*
G36*
G01*
X68440000Y-47900000D02*
X68440000Y-49200000D01*
G75*
G02*
X68265000Y-49375000I-175000J0D01*
G01*
X67915000Y-49375000D01*
G75*
G02*
X67740000Y-49200000I0J175000D01*
G01*
X67740000Y-47900000D01*
G75*
G02*
X67915000Y-47725000I175000J0D01*
G01*
X68265000Y-47725000D01*
G75*
G02*
X68440000Y-47900000I0J-175000D01*
G01*
G37*
G36*
G01*
X67440000Y-47900000D02*
X67440000Y-49200000D01*
G75*
G02*
X67265000Y-49375000I-175000J0D01*
G01*
X66915000Y-49375000D01*
G75*
G02*
X66740000Y-49200000I0J175000D01*
G01*
X66740000Y-47900000D01*
G75*
G02*
X66915000Y-47725000I175000J0D01*
G01*
X67265000Y-47725000D01*
G75*
G02*
X67440000Y-47900000I0J-175000D01*
G01*
G37*
G36*
G01*
X72040000Y-43995832D02*
X72040000Y-45354168D01*
G75*
G02*
X71769168Y-45625000I-270832J0D01*
G01*
X71010832Y-45625000D01*
G75*
G02*
X70740000Y-45354168I0J270832D01*
G01*
X70740000Y-43995832D01*
G75*
G02*
X71010832Y-43725000I270832J0D01*
G01*
X71769168Y-43725000D01*
G75*
G02*
X72040000Y-43995832I0J-270832D01*
G01*
G37*
G36*
G01*
X66440000Y-43995832D02*
X66440000Y-45354168D01*
G75*
G02*
X66169168Y-45625000I-270832J0D01*
G01*
X65410832Y-45625000D01*
G75*
G02*
X65140000Y-45354168I0J270832D01*
G01*
X65140000Y-43995832D01*
G75*
G02*
X65410832Y-43725000I270832J0D01*
G01*
X66169168Y-43725000D01*
G75*
G02*
X66440000Y-43995832I0J-270832D01*
G01*
G37*
%TD*%
%TO.C,J7*%
G36*
G01*
X48100000Y-123244000D02*
X46300000Y-123244000D01*
G75*
G02*
X45400000Y-122344000I0J900000D01*
G01*
X45400000Y-120544000D01*
G75*
G02*
X46300000Y-119644000I900000J0D01*
G01*
X48100000Y-119644000D01*
G75*
G02*
X49000000Y-120544000I0J-900000D01*
G01*
X49000000Y-122344000D01*
G75*
G02*
X48100000Y-123244000I-900000J0D01*
G01*
G37*
G36*
G01*
X52925000Y-125994000D02*
X50875000Y-125994000D01*
G75*
G02*
X50100000Y-125219000I0J775000D01*
G01*
X50100000Y-123669000D01*
G75*
G02*
X50875000Y-122894000I775000J0D01*
G01*
X52925000Y-122894000D01*
G75*
G02*
X53700000Y-123669000I0J-775000D01*
G01*
X53700000Y-125219000D01*
G75*
G02*
X52925000Y-125994000I-775000J0D01*
G01*
G37*
D22*
X51900000Y-118444000D03*
%TD*%
D23*
%TO.C,J8*%
X31750000Y-122174000D03*
D24*
X31750000Y-127174000D03*
%TD*%
D14*
%TO.C,R2*%
X53340000Y-84582000D03*
D13*
X53340000Y-97282000D03*
%TD*%
D14*
%TO.C,R1*%
X49530000Y-84582000D03*
D13*
X49530000Y-97282000D03*
%TD*%
D14*
%TO.C,R3*%
X57150000Y-84582000D03*
D13*
X57150000Y-97282000D03*
%TD*%
M02*
