%TF.GenerationSoftware,KiCad,Pcbnew,5.1.6-c6e7f7d~87~ubuntu18.04.1*%
%TF.CreationDate,2021-12-28T16:58:53-05:00*%
%TF.ProjectId,remote,72656d6f-7465-42e6-9b69-6361645f7063,rev?*%
%TF.SameCoordinates,Original*%
%TF.FileFunction,Legend,Top*%
%TF.FilePolarity,Positive*%
%FSLAX46Y46*%
G04 Gerber Fmt 4.6, Leading zero omitted, Abs format (unit mm)*
G04 Created by KiCad (PCBNEW 5.1.6-c6e7f7d~87~ubuntu18.04.1) date 2021-12-28 16:58:53*
%MOMM*%
%LPD*%
G01*
G04 APERTURE LIST*
%ADD10C,0.120000*%
%ADD11C,0.200000*%
%ADD12C,0.300000*%
G04 APERTURE END LIST*
D10*
X50450000Y-39219943D02*
G75*
G03*
X50450000Y-39219943I-1725000J0D01*
G01*
D11*
X13032142Y-104639285D02*
X13032142Y-106439285D01*
X13032142Y-104725000D02*
X13203571Y-104639285D01*
X13546428Y-104639285D01*
X13717857Y-104725000D01*
X13803571Y-104810714D01*
X13889285Y-104982142D01*
X13889285Y-105496428D01*
X13803571Y-105667857D01*
X13717857Y-105753571D01*
X13546428Y-105839285D01*
X13203571Y-105839285D01*
X13032142Y-105753571D01*
X14489285Y-104639285D02*
X14917857Y-105839285D01*
X15346428Y-104639285D01*
X16289285Y-105839285D02*
X16117857Y-105753571D01*
X16032142Y-105667857D01*
X15946428Y-105496428D01*
X15946428Y-104982142D01*
X16032142Y-104810714D01*
X16117857Y-104725000D01*
X16289285Y-104639285D01*
X16546428Y-104639285D01*
X16717857Y-104725000D01*
X16803571Y-104810714D01*
X16889285Y-104982142D01*
X16889285Y-105496428D01*
X16803571Y-105667857D01*
X16717857Y-105753571D01*
X16546428Y-105839285D01*
X16289285Y-105839285D01*
X17575000Y-105753571D02*
X17746428Y-105839285D01*
X18089285Y-105839285D01*
X18260714Y-105753571D01*
X18346428Y-105582142D01*
X18346428Y-105496428D01*
X18260714Y-105325000D01*
X18089285Y-105239285D01*
X17832142Y-105239285D01*
X17660714Y-105153571D01*
X17575000Y-104982142D01*
X17575000Y-104896428D01*
X17660714Y-104725000D01*
X17832142Y-104639285D01*
X18089285Y-104639285D01*
X18260714Y-104725000D01*
X19117857Y-105667857D02*
X19203571Y-105753571D01*
X19117857Y-105839285D01*
X19032142Y-105753571D01*
X19117857Y-105667857D01*
X19117857Y-105839285D01*
X20232142Y-105839285D02*
X20060714Y-105753571D01*
X19975000Y-105667857D01*
X19889285Y-105496428D01*
X19889285Y-104982142D01*
X19975000Y-104810714D01*
X20060714Y-104725000D01*
X20232142Y-104639285D01*
X20489285Y-104639285D01*
X20660714Y-104725000D01*
X20746428Y-104810714D01*
X20832142Y-104982142D01*
X20832142Y-105496428D01*
X20746428Y-105667857D01*
X20660714Y-105753571D01*
X20489285Y-105839285D01*
X20232142Y-105839285D01*
X21603571Y-105839285D02*
X21603571Y-104639285D01*
X21603571Y-104982142D02*
X21689285Y-104810714D01*
X21775000Y-104725000D01*
X21946428Y-104639285D01*
X22117857Y-104639285D01*
X23489285Y-104639285D02*
X23489285Y-106096428D01*
X23403571Y-106267857D01*
X23317857Y-106353571D01*
X23146428Y-106439285D01*
X22889285Y-106439285D01*
X22717857Y-106353571D01*
X23489285Y-105753571D02*
X23317857Y-105839285D01*
X22975000Y-105839285D01*
X22803571Y-105753571D01*
X22717857Y-105667857D01*
X22632142Y-105496428D01*
X22632142Y-104982142D01*
X22717857Y-104810714D01*
X22803571Y-104725000D01*
X22975000Y-104639285D01*
X23317857Y-104639285D01*
X23489285Y-104725000D01*
X25632142Y-103953571D02*
X24089285Y-106267857D01*
X27003571Y-105753571D02*
X26832142Y-105839285D01*
X26489285Y-105839285D01*
X26317857Y-105753571D01*
X26232142Y-105667857D01*
X26146428Y-105496428D01*
X26146428Y-104982142D01*
X26232142Y-104810714D01*
X26317857Y-104725000D01*
X26489285Y-104639285D01*
X26832142Y-104639285D01*
X27003571Y-104725000D01*
X28032142Y-105839285D02*
X27860714Y-105753571D01*
X27775000Y-105667857D01*
X27689285Y-105496428D01*
X27689285Y-104982142D01*
X27775000Y-104810714D01*
X27860714Y-104725000D01*
X28032142Y-104639285D01*
X28289285Y-104639285D01*
X28460714Y-104725000D01*
X28546428Y-104810714D01*
X28632142Y-104982142D01*
X28632142Y-105496428D01*
X28546428Y-105667857D01*
X28460714Y-105753571D01*
X28289285Y-105839285D01*
X28032142Y-105839285D01*
X29317857Y-104210714D02*
X29403571Y-104125000D01*
X29575000Y-104039285D01*
X30003571Y-104039285D01*
X30175000Y-104125000D01*
X30260714Y-104210714D01*
X30346428Y-104382142D01*
X30346428Y-104553571D01*
X30260714Y-104810714D01*
X29232142Y-105839285D01*
X30346428Y-105839285D01*
X32403571Y-103953571D02*
X30860714Y-106267857D01*
X33003571Y-105839285D02*
X33003571Y-104639285D01*
X33003571Y-104982142D02*
X33089285Y-104810714D01*
X33174999Y-104725000D01*
X33346428Y-104639285D01*
X33517857Y-104639285D01*
X34803571Y-105753571D02*
X34632142Y-105839285D01*
X34289285Y-105839285D01*
X34117857Y-105753571D01*
X34032142Y-105582142D01*
X34032142Y-104896428D01*
X34117857Y-104725000D01*
X34289285Y-104639285D01*
X34632142Y-104639285D01*
X34803571Y-104725000D01*
X34889285Y-104896428D01*
X34889285Y-105067857D01*
X34032142Y-105239285D01*
X35489285Y-104639285D02*
X35917857Y-105839285D01*
X36346428Y-104639285D01*
X36603571Y-106010714D02*
X37974999Y-106010714D01*
X38232142Y-104639285D02*
X38660714Y-105839285D01*
X39089285Y-104639285D01*
X49248381Y-13659633D02*
G75*
G02*
X47825001Y-13675001I-698381J-1240367D01*
G01*
D10*
X50375000Y-29575000D02*
G75*
G03*
X50375000Y-29575000I-1725000J0D01*
G01*
X-13025000Y6025000D02*
X-6250000Y6025000D01*
D11*
X48550000Y-13400000D02*
X48550000Y-14900000D01*
D12*
X48917857Y-39132142D02*
X49203571Y-39227380D01*
X49298809Y-39322619D01*
X49394047Y-39513095D01*
X49394047Y-39798809D01*
X49298809Y-39989285D01*
X49203571Y-40084523D01*
X49013095Y-40179761D01*
X48251190Y-40179761D01*
X48251190Y-38179761D01*
X48917857Y-38179761D01*
X49108333Y-38275000D01*
X49203571Y-38370238D01*
X49298809Y-38560714D01*
X49298809Y-38751190D01*
X49203571Y-38941666D01*
X49108333Y-39036904D01*
X48917857Y-39132142D01*
X48251190Y-39132142D01*
X48173809Y-29908333D02*
X49126190Y-29908333D01*
X47983333Y-30479761D02*
X48650000Y-28479761D01*
X49316666Y-30479761D01*
M02*
