EESchema Schematic File Version 4
EELAYER 30 0
EELAYER END
$Descr A4 11693 8268
encoding utf-8
Sheet 1 1
Title ""
Date ""
Rev ""
Comp ""
Comment1 ""
Comment2 ""
Comment3 ""
Comment4 ""
$EndDescr
$Comp
L Connector:Conn_01x12_Female J12
U 1 1 61215C27
P 1550 2625
F 0 "J12" H 1578 2601 50  0000 L CNN
F 1 "Conn_01x12_Female" V 1625 1675 50  0000 L CNN
F 2 "Connector_PinSocket_2.54mm:PinSocket_1x12_P2.54mm_Vertical" H 1550 2625 50  0001 C CNN
F 3 "~" H 1550 2625 50  0001 C CNN
	1    1550 2625
	1    0    0    -1  
$EndComp
$Comp
L Connector:Conn_01x16_Female J3
U 1 1 61219D46
P 2050 2850
F 0 "J3" H 2078 2826 50  0000 L CNN
F 1 "Conn_01x16_Female" V 2125 1975 50  0000 L CNN
F 2 "Connector_PinSocket_2.54mm:PinSocket_1x16_P2.54mm_Vertical" H 2050 2850 50  0001 C CNN
F 3 "~" H 2050 2850 50  0001 C CNN
	1    2050 2850
	-1   0    0    1   
$EndComp
Text Notes 1125 1600 0    79   ~ 0
Feather M4 Express
$Comp
L Connector:Conn_01x12_Female J5
U 1 1 612D6942
P 4125 2375
F 0 "J5" H 4153 2351 50  0000 L CNN
F 1 "Conn_01x12_Female" V 4225 1475 50  0000 L CNN
F 2 "Connector_PinSocket_2.54mm:PinSocket_1x12_P2.54mm_Vertical" H 4125 2375 50  0001 C CNN
F 3 "~" H 4125 2375 50  0001 C CNN
	1    4125 2375
	1    0    0    -1  
$EndComp
$Comp
L Connector:Conn_01x16_Female J1
U 1 1 612D6948
P 4575 2700
F 0 "J1" H 4603 2676 50  0000 L CNN
F 1 "Conn_01x16_Female" V 4675 1775 50  0000 L CNN
F 2 "Connector_PinSocket_2.54mm:PinSocket_1x16_P2.54mm_Vertical" H 4575 2700 50  0001 C CNN
F 3 "~" H 4575 2700 50  0001 C CNN
	1    4575 2700
	-1   0    0    1   
$EndComp
Text Notes 3825 1475 0    79   ~ 0
Airlift Featherwing
$Comp
L Connector:Conn_01x04_Male J2
U 1 1 61312065
P 6275 2200
F 0 "J2" H 6383 2481 50  0000 C CNN
F 1 "Conn_01x04_Male" H 6383 2390 50  0000 C CNN
F 2 "Connector_PinHeader_2.54mm:PinHeader_1x04_P2.54mm_Horizontal" H 6275 2200 50  0001 C CNN
F 3 "~" H 6275 2200 50  0001 C CNN
	1    6275 2200
	1    0    0    -1  
$EndComp
$Comp
L power:GND #PWR0105
U 1 1 61319714
P 1325 6025
F 0 "#PWR0105" H 1325 5775 50  0001 C CNN
F 1 "GND" H 1330 5852 50  0000 C CNN
F 2 "" H 1325 6025 50  0001 C CNN
F 3 "" H 1325 6025 50  0001 C CNN
	1    1325 6025
	1    0    0    -1  
$EndComp
$Comp
L power:+3V3 #PWR0106
U 1 1 6131971A
P 1550 6125
F 0 "#PWR0106" H 1550 5975 50  0001 C CNN
F 1 "+3V3" H 1565 6298 50  0000 C CNN
F 2 "" H 1550 6125 50  0001 C CNN
F 3 "" H 1550 6125 50  0001 C CNN
	1    1550 6125
	1    0    0    -1  
$EndComp
Text GLabel 1725 6225 0    50   Input ~ 0
SDA
Text GLabel 1725 6325 0    50   Input ~ 0
SCL
Wire Wire Line
	1725 6025 1325 6025
Wire Wire Line
	1725 6125 1550 6125
$Comp
L Connector:Conn_01x04_Female J7
U 1 1 61319724
P 1925 6125
F 0 "J7" H 1953 6101 50  0000 L CNN
F 1 "Conn_01x04_Female" V 2100 5675 50  0000 L CNN
F 2 "Connector_JST:JST_SH_SM04B-SRSS-TB_1x04-1MP_P1.00mm_Horizontal" H 1925 6125 50  0001 C CNN
F 3 "~" H 1925 6125 50  0001 C CNN
	1    1925 6125
	1    0    0    -1  
$EndComp
Text Notes 1100 5775 0    79   ~ 0
QWIIC
$Comp
L Connector:Conn_01x07_Female J9
U 1 1 6131D6E8
P 3600 4200
F 0 "J9" H 3628 4226 50  0000 L CNN
F 1 "Conn_01x07_Female" H 3628 4135 50  0000 L CNN
F 2 "Connector_PinSocket_2.54mm:PinSocket_1x07_P2.54mm_Vertical" H 3600 4200 50  0001 C CNN
F 3 "~" H 3600 4200 50  0001 C CNN
	1    3600 4200
	1    0    0    -1  
$EndComp
$Comp
L power:GND #PWR0107
U 1 1 6132A50B
P -1550 4800
F 0 "#PWR0107" H -1550 4550 50  0001 C CNN
F 1 "GND" H -1545 4627 50  0000 C CNN
F 2 "" H -1550 4800 50  0001 C CNN
F 3 "" H -1550 4800 50  0001 C CNN
	1    -1550 4800
	1    0    0    -1  
$EndComp
$Comp
L power:+3V3 #PWR0108
U 1 1 6132A511
P -1325 4900
F 0 "#PWR0108" H -1325 4750 50  0001 C CNN
F 1 "+3V3" H -1310 5073 50  0000 C CNN
F 2 "" H -1325 4900 50  0001 C CNN
F 3 "" H -1325 4900 50  0001 C CNN
	1    -1325 4900
	1    0    0    -1  
$EndComp
Text GLabel -1150 5000 0    50   Input ~ 0
SDA
Text GLabel -1150 5100 0    50   Input ~ 0
SCL
Wire Wire Line
	-1150 4800 -1550 4800
Wire Wire Line
	-1150 4900 -1325 4900
$Comp
L Connector:Conn_01x04_Female J11
U 1 1 6132A51B
P -950 4900
F 0 "J11" H -922 4876 50  0000 L CNN
F 1 "Conn_01x04_Female" V -775 4450 50  0000 L CNN
F 2 "Connector_JST:JST_SH_SM04B-SRSS-TB_1x04-1MP_P1.00mm_Horizontal" H -950 4900 50  0001 C CNN
F 3 "~" H -950 4900 50  0001 C CNN
	1    -950 4900
	1    0    0    -1  
$EndComp
Text Notes -1775 4550 0    79   ~ 0
QWIIC
$Comp
L power:GND #PWR0109
U 1 1 6132A522
P -1625 6050
F 0 "#PWR0109" H -1625 5800 50  0001 C CNN
F 1 "GND" H -1620 5877 50  0000 C CNN
F 2 "" H -1625 6050 50  0001 C CNN
F 3 "" H -1625 6050 50  0001 C CNN
	1    -1625 6050
	1    0    0    -1  
$EndComp
$Comp
L power:+3V3 #PWR0110
U 1 1 6132A528
P -1400 6150
F 0 "#PWR0110" H -1400 6000 50  0001 C CNN
F 1 "+3V3" H -1385 6323 50  0000 C CNN
F 2 "" H -1400 6150 50  0001 C CNN
F 3 "" H -1400 6150 50  0001 C CNN
	1    -1400 6150
	1    0    0    -1  
$EndComp
Text GLabel -1225 6250 0    50   Input ~ 0
SDA
Text GLabel -1225 6350 0    50   Input ~ 0
SCL
Wire Wire Line
	-1225 6050 -1625 6050
Wire Wire Line
	-1225 6150 -1400 6150
$Comp
L Connector:Conn_01x04_Female J10
U 1 1 6132A532
P -1025 6150
F 0 "J10" H -997 6126 50  0000 L CNN
F 1 "Conn_01x04_Female" V -850 5700 50  0000 L CNN
F 2 "Connector_JST:JST_SH_SM04B-SRSS-TB_1x04-1MP_P1.00mm_Horizontal" H -1025 6150 50  0001 C CNN
F 3 "~" H -1025 6150 50  0001 C CNN
	1    -1025 6150
	1    0    0    -1  
$EndComp
Text Notes -1850 5800 0    79   ~ 0
QWIIC
$Comp
L power:+3V3 #PWR0113
U 1 1 61339970
P 3400 3900
F 0 "#PWR0113" H 3400 3750 50  0001 C CNN
F 1 "+3V3" H 3415 4073 50  0000 C CNN
F 2 "" H 3400 3900 50  0001 C CNN
F 3 "" H 3400 3900 50  0001 C CNN
	1    3400 3900
	1    0    0    -1  
$EndComp
$Comp
L power:GND #PWR0114
U 1 1 61339EB1
P 3075 4000
F 0 "#PWR0114" H 3075 3750 50  0001 C CNN
F 1 "GND" H 3080 3827 50  0000 C CNN
F 2 "" H 3075 4000 50  0001 C CNN
F 3 "" H 3075 4000 50  0001 C CNN
	1    3075 4000
	1    0    0    -1  
$EndComp
Text GLabel 3400 4100 0    50   Input ~ 0
SCL
Text GLabel 3400 4200 0    50   Input ~ 0
SDA
Wire Wire Line
	3400 4000 3075 4000
$Comp
L Connector:Conn_01x04_Female J15
U 1 1 61347645
P 9400 5750
F 0 "J15" H 9428 5726 50  0000 L CNN
F 1 "Conn_01x04_Female" H 9428 5635 50  0000 L CNN
F 2 "Connector_PinSocket_2.54mm:PinSocket_1x04_P2.54mm_Vertical" H 9400 5750 50  0001 C CNN
F 3 "~" H 9400 5750 50  0001 C CNN
	1    9400 5750
	1    0    0    -1  
$EndComp
$Comp
L power:GND #PWR0115
U 1 1 6134764B
P 8800 5650
F 0 "#PWR0115" H 8800 5400 50  0001 C CNN
F 1 "GND" H 8805 5477 50  0000 C CNN
F 2 "" H 8800 5650 50  0001 C CNN
F 3 "" H 8800 5650 50  0001 C CNN
	1    8800 5650
	1    0    0    -1  
$EndComp
$Comp
L power:+3V3 #PWR0116
U 1 1 61347651
P 9025 5750
F 0 "#PWR0116" H 9025 5600 50  0001 C CNN
F 1 "+3V3" H 9040 5923 50  0000 C CNN
F 2 "" H 9025 5750 50  0001 C CNN
F 3 "" H 9025 5750 50  0001 C CNN
	1    9025 5750
	1    0    0    -1  
$EndComp
Text GLabel 9200 5850 0    50   Input ~ 0
SDA
Text GLabel 9200 5950 0    50   Input ~ 0
SCL
Wire Wire Line
	9200 5650 8800 5650
Wire Wire Line
	9200 5750 9025 5750
Text Notes 8800 5425 0    79   ~ 0
AUX i2c
$Comp
L power:GND #PWR0101
U 1 1 6135A066
P 6750 2100
F 0 "#PWR0101" H 6750 1850 50  0001 C CNN
F 1 "GND" H 6755 1927 50  0000 C CNN
F 2 "" H 6750 2100 50  0001 C CNN
F 3 "" H 6750 2100 50  0001 C CNN
	1    6750 2100
	1    0    0    -1  
$EndComp
$Comp
L power:+3V3 #PWR0102
U 1 1 6135A538
P 6950 2200
F 0 "#PWR0102" H 6950 2050 50  0001 C CNN
F 1 "+3V3" V 6965 2328 50  0000 L CNN
F 2 "" H 6950 2200 50  0001 C CNN
F 3 "" H 6950 2200 50  0001 C CNN
	1    6950 2200
	1    0    0    -1  
$EndComp
Text GLabel 6475 2300 2    50   Input ~ 0
SDA
Text GLabel 6475 2400 2    50   Input ~ 0
SCL
Wire Wire Line
	6475 2100 6750 2100
Wire Wire Line
	6475 2200 6950 2200
$Comp
L Mechanical:MountingHole H5
U 1 1 6139F6D7
P 10275 1825
F 0 "H5" H 10375 1871 50  0000 L CNN
F 1 "MountingHole" H 10375 1780 50  0000 L CNN
F 2 "MountingHole:MountingHole_3.7mm" H 10275 1825 50  0001 C CNN
F 3 "~" H 10275 1825 50  0001 C CNN
	1    10275 1825
	1    0    0    -1  
$EndComp
$Comp
L Mechanical:MountingHole H1
U 1 1 613CEDF6
P 5450 2750
F 0 "H1" H 5550 2796 50  0000 L CNN
F 1 "MountingHole" H 5550 2705 50  0000 L CNN
F 2 "MountingHole:MountingHole_3.7mm" H 5450 2750 50  0001 C CNN
F 3 "~" H 5450 2750 50  0001 C CNN
	1    5450 2750
	1    0    0    -1  
$EndComp
$Comp
L Mechanical:MountingHole H2
U 1 1 613CF422
P 5475 3100
F 0 "H2" H 5575 3146 50  0000 L CNN
F 1 "MountingHole" H 5575 3055 50  0000 L CNN
F 2 "MountingHole:MountingHole_3.7mm" H 5475 3100 50  0001 C CNN
F 3 "~" H 5475 3100 50  0001 C CNN
	1    5475 3100
	1    0    0    -1  
$EndComp
$EndSCHEMATC
