%TF.GenerationSoftware,KiCad,Pcbnew,5.1.6-c6e7f7d~87~ubuntu18.04.1*%
%TF.CreationDate,2021-07-21T15:50:48-04:00*%
%TF.ProjectId,remote,72656d6f-7465-42e6-9b69-6361645f7063,rev?*%
%TF.SameCoordinates,Original*%
%TF.FileFunction,Profile,NP*%
%FSLAX46Y46*%
G04 Gerber Fmt 4.6, Leading zero omitted, Abs format (unit mm)*
G04 Created by KiCad (PCBNEW 5.1.6-c6e7f7d~87~ubuntu18.04.1) date 2021-07-21 15:50:48*
%MOMM*%
%LPD*%
G01*
G04 APERTURE LIST*
%TA.AperFunction,Profile*%
%ADD10C,0.050000*%
%TD*%
G04 APERTURE END LIST*
D10*
X220624400Y95453200D02*
X211429600Y95453200D01*
X220522800Y100430523D02*
X211531200Y100430523D01*
X208992277Y97993200D02*
G75*
G03*
X211429600Y95453200I2542163J0D01*
G01*
X211531200Y100430523D02*
G75*
G03*
X208991200Y97993200I0J-2542163D01*
G01*
X204439627Y98884288D02*
X207843227Y102033888D01*
X204439627Y98884288D02*
G75*
G02*
X202316269Y97989036I-2276836J2434482D01*
G01*
X195518783Y96688383D02*
X192247627Y93093088D01*
X188996427Y91772288D02*
X189352027Y91783849D01*
X195518783Y96688383D02*
G75*
G02*
X198496027Y97997622I2932747J-2629359D01*
G01*
X192247571Y93093139D02*
G75*
G02*
X189352027Y91783849I-2932691J2629308D01*
G01*
X207843228Y102033888D02*
G75*
G02*
X210689414Y103203900I2801689J-2768586D01*
G01*
X198496027Y97997622D02*
X202316269Y97989036D01*
X223061723Y97993200D02*
G75*
G02*
X220624400Y95453200I-2542163J0D01*
G01*
X210689414Y103203900D02*
X221183200Y103200200D01*
X220522800Y100430523D02*
G75*
G02*
X223062800Y97993200I0J-2542163D01*
G01*
X227431600Y98882200D02*
X224028000Y102031800D01*
X227431600Y98882200D02*
G75*
G03*
X229554958Y97986948I2276836J2434482D01*
G01*
X224027999Y102031800D02*
G75*
G03*
X221181813Y103201812I-2801689J-2768586D01*
G01*
X242874800Y91770200D02*
X242519200Y91781761D01*
X233375200Y97995534D02*
X229554958Y97986948D01*
X236352444Y96686295D02*
X239623600Y93091000D01*
X236352444Y96686295D02*
G75*
G03*
X233375200Y97995534I-2932747J-2629359D01*
G01*
X239623656Y93091051D02*
G75*
G03*
X242519200Y91781761I2932691J2629308D01*
G01*
X246991214Y87769674D02*
G75*
G03*
X242874800Y91770200I-3939944J64016D01*
G01*
X185008930Y-15722524D02*
G75*
G03*
X189001400Y-19729800I3943000J-64066D01*
G01*
X242925647Y-19729351D02*
G75*
G03*
X246989600Y-15748000I125355J3936854D01*
G01*
X185013601Y87769700D02*
G75*
G02*
X188996427Y91772288I3938329J63990D01*
G01*
X246989600Y-15748000D02*
X246989600Y87769700D01*
X189001400Y-19729800D02*
X242925647Y-19729351D01*
X185013600Y87769700D02*
X185013600Y-15722600D01*
M02*
