%TF.GenerationSoftware,KiCad,Pcbnew,5.1.6-c6e7f7d~87~ubuntu18.04.1*%
%TF.CreationDate,2021-07-21T15:50:48-04:00*%
%TF.ProjectId,remote,72656d6f-7465-42e6-9b69-6361645f7063,rev?*%
%TF.SameCoordinates,Original*%
%TF.FileFunction,Copper,L1,Top*%
%TF.FilePolarity,Positive*%
%FSLAX46Y46*%
G04 Gerber Fmt 4.6, Leading zero omitted, Abs format (unit mm)*
G04 Created by KiCad (PCBNEW 5.1.6-c6e7f7d~87~ubuntu18.04.1) date 2021-07-21 15:50:48*
%MOMM*%
%LPD*%
G01*
G04 APERTURE LIST*
%TA.AperFunction,ComponentPad*%
%ADD10O,2.800000X2.800000*%
%TD*%
%TA.AperFunction,ComponentPad*%
%ADD11R,2.800000X2.800000*%
%TD*%
%TA.AperFunction,ComponentPad*%
%ADD12R,1.700000X1.700000*%
%TD*%
%TA.AperFunction,ComponentPad*%
%ADD13O,1.700000X1.700000*%
%TD*%
%TA.AperFunction,SMDPad,CuDef*%
%ADD14C,0.100000*%
%TD*%
%TA.AperFunction,ComponentPad*%
%ADD15R,1.600000X1.600000*%
%TD*%
%TA.AperFunction,ComponentPad*%
%ADD16C,1.600000*%
%TD*%
%TA.AperFunction,ComponentPad*%
%ADD17C,1.700000*%
%TD*%
%TA.AperFunction,ComponentPad*%
%ADD18O,1.600000X1.600000*%
%TD*%
%TA.AperFunction,ComponentPad*%
%ADD19R,3.500000X3.500000*%
%TD*%
%TA.AperFunction,ComponentPad*%
%ADD20R,2.600000X2.600000*%
%TD*%
%TA.AperFunction,ComponentPad*%
%ADD21C,2.600000*%
%TD*%
%TA.AperFunction,SMDPad,CuDef*%
%ADD22R,1.000000X1.000000*%
%TD*%
%TA.AperFunction,ViaPad*%
%ADD23C,0.800000*%
%TD*%
%TA.AperFunction,Conductor*%
%ADD24C,0.700000*%
%TD*%
%TA.AperFunction,Conductor*%
%ADD25C,0.250000*%
%TD*%
G04 APERTURE END LIST*
D10*
%TO.P,D1,2*%
%TO.N,VOUT_DCDC*%
X205650000Y-5100000D03*
D11*
%TO.P,D1,1*%
%TO.N,VHI*%
X192950000Y-5100000D03*
%TD*%
D12*
%TO.P,J11,1*%
%TO.N,N/C*%
X225500000Y31600000D03*
D13*
%TO.P,J11,2*%
X225500000Y29060000D03*
%TO.P,J11,3*%
X225500000Y26520000D03*
%TO.P,J11,4*%
%TO.N,3_BUTTON_B*%
X225500000Y23980000D03*
%TO.P,J11,5*%
%TO.N,N/C*%
X225500000Y21440000D03*
%TD*%
%TA.AperFunction,SMDPad,CuDef*%
D14*
%TO.P,JP2,2*%
%TO.N,VIN_DCDC*%
G36*
X228200000Y-12950000D02*
G01*
X229350000Y-12950000D01*
X228850000Y-13700000D01*
X229350000Y-14450000D01*
X228200000Y-14450000D01*
X228200000Y-12950000D01*
G37*
%TD.AperFunction*%
%TA.AperFunction,SMDPad,CuDef*%
%TO.P,JP2,1*%
%TO.N,VOUT_DCDC*%
G36*
X229150000Y-13700000D02*
G01*
X229650000Y-12950000D01*
X230650000Y-12950000D01*
X230650000Y-14450000D01*
X229650000Y-14450000D01*
X229150000Y-13700000D01*
G37*
%TD.AperFunction*%
%TD*%
D15*
%TO.P,C2,1*%
%TO.N,GND*%
X232900000Y2100000D03*
D16*
%TO.P,C2,2*%
%TO.N,VOUT_DCDC*%
X232900000Y4600000D03*
%TD*%
D15*
%TO.P,C1,1*%
%TO.N,GND*%
X232800000Y-4650000D03*
D16*
%TO.P,C1,2*%
%TO.N,VIN_DCDC*%
X232800000Y-2150000D03*
%TD*%
D12*
%TO.P,J9,1*%
%TO.N,VIN_DCDC*%
X224950000Y-9450000D03*
D13*
%TO.P,J9,2*%
%TO.N,GND*%
X227490000Y-9450000D03*
%TO.P,J9,3*%
%TO.N,VOUT_DCDC*%
X230030000Y-9450000D03*
%TD*%
D17*
%TO.P,SW2,4*%
%TO.N,GND*%
X193750000Y57250000D03*
%TO.P,SW2,3*%
X193750000Y50750000D03*
%TO.P,SW2,2*%
%TO.N,3_BUTTON_B*%
X198250000Y57250000D03*
%TO.P,SW2,1*%
X198250000Y50750000D03*
%TD*%
D16*
%TO.P,R1,1*%
%TO.N,+3V3*%
X204000000Y57500000D03*
D18*
%TO.P,R1,2*%
%TO.N,3_BUTTON_B*%
X204000000Y44800000D03*
%TD*%
D12*
%TO.P,J2,1*%
%TO.N,SDA*%
X240893600Y8991600D03*
D13*
%TO.P,J2,2*%
%TO.N,SCL*%
X240893600Y6451600D03*
%TO.P,J2,3*%
%TO.N,TX*%
X240893600Y3911600D03*
%TO.P,J2,4*%
%TO.N,RX*%
X240893600Y1371600D03*
%TO.P,J2,5*%
%TO.N,VHI*%
X240893600Y-1168400D03*
%TO.P,J2,6*%
%TO.N,+3V3*%
X240893600Y-3708400D03*
%TO.P,J2,7*%
%TO.N,GND*%
X240893600Y-6248400D03*
%TD*%
D19*
%TO.P,J4,1*%
%TO.N,VIN_DCDC*%
X215138000Y-5435600D03*
%TO.P,J4,2*%
%TO.N,GND*%
%TA.AperFunction,ComponentPad*%
G36*
G01*
X216138000Y-12935600D02*
X214138000Y-12935600D01*
G75*
G02*
X213388000Y-12185600I0J750000D01*
G01*
X213388000Y-10685600D01*
G75*
G02*
X214138000Y-9935600I750000J0D01*
G01*
X216138000Y-9935600D01*
G75*
G02*
X216888000Y-10685600I0J-750000D01*
G01*
X216888000Y-12185600D01*
G75*
G02*
X216138000Y-12935600I-750000J0D01*
G01*
G37*
%TD.AperFunction*%
%TO.P,J4,3*%
%TO.N,N/C*%
%TA.AperFunction,ComponentPad*%
G36*
G01*
X211313000Y-10185600D02*
X209563000Y-10185600D01*
G75*
G02*
X208688000Y-9310600I0J875000D01*
G01*
X208688000Y-7560600D01*
G75*
G02*
X209563000Y-6685600I875000J0D01*
G01*
X211313000Y-6685600D01*
G75*
G02*
X212188000Y-7560600I0J-875000D01*
G01*
X212188000Y-9310600D01*
G75*
G02*
X211313000Y-10185600I-875000J0D01*
G01*
G37*
%TD.AperFunction*%
%TD*%
D18*
%TO.P,R5,2*%
%TO.N,2_NEOPIXEL*%
X224500000Y44800000D03*
D16*
%TO.P,R5,1*%
%TO.N,Net-(J1-Pad3)*%
X224500000Y57500000D03*
%TD*%
D17*
%TO.P,SW3,1*%
%TO.N,~RESET*%
X240500000Y21900000D03*
%TO.P,SW3,2*%
X234000000Y21900000D03*
%TO.P,SW3,3*%
%TO.N,GND*%
X240500000Y17400000D03*
%TO.P,SW3,4*%
X234000000Y17400000D03*
%TD*%
D20*
%TO.P,J7,1*%
%TO.N,GND*%
X204950000Y-12050000D03*
D21*
%TO.P,J7,2*%
%TO.N,VBAT*%
X199950000Y-12050000D03*
%TD*%
D18*
%TO.P,R4,2*%
%TO.N,SCL*%
X216000000Y44800000D03*
D16*
%TO.P,R4,1*%
%TO.N,+3V3*%
X216000000Y57500000D03*
%TD*%
D18*
%TO.P,R3,2*%
%TO.N,SDA*%
X212000000Y44800000D03*
D16*
%TO.P,R3,1*%
%TO.N,+3V3*%
X212000000Y57500000D03*
%TD*%
D18*
%TO.P,R2,2*%
%TO.N,A3_BUTTON_A*%
X208000000Y44800000D03*
D16*
%TO.P,R2,1*%
%TO.N,+3V3*%
X208000000Y57500000D03*
%TD*%
D13*
%TO.P,J1,4*%
%TO.N,GND*%
X240614200Y75336400D03*
%TO.P,J1,3*%
%TO.N,Net-(J1-Pad3)*%
X238074200Y75336400D03*
%TO.P,J1,2*%
%TO.N,+3V3*%
X235534200Y75336400D03*
D12*
%TO.P,J1,1*%
%TO.N,GND*%
X232994200Y75336400D03*
%TD*%
D22*
%TO.P,TP4,1*%
%TO.N,GND*%
X240596420Y74165460D03*
%TD*%
%TO.P,TP3,1*%
%TO.N,Net-(J1-Pad3)*%
X238046260Y74173080D03*
%TD*%
%TO.P,TP2,1*%
%TO.N,+3V3*%
X235557060Y74112120D03*
%TD*%
%TO.P,TP1,1*%
%TO.N,GND*%
X232989120Y74137520D03*
%TD*%
D13*
%TO.P,J14,14*%
%TO.N,~RESET*%
X192455800Y18923000D03*
%TO.P,J14,13*%
%TO.N,+3V3*%
X194995800Y18923000D03*
%TO.P,J14,12*%
%TO.N,N/C*%
X197535800Y18923000D03*
%TO.P,J14,11*%
%TO.N,VHI*%
X200075800Y18923000D03*
%TO.P,J14,10*%
%TO.N,A0_LORAWAN*%
X202615800Y18923000D03*
%TO.P,J14,9*%
%TO.N,A1_SD_CS*%
X205155800Y18923000D03*
%TO.P,J14,8*%
%TO.N,A2_LORA_IRQ*%
X207695800Y18923000D03*
%TO.P,J14,7*%
%TO.N,A3_BUTTON_A*%
X210235800Y18923000D03*
%TO.P,J14,6*%
%TO.N,A4_LORA_CS*%
X212775800Y18923000D03*
%TO.P,J14,5*%
%TO.N,A5_LORA_RESET*%
X215315800Y18923000D03*
%TO.P,J14,4*%
%TO.N,SCK*%
X217855800Y18923000D03*
%TO.P,J14,3*%
%TO.N,MOSI*%
X220395800Y18923000D03*
%TO.P,J14,2*%
%TO.N,MISO*%
X222935800Y18923000D03*
D12*
%TO.P,J14,1*%
%TO.N,2_NEOPIXEL*%
X225475800Y18923000D03*
%TD*%
D13*
%TO.P,J13,14*%
%TO.N,N/C*%
X192379600Y-863600D03*
%TO.P,J13,13*%
%TO.N,+3V3*%
X194919600Y-863600D03*
%TO.P,J13,12*%
%TO.N,N/C*%
X197459600Y-863600D03*
%TO.P,J13,11*%
X199999600Y-863600D03*
%TO.P,J13,10*%
X202539600Y-863600D03*
%TO.P,J13,9*%
X205079600Y-863600D03*
%TO.P,J13,8*%
X207619600Y-863600D03*
%TO.P,J13,7*%
X210159600Y-863600D03*
%TO.P,J13,6*%
X212699600Y-863600D03*
%TO.P,J13,5*%
X215239600Y-863600D03*
%TO.P,J13,4*%
%TO.N,SCK*%
X217779600Y-863600D03*
%TO.P,J13,3*%
%TO.N,MOSI*%
X220319600Y-863600D03*
%TO.P,J13,2*%
%TO.N,MISO*%
X222859600Y-863600D03*
D12*
%TO.P,J13,1*%
%TO.N,N/C*%
X225399600Y-863600D03*
%TD*%
D13*
%TO.P,J12,14*%
%TO.N,N/C*%
X225399600Y14376400D03*
%TO.P,J12,13*%
X222859600Y14376400D03*
%TO.P,J12,12*%
X220319600Y14376400D03*
%TO.P,J12,11*%
X217779600Y14376400D03*
%TO.P,J12,10*%
X215239600Y14376400D03*
%TO.P,J12,9*%
X212699600Y14376400D03*
%TO.P,J12,8*%
X210159600Y14376400D03*
%TO.P,J12,7*%
X207619600Y14376400D03*
%TO.P,J12,6*%
%TO.N,9_ESP_BUSY*%
X205079600Y14376400D03*
%TO.P,J12,5*%
%TO.N,7_ESP_RESET*%
X202539600Y14376400D03*
%TO.P,J12,4*%
%TO.N,10_ESP_CS*%
X199999600Y14376400D03*
%TO.P,J12,3*%
%TO.N,N/C*%
X197459600Y14376400D03*
%TO.P,J12,2*%
%TO.N,GND*%
X194919600Y14376400D03*
D12*
%TO.P,J12,1*%
%TO.N,N/C*%
X192379600Y14376400D03*
%TD*%
D13*
%TO.P,J3,14*%
%TO.N,RX*%
X225475800Y34163000D03*
%TO.P,J3,13*%
%TO.N,TX*%
X222935800Y34163000D03*
%TO.P,J3,12*%
%TO.N,SDA*%
X220395800Y34163000D03*
%TO.P,J3,11*%
%TO.N,SCL*%
X217855800Y34163000D03*
%TO.P,J3,10*%
%TO.N,N/C*%
X215315800Y34163000D03*
%TO.P,J3,9*%
%TO.N,7_ESP_RESET*%
X212775800Y34163000D03*
%TO.P,J3,8*%
%TO.N,9_ESP_BUSY*%
X210235800Y34163000D03*
%TO.P,J3,7*%
%TO.N,10_ESP_CS*%
X207695800Y34163000D03*
%TO.P,J3,6*%
%TO.N,11_LORA_MOSI*%
X205155800Y34163000D03*
%TO.P,J3,5*%
%TO.N,12_LORA_MISO*%
X202615800Y34163000D03*
%TO.P,J3,4*%
%TO.N,13_LORA_SCK*%
X200075800Y34163000D03*
%TO.P,J3,3*%
%TO.N,N/C*%
X197535800Y34163000D03*
%TO.P,J3,2*%
%TO.N,GND*%
X194995800Y34163000D03*
D12*
%TO.P,J3,1*%
%TO.N,VBAT*%
X192455800Y34163000D03*
%TD*%
%TO.P,J5,1*%
%TO.N,Net-(J5-Pad1)*%
X234340400Y95808800D03*
%TD*%
D17*
%TO.P,SW1,1*%
%TO.N,A3_BUTTON_A*%
X195580000Y66954400D03*
%TO.P,SW1,2*%
X195580000Y73454400D03*
%TO.P,SW1,3*%
%TO.N,GND*%
X191080000Y66954400D03*
%TO.P,SW1,4*%
X191080000Y73454400D03*
%TD*%
D12*
%TO.P,J10,1*%
%TO.N,GND*%
X206197200Y85674200D03*
D13*
%TO.P,J10,2*%
%TO.N,+3V3*%
X208737200Y85674200D03*
%TO.P,J10,3*%
%TO.N,SCL*%
X211277200Y85674200D03*
%TO.P,J10,4*%
%TO.N,SDA*%
X213817200Y85674200D03*
%TD*%
%TO.P,J8,7*%
%TO.N,N/C*%
X210007200Y38760400D03*
%TO.P,J8,6*%
X212547200Y38760400D03*
%TO.P,J8,5*%
X215087200Y38760400D03*
%TO.P,J8,4*%
%TO.N,SDA*%
X217627200Y38760400D03*
%TO.P,J8,3*%
%TO.N,SCL*%
X220167200Y38760400D03*
%TO.P,J8,2*%
%TO.N,GND*%
X222707200Y38760400D03*
D12*
%TO.P,J8,1*%
%TO.N,+3V3*%
X225247200Y38760400D03*
%TD*%
D23*
%TO.N,+3V3*%
X229387400Y38735000D03*
X230174800Y30075200D03*
X231500000Y55500000D03*
X241500000Y51500000D03*
X231750000Y52250000D03*
X236000000Y69000000D03*
X232750000Y67500000D03*
X236000000Y77250000D03*
X237500000Y77250000D03*
X231750000Y87750000D03*
X208750000Y87500000D03*
X229750000Y55250000D03*
X239000000Y-3750000D03*
X238750000Y30125000D03*
X196400000Y2400000D03*
X238750000Y-1550000D03*
X190600000Y16400000D03*
X191558600Y1041400D03*
%TO.N,GND*%
X227500000Y-5750000D03*
X191109600Y76530200D03*
X216750000Y79250000D03*
X241250000Y53750000D03*
X237250000Y54500000D03*
X233000000Y72750000D03*
X234500000Y71500000D03*
X233250000Y91250000D03*
X220750000Y93250000D03*
X223375000Y92375000D03*
X219500000Y76750000D03*
X206250000Y78500000D03*
X191750000Y57250000D03*
X222413600Y75336400D03*
X236900000Y17400000D03*
X237248400Y-6248400D03*
X237250000Y2500000D03*
X238750000Y31500000D03*
X234250000Y32000000D03*
X233750000Y40750000D03*
X224000000Y42250000D03*
X190600000Y35800000D03*
X189407800Y12268200D03*
%TO.N,SDA*%
X219800000Y36900000D03*
X217700000Y37200000D03*
X242400000Y29400000D03*
X220500000Y30800000D03*
X237200000Y29300000D03*
X237600000Y20100000D03*
X242100000Y18600000D03*
X213200000Y81200000D03*
X197000000Y80200000D03*
X196600000Y62800000D03*
X201000000Y61600000D03*
X201200000Y48800000D03*
X211800000Y48000000D03*
X216000000Y42800000D03*
X212000000Y43200000D03*
%TO.N,SCL*%
X244000000Y7200000D03*
X244000000Y24400000D03*
X240700000Y25600000D03*
X218500000Y28000000D03*
X242300000Y28000000D03*
X217600000Y59200000D03*
X221200000Y59600000D03*
X221000000Y77800000D03*
X212200000Y78000000D03*
X218200000Y44400000D03*
%TO.N,LORA_DIO1*%
X232600000Y81200000D03*
X229600000Y80000000D03*
X231000000Y67800000D03*
X228200000Y69200000D03*
%TO.N,MISO*%
X241500000Y54800000D03*
X221000000Y53300000D03*
%TO.N,MOSI*%
X241400000Y50300000D03*
X230500000Y49100000D03*
X230900000Y22600000D03*
X220200000Y22300000D03*
%TO.N,SCK*%
X240200000Y52600000D03*
X219400000Y52200000D03*
X219300000Y42600000D03*
X216300000Y41400000D03*
%TO.N,~RESET*%
X192900000Y20500000D03*
%TO.N,Net-(J1-Pad3)*%
X236600000Y66200000D03*
X231200000Y65200000D03*
X230000000Y57600000D03*
%TO.N,10_ESP_CS*%
X199100000Y31500000D03*
X207800000Y32500000D03*
%TO.N,7_ESP_RESET*%
X204000000Y21800000D03*
X213600000Y22800000D03*
%TO.N,13_LORA_SCK*%
X217200000Y85200000D03*
X197800000Y83400000D03*
X197400000Y36200000D03*
%TO.N,11_LORA_MOSI*%
X221000000Y83200000D03*
X225600000Y82800000D03*
X225400000Y61400000D03*
X205400000Y60400000D03*
%TO.N,12_LORA_MISO*%
X203400000Y62200000D03*
X224800000Y63400000D03*
X224400000Y81200000D03*
X221000000Y81200000D03*
%TO.N,A4_LORA_CS*%
X221100000Y90400000D03*
X198600000Y90200000D03*
X198400000Y61600000D03*
X196200000Y29400000D03*
X212600000Y28400000D03*
X196000000Y61200000D03*
%TO.N,A3_BUTTON_A*%
X207600000Y41800000D03*
X195000000Y42200000D03*
X210800000Y41800000D03*
%TO.N,A2_LORA_IRQ*%
X233200000Y83200000D03*
X229000000Y82900000D03*
X228400000Y33200000D03*
X208100000Y31000000D03*
%TO.N,VHI*%
X199700000Y22200000D03*
X200050000Y17550000D03*
X245200000Y14000000D03*
X244200000Y-1000000D03*
X188200000Y21000000D03*
X189400000Y-5200000D03*
%TO.N,A0_LORAWAN*%
X226500000Y47700000D03*
X201000000Y46700000D03*
%TO.N,A1_SD_CS*%
X241100000Y49200000D03*
X237000000Y48900000D03*
X235800000Y26400000D03*
X205200000Y24700000D03*
%TO.N,A5_LORA_RESET*%
X216900000Y89300000D03*
X199800000Y88600000D03*
X213600000Y35900000D03*
X199900000Y37000000D03*
%TO.N,VIN_DCDC*%
X225750000Y-13750000D03*
X228000000Y-2500000D03*
%TO.N,VOUT_DCDC*%
X220750000Y-7750000D03*
X218000000Y-14750000D03*
X208250000Y-14500000D03*
%TO.N,TX*%
X223200000Y36000000D03*
X242900000Y34900000D03*
X240893600Y3911600D03*
%TO.N,RX*%
X229800000Y6500000D03*
X229600000Y23900000D03*
X227800000Y24100000D03*
%TO.N,3_BUTTON_B*%
X203900000Y24000000D03*
X203800000Y50200000D03*
%TO.N,2_NEOPIXEL*%
X231900000Y19100000D03*
X231600000Y44200000D03*
%TO.N,VBAT*%
X187000000Y32500000D03*
X199500000Y-10250000D03*
X188800000Y-9600000D03*
%TD*%
D24*
%TO.N,+3V3*%
X194995800Y18923000D02*
X194995800Y17703800D01*
X194995800Y17703800D02*
X194056000Y16764000D01*
X193014600Y1041400D02*
X194919600Y-863600D01*
X225272600Y38735000D02*
X225247200Y38760400D01*
X229387400Y38735000D02*
X225272600Y38735000D01*
X235534200Y74134980D02*
X235557060Y74112120D01*
X235534200Y75336400D02*
X235534200Y74134980D01*
X230349600Y30250000D02*
X230174800Y30075200D01*
X241500000Y51500000D02*
X232500000Y51500000D01*
X232500000Y51500000D02*
X231750000Y52250000D01*
X236000000Y69000000D02*
X235250000Y68250000D01*
X235250000Y68250000D02*
X233500000Y68250000D01*
X233500000Y68250000D02*
X232750000Y67500000D01*
X235534200Y75784200D02*
X235534200Y75336400D01*
X236000000Y77250000D02*
X237500000Y77250000D01*
X218250000Y55250000D02*
X216000000Y57500000D01*
X231500000Y55500000D02*
X231250000Y55250000D01*
X216000000Y57500000D02*
X212000000Y57500000D01*
X212000000Y57500000D02*
X208000000Y57500000D01*
X208000000Y57500000D02*
X204000000Y57500000D01*
X231750000Y87750000D02*
X209000000Y87750000D01*
X209000000Y87750000D02*
X208750000Y87500000D01*
X231250000Y55250000D02*
X229750000Y55250000D01*
X229750000Y55250000D02*
X218250000Y55250000D01*
X240852000Y-3750000D02*
X240893600Y-3708400D01*
X239000000Y-3750000D02*
X240852000Y-3750000D01*
X238625000Y30250000D02*
X238750000Y30125000D01*
X237850000Y30250000D02*
X238625000Y30250000D01*
X237850000Y30250000D02*
X230349600Y30250000D01*
X238500000Y30250000D02*
X237850000Y30250000D01*
X237400000Y-200000D02*
X238750000Y-1550000D01*
X227000000Y2400000D02*
X229600000Y-200000D01*
X196400000Y2400000D02*
X227000000Y2400000D01*
X229600000Y-200000D02*
X237400000Y-200000D01*
X194056000Y16764000D02*
X190964000Y16764000D01*
X190964000Y16764000D02*
X190600000Y16400000D01*
X191558600Y1041400D02*
X193014600Y1041400D01*
%TO.N,GND*%
X194919600Y14376400D02*
X194919600Y12903200D01*
X194919600Y12903200D02*
X194741800Y12903200D01*
X194741800Y12903200D02*
X194106800Y12268200D01*
X194106800Y12268200D02*
X189407800Y12268200D01*
X194995800Y35737800D02*
X194995800Y34163000D01*
X194589400Y36144200D02*
X194995800Y35737800D01*
X227507800Y-9652000D02*
X227507800Y-10871200D01*
X227507800Y-10871200D02*
X226542600Y-11836400D01*
X215538800Y-11836400D02*
X215138000Y-11435600D01*
X226542600Y-11836400D02*
X215538800Y-11836400D01*
X206039200Y-11435600D02*
X204774800Y-12700000D01*
X215138000Y-11435600D02*
X206039200Y-11435600D01*
X205943200Y85928200D02*
X206197200Y85674200D01*
X227500000Y-5750000D02*
X228250000Y-5000000D01*
X232500000Y-5000000D02*
X233000000Y-4500000D01*
X228250000Y-5000000D02*
X232500000Y-5000000D01*
X234748400Y-6248400D02*
X233000000Y-4500000D01*
X240614200Y74183240D02*
X240596420Y74165460D01*
X240614200Y75336400D02*
X240614200Y74183240D01*
X205424800Y-12050000D02*
X206039200Y-11435600D01*
X204950000Y-12050000D02*
X205424800Y-12050000D01*
X191947800Y77368400D02*
X191109600Y76530200D01*
X241250000Y53750000D02*
X237750000Y53750000D01*
X237750000Y53750000D02*
X237250000Y54250000D01*
X237250000Y54250000D02*
X237250000Y54500000D01*
X232994200Y74142600D02*
X232989120Y74137520D01*
X232994200Y75336400D02*
X232994200Y74142600D01*
X232989120Y74137520D02*
X232989120Y72760880D01*
X232989120Y72760880D02*
X233000000Y72750000D01*
X240596420Y73903580D02*
X240596420Y74165460D01*
X240596420Y74165460D02*
X240596420Y73096420D01*
X240596420Y73096420D02*
X239000000Y71500000D01*
X234250000Y71500000D02*
X233000000Y72750000D01*
X239000000Y71500000D02*
X234500000Y71500000D01*
X234500000Y71500000D02*
X234250000Y71500000D01*
X233250000Y91250000D02*
X224500000Y91250000D01*
X222500000Y93250000D02*
X222250000Y93250000D01*
X220750000Y93250000D02*
X222250000Y93250000D01*
X224500000Y91250000D02*
X223375000Y92375000D01*
X223375000Y92375000D02*
X222500000Y93250000D01*
X220913600Y75336400D02*
X219500000Y76750000D01*
X191947800Y77368400D02*
X205118400Y77368400D01*
X205118400Y77368400D02*
X206250000Y78500000D01*
X191750000Y57250000D02*
X193750000Y57250000D01*
X207000000Y79250000D02*
X206250000Y78500000D01*
X216750000Y79250000D02*
X207000000Y79250000D01*
X232994200Y75336400D02*
X222413600Y75336400D01*
X222413600Y75336400D02*
X220913600Y75336400D01*
X236900000Y17400000D02*
X241100000Y17400000D01*
X234000000Y17400000D02*
X236900000Y17400000D01*
X240893600Y-6248400D02*
X237248400Y-6248400D01*
X237248400Y-6248400D02*
X234748400Y-6248400D01*
X232900000Y2100000D02*
X236850000Y2100000D01*
X236850000Y2100000D02*
X237250000Y2500000D01*
X238750000Y31500000D02*
X234750000Y31500000D01*
X234750000Y31500000D02*
X234250000Y32000000D01*
X233750000Y40750000D02*
X232250000Y42250000D01*
X232250000Y42250000D02*
X224000000Y42250000D01*
X194589400Y36144200D02*
X190944200Y36144200D01*
X190944200Y36144200D02*
X190600000Y35800000D01*
D25*
%TO.N,SDA*%
X219800000Y36900000D02*
X218000000Y36900000D01*
X218000000Y36900000D02*
X217700000Y37200000D01*
X230522801Y29350199D02*
X227649801Y29350199D01*
X236500000Y29400000D02*
X230572602Y29400000D01*
X230572602Y29400000D02*
X230522801Y29350199D01*
X227649801Y29350199D02*
X226700000Y30300000D01*
X226700000Y30300000D02*
X221000000Y30300000D01*
X221000000Y30300000D02*
X220500000Y30800000D01*
X237300000Y29400000D02*
X237200000Y29300000D01*
X238000000Y29400000D02*
X237300000Y29400000D01*
X238000000Y29400000D02*
X236500000Y29400000D01*
X242400000Y29400000D02*
X238000000Y29400000D01*
X237600000Y20100000D02*
X238200000Y19500000D01*
X238200000Y19500000D02*
X241200000Y19500000D01*
X241200000Y19500000D02*
X242100000Y18600000D01*
X213200000Y81200000D02*
X204600000Y81200000D01*
X204600000Y81200000D02*
X199400000Y81200000D01*
X199400000Y81200000D02*
X198000000Y81200000D01*
X198000000Y81200000D02*
X197000000Y80200000D01*
X196600000Y62800000D02*
X197000000Y62400000D01*
X197000000Y62400000D02*
X198800000Y62400000D01*
X198800000Y62400000D02*
X200200000Y62400000D01*
X200200000Y62400000D02*
X201000000Y61600000D01*
X201200000Y48800000D02*
X201800000Y48200000D01*
X201800000Y48200000D02*
X210800000Y48200000D01*
X210800000Y48200000D02*
X211600000Y48200000D01*
X211600000Y48200000D02*
X211800000Y48000000D01*
X216000000Y42800000D02*
X212400000Y42800000D01*
X212400000Y42800000D02*
X212000000Y43200000D01*
%TO.N,SCL*%
X240893600Y6451600D02*
X243251600Y6451600D01*
X243251600Y6451600D02*
X244000000Y7200000D01*
X244000000Y24400000D02*
X244000000Y24600000D01*
X244000000Y24600000D02*
X243500000Y25100000D01*
X243500000Y25100000D02*
X241200000Y25100000D01*
X241200000Y25100000D02*
X240700000Y25600000D01*
X228100000Y27800000D02*
X228304601Y28004601D01*
X237400000Y28000000D02*
X242300000Y28000000D01*
X237395399Y28004601D02*
X237400000Y28000000D01*
X224000000Y28000000D02*
X224200000Y27800000D01*
X224200000Y27800000D02*
X228100000Y27800000D01*
X228304601Y28004601D02*
X237395399Y28004601D01*
X218500000Y28000000D02*
X224000000Y28000000D01*
X217600000Y59200000D02*
X220800000Y59200000D01*
X220800000Y59200000D02*
X221200000Y59600000D01*
X221000000Y77800000D02*
X215000000Y77800000D01*
X215000000Y77800000D02*
X212600000Y77800000D01*
X212600000Y77800000D02*
X212400000Y77800000D01*
X212400000Y77800000D02*
X212200000Y78000000D01*
X216000000Y44800000D02*
X217800000Y44800000D01*
X217800000Y44800000D02*
X218200000Y44400000D01*
%TO.N,LORA_DIO1*%
X232600000Y81200000D02*
X230400000Y81200000D01*
X230400000Y81200000D02*
X229600000Y80400000D01*
X229600000Y80400000D02*
X229600000Y80000000D01*
X231000000Y67800000D02*
X228600000Y67800000D01*
X228600000Y67800000D02*
X228200000Y68200000D01*
X228200000Y68200000D02*
X228200000Y69200000D01*
%TO.N,MISO*%
X241500000Y54800000D02*
X240800000Y55500000D01*
X240800000Y55500000D02*
X233400000Y55500000D01*
X233400000Y55500000D02*
X233400000Y55400000D01*
X233400000Y55400000D02*
X231600000Y53600000D01*
X231600000Y53600000D02*
X221300000Y53600000D01*
X221300000Y53600000D02*
X221000000Y53300000D01*
%TO.N,MOSI*%
X241400000Y50300000D02*
X232800000Y50300000D01*
X232800000Y50300000D02*
X231700000Y50300000D01*
X231700000Y50300000D02*
X230500000Y49100000D01*
X220515001Y22615001D02*
X220200000Y22300000D01*
X230900000Y22600000D02*
X230884999Y22615001D01*
X230884999Y22615001D02*
X220515001Y22615001D01*
%TO.N,SCK*%
X239800001Y52999999D02*
X228799999Y52999999D01*
X240200000Y52600000D02*
X239800001Y52999999D01*
X228799999Y52999999D02*
X228799998Y53000000D01*
X228799998Y53000000D02*
X222200000Y53000000D01*
X222200000Y53000000D02*
X221700000Y52500000D01*
X221700000Y52500000D02*
X219700000Y52500000D01*
X219700000Y52500000D02*
X219400000Y52200000D01*
X219300000Y42600000D02*
X218600000Y41900000D01*
X218600000Y41900000D02*
X216800000Y41900000D01*
X216800000Y41900000D02*
X216300000Y41400000D01*
%TO.N,~RESET*%
X192900000Y20500000D02*
X224100000Y20500000D01*
X224100000Y20500000D02*
X224400000Y20200000D01*
X232300000Y20200000D02*
X234000000Y21900000D01*
X224400000Y20200000D02*
X232300000Y20200000D01*
X240500000Y21900000D02*
X234000000Y21900000D01*
D24*
%TO.N,Net-(J1-Pad3)*%
X238074200Y74201020D02*
X238046260Y74173080D01*
X238074200Y75336400D02*
X238074200Y74201020D01*
D25*
X236600000Y66200000D02*
X235600000Y65200000D01*
X235600000Y65200000D02*
X231200000Y65200000D01*
X225200000Y56800000D02*
X224500000Y57500000D01*
X230000000Y57600000D02*
X229200000Y56800000D01*
X229200000Y56800000D02*
X225200000Y56800000D01*
%TO.N,10_ESP_CS*%
X199100000Y31500000D02*
X199500000Y31900000D01*
X199500000Y31900000D02*
X207200000Y31900000D01*
X207200000Y31900000D02*
X207800000Y32500000D01*
%TO.N,7_ESP_RESET*%
X204000000Y21800000D02*
X204400000Y22200000D01*
X204400000Y22200000D02*
X204600000Y22400000D01*
X204600000Y22400000D02*
X213200000Y22400000D01*
X213200000Y22400000D02*
X213600000Y22800000D01*
%TO.N,13_LORA_SCK*%
X217200000Y85200000D02*
X216000000Y84000000D01*
X216000000Y84000000D02*
X198400000Y84000000D01*
X198400000Y84000000D02*
X197800000Y83400000D01*
X197400000Y36200000D02*
X198000000Y35600000D01*
X198638800Y35600000D02*
X200075800Y34163000D01*
X198000000Y35600000D02*
X198638800Y35600000D01*
%TO.N,11_LORA_MOSI*%
X221000000Y83200000D02*
X225200000Y83200000D01*
X225200000Y83200000D02*
X225600000Y82800000D01*
X225400000Y61400000D02*
X225000000Y61000000D01*
X225000000Y61000000D02*
X206000000Y61000000D01*
X206000000Y61000000D02*
X205400000Y60400000D01*
%TO.N,12_LORA_MISO*%
X203400000Y62200000D02*
X203800000Y62600000D01*
X203800000Y62600000D02*
X224000000Y62600000D01*
X224000000Y62600000D02*
X224800000Y63400000D01*
X221000000Y81200000D02*
X224400000Y81200000D01*
%TO.N,A4_LORA_CS*%
X221100000Y90400000D02*
X220600000Y90900000D01*
X220600000Y90900000D02*
X199300000Y90900000D01*
X199300000Y90900000D02*
X198600000Y90200000D01*
X196200000Y29400000D02*
X196600000Y29000000D01*
X196600000Y29000000D02*
X212000000Y29000000D01*
X212000000Y29000000D02*
X212600000Y28400000D01*
X198400000Y61600000D02*
X196400000Y61600000D01*
X196400000Y61600000D02*
X196000000Y61200000D01*
%TO.N,A3_BUTTON_A*%
X207600000Y41800000D02*
X198200000Y41800000D01*
X198200000Y41800000D02*
X195400000Y41800000D01*
X195400000Y41800000D02*
X195000000Y42200000D01*
X210800000Y41800000D02*
X207600000Y41800000D01*
%TO.N,A2_LORA_IRQ*%
X233200000Y83200000D02*
X229300000Y83200000D01*
X229300000Y83200000D02*
X229000000Y82900000D01*
X228400000Y33200000D02*
X227900000Y32700000D01*
X227900000Y32700000D02*
X227800000Y32800000D01*
X227800000Y32800000D02*
X223100000Y32800000D01*
X223100000Y32800000D02*
X222500000Y32200000D01*
X222500000Y32200000D02*
X209300000Y32200000D01*
X209300000Y32200000D02*
X208100000Y31000000D01*
D24*
%TO.N,VHI*%
X197050000Y22300000D02*
X199600000Y22300000D01*
X199600000Y22300000D02*
X199700000Y22200000D01*
X200650000Y16950000D02*
X200050000Y17550000D01*
X200650000Y16950000D02*
X228450000Y16950000D01*
X228450000Y16950000D02*
X229800000Y15600000D01*
X229800000Y15600000D02*
X243600000Y15600000D01*
X243600000Y15600000D02*
X245200000Y14000000D01*
X241062000Y-1000000D02*
X240893600Y-1168400D01*
X244200000Y-1000000D02*
X241062000Y-1000000D01*
X197050000Y22300000D02*
X189500000Y22300000D01*
X189500000Y22300000D02*
X188200000Y21000000D01*
X192850000Y-5200000D02*
X192950000Y-5100000D01*
X189400000Y-5200000D02*
X192850000Y-5200000D01*
D25*
%TO.N,A0_LORAWAN*%
X226500000Y47700000D02*
X226000000Y47200000D01*
X226000000Y47200000D02*
X201500000Y47200000D01*
X201500000Y47200000D02*
X201000000Y46700000D01*
%TO.N,A1_SD_CS*%
X241100000Y49200000D02*
X237300000Y49200000D01*
X237300000Y49200000D02*
X237000000Y48900000D01*
X235800000Y26400000D02*
X232600000Y26400000D01*
X232600000Y26400000D02*
X231000000Y26400000D01*
X231000000Y26400000D02*
X229800000Y25200000D01*
X229800000Y25200000D02*
X229500000Y25200000D01*
X229500000Y25200000D02*
X205700000Y25200000D01*
X205700000Y25200000D02*
X205200000Y24700000D01*
%TO.N,A5_LORA_RESET*%
X216900000Y89300000D02*
X206400000Y89300000D01*
X206400000Y89300000D02*
X200500000Y89300000D01*
X200500000Y89300000D02*
X199800000Y88600000D01*
X213600000Y35900000D02*
X213200000Y36300000D01*
X213200000Y36300000D02*
X200600000Y36300000D01*
X200600000Y36300000D02*
X199900000Y37000000D01*
D24*
%TO.N,VIN_DCDC*%
X219152400Y-9450000D02*
X215138000Y-5435600D01*
X224950000Y-9450000D02*
X219152400Y-9450000D01*
X228549990Y-13750000D02*
X228599990Y-13700000D01*
X225750000Y-13750000D02*
X228549990Y-13750000D01*
X233000000Y-2000000D02*
X228500000Y-2000000D01*
X228500000Y-2000000D02*
X228000000Y-2500000D01*
%TO.N,VOUT_DCDC*%
X230150000Y-9570000D02*
X230030000Y-9450000D01*
X230150000Y-13700000D02*
X230150000Y-9570000D01*
X230030000Y-9450000D02*
X230030000Y-8280000D01*
X230030000Y-8280000D02*
X229250000Y-7500000D01*
X229250000Y-7500000D02*
X221000000Y-7500000D01*
X221000000Y-7500000D02*
X220750000Y-7750000D01*
X218000000Y-14750000D02*
X208750000Y-14750000D01*
X208750000Y-14750000D02*
X208500000Y-14750000D01*
X208500000Y-14750000D02*
X208250000Y-14500000D01*
D25*
%TO.N,TX*%
X223200000Y36000000D02*
X234700000Y36000000D01*
X234700000Y36000000D02*
X235300000Y35400000D01*
X235300000Y35400000D02*
X242400000Y35400000D01*
X242400000Y35400000D02*
X242900000Y34900000D01*
%TO.N,RX*%
X240893600Y1371600D02*
X236365200Y5900000D01*
X236365200Y5900000D02*
X230400000Y5900000D01*
X230400000Y5900000D02*
X229800000Y6500000D01*
X229600000Y23900000D02*
X228000000Y23900000D01*
X228000000Y23900000D02*
X227800000Y24100000D01*
%TO.N,3_BUTTON_B*%
X225480000Y24000000D02*
X225500000Y23980000D01*
X225500000Y23980000D02*
X207980000Y23980000D01*
X207980000Y23980000D02*
X207600000Y23600000D01*
X207600000Y23600000D02*
X204300000Y23600000D01*
X204300000Y23600000D02*
X203900000Y24000000D01*
X198250000Y50750000D02*
X203250000Y50750000D01*
X203250000Y50750000D02*
X203800000Y50200000D01*
%TO.N,2_NEOPIXEL*%
X225475800Y18923000D02*
X231723000Y18923000D01*
X231723000Y18923000D02*
X231900000Y19100000D01*
X231000000Y44800000D02*
X224500000Y44800000D01*
X231600000Y44200000D02*
X231000000Y44800000D01*
D24*
%TO.N,VBAT*%
X192455800Y34163000D02*
X188663000Y34163000D01*
X188663000Y34163000D02*
X187000000Y32500000D01*
X188800000Y-9600000D02*
X189200000Y-10000000D01*
X199250000Y-10000000D02*
X199500000Y-10250000D01*
X189200000Y-10000000D02*
X199250000Y-10000000D01*
%TD*%
M02*
