M48
; DRILL file {KiCad 5.1.6-c6e7f7d~87~ubuntu18.04.1} date Wed Jul 21 15:50:50 2021
; FORMAT={-:-/ absolute / inch / decimal}
; #@! TF.CreationDate,2021-07-21T15:50:50-04:00
; #@! TF.GenerationSoftware,Kicad,Pcbnew,5.1.6-c6e7f7d~87~ubuntu18.04.1
; #@! TF.FileFunction,NonPlated,1,2,NPTH
FMAT,2
INCH
T1C0.0866
T2C0.1378
T3C0.1457
%
G90
G05
T1
X8.0984Y2.5551
X7.9803Y2.6732
X8.2165Y2.9094
X8.2165Y2.6732
X8.3346Y2.5551
X8.0984Y2.7913
X8.5709Y2.6732
X8.0984Y2.6732
X8.5709Y2.5551
X9.2618Y0.4823
X9.124Y0.4823
X8.2165Y2.5551
X8.2165Y2.7913
X9.2618Y0.3543
X7.9803Y2.7913
X8.4528Y2.6732
X7.9803Y2.5551
X8.4528Y2.9094
X9.124Y0.3543
X8.3346Y2.7913
X8.4528Y2.5551
X8.4528Y2.7913
X8.3346Y2.6732
X8.5709Y2.9094
X8.0984Y2.9094
X7.9803Y2.9094
X8.5709Y2.7913
X8.3346Y2.9094
T2
X9.443Y1.518
X9.4595Y-0.5271
X9.444Y2.519
X7.554Y-0.5271
X9.4595Y3.343
T3
X7.554Y3.343
T0
M30
