EESchema Schematic File Version 4
EELAYER 30 0
EELAYER END
$Descr A4 11693 8268
encoding utf-8
Sheet 1 1
Title "PVOS CO2 Monitor"
Date ""
Rev "T"
Comp ""
Comment1 "http://pvos.org/co2/rev_t"
Comment2 ""
Comment3 ""
Comment4 ""
$EndDescr
$Comp
L power:GND #PWR021
U 1 1 614FA1BB
P 8200 3700
F 0 "#PWR021" H 8200 3450 50  0001 C CNN
F 1 "GND" H 8205 3527 50  0000 C CNN
F 2 "" H 8200 3700 50  0001 C CNN
F 3 "" H 8200 3700 50  0001 C CNN
	1    8200 3700
	1    0    0    -1  
$EndComp
$Comp
L power:+3V3 #PWR022
U 1 1 614FA1C1
P 8425 3800
F 0 "#PWR022" H 8425 3650 50  0001 C CNN
F 1 "+3V3" H 8440 3973 50  0000 C CNN
F 2 "" H 8425 3800 50  0001 C CNN
F 3 "" H 8425 3800 50  0001 C CNN
	1    8425 3800
	1    0    0    -1  
$EndComp
Text GLabel 8600 4000 0    50   Input ~ 0
SDA
Text GLabel 8600 3900 0    50   Input ~ 0
SCL
Wire Wire Line
	8600 3800 8425 3800
$Comp
L Connector:Conn_01x04_Female J16
U 1 1 614FA1CB
P 8800 3800
F 0 "J16" H 8828 3776 50  0000 L CNN
F 1 "Conn_01x04_Female" V 8975 3350 50  0000 L CNN
F 2 "Connector_PinSocket_2.54mm:PinSocket_1x04_P2.54mm_Vertical" H 8800 3800 50  0001 C CNN
F 3 "~" H 8800 3800 50  0001 C CNN
	1    8800 3800
	1    0    0    -1  
$EndComp
Text Notes 7975 3450 0    79   ~ 0
QWIIC
$Comp
L Mechanical:MountingHole_Pad H1
U 1 1 614A1FDA
P 7075 5825
F 0 "H1" H 7175 5874 50  0000 L CNN
F 1 "MountingHole_Pad" H 7175 5783 50  0000 L CNN
F 2 "MountingHole:MountingHole_2.7mm_M2.5_Pad" H 7075 5825 50  0001 C CNN
F 3 "~" H 7075 5825 50  0001 C CNN
	1    7075 5825
	1    0    0    -1  
$EndComp
$Comp
L Mechanical:MountingHole_Pad H2
U 1 1 614A5606
P 7325 6150
F 0 "H2" H 7425 6199 50  0000 L CNN
F 1 "MountingHole_Pad" H 7425 6108 50  0000 L CNN
F 2 "MountingHole:MountingHole_2.7mm_M2.5_Pad" H 7325 6150 50  0001 C CNN
F 3 "~" H 7325 6150 50  0001 C CNN
	1    7325 6150
	1    0    0    -1  
$EndComp
$Comp
L Mechanical:MountingHole_Pad H3
U 1 1 614A5CC9
P 8550 5775
F 0 "H3" H 8650 5824 50  0000 L CNN
F 1 "MountingHole_Pad" H 8650 5733 50  0000 L CNN
F 2 "MountingHole:MountingHole_2.7mm_M2.5_Pad" H 8550 5775 50  0001 C CNN
F 3 "~" H 8550 5775 50  0001 C CNN
	1    8550 5775
	1    0    0    -1  
$EndComp
$Comp
L Mechanical:MountingHole_Pad H4
U 1 1 614A5FBB
P 8550 6125
F 0 "H4" H 8650 6174 50  0000 L CNN
F 1 "MountingHole_Pad" H 8650 6083 50  0000 L CNN
F 2 "MountingHole:MountingHole_2.7mm_M2.5_Pad" H 8550 6125 50  0001 C CNN
F 3 "~" H 8550 6125 50  0001 C CNN
	1    8550 6125
	1    0    0    -1  
$EndComp
$Comp
L Mechanical:MountingHole_Pad H5
U 1 1 614E3462
P 9725 5800
F 0 "H5" H 9825 5849 50  0000 L CNN
F 1 "MountingHole_Pad" H 9825 5758 50  0000 L CNN
F 2 "MountingHole:MountingHole_2.7mm_M2.5_Pad" H 9725 5800 50  0001 C CNN
F 3 "~" H 9725 5800 50  0001 C CNN
	1    9725 5800
	1    0    0    -1  
$EndComp
$Comp
L Mechanical:MountingHole_Pad H6
U 1 1 614E3468
P 9725 6150
F 0 "H6" H 9825 6199 50  0000 L CNN
F 1 "MountingHole_Pad" H 9825 6108 50  0000 L CNN
F 2 "MountingHole:MountingHole_2.7mm_M2.5_Pad" H 9725 6150 50  0001 C CNN
F 3 "~" H 9725 6150 50  0001 C CNN
	1    9725 6150
	1    0    0    -1  
$EndComp
$Comp
L power:GND #PWR0105
U 1 1 615C33CE
P 7075 5925
F 0 "#PWR0105" H 7075 5675 50  0001 C CNN
F 1 "GND" H 7080 5752 50  0000 C CNN
F 2 "" H 7075 5925 50  0001 C CNN
F 3 "" H 7075 5925 50  0001 C CNN
	1    7075 5925
	0    1    1    0   
$EndComp
$Comp
L power:+3V3 #PWR0106
U 1 1 615C451F
P 7325 6250
F 0 "#PWR0106" H 7325 6100 50  0001 C CNN
F 1 "+3V3" H 7340 6423 50  0000 C CNN
F 2 "" H 7325 6250 50  0001 C CNN
F 3 "" H 7325 6250 50  0001 C CNN
	1    7325 6250
	0    -1   -1   0   
$EndComp
Text GLabel 9725 6250 0    50   Input ~ 0
SCL
Text GLabel 9725 5900 0    50   Input ~ 0
SDA
Text GLabel 8550 5875 0    50   Input ~ 0
A3
Text GLabel 8550 6225 0    50   Input ~ 0
D5
Wire Wire Line
	8600 3700 8200 3700
$EndSCHEMATC
