%TF.GenerationSoftware,KiCad,Pcbnew,5.1.12-84ad8e8a86~92~ubuntu18.04.1*%
%TF.CreationDate,2022-01-16T18:39:34-05:00*%
%TF.ProjectId,remote,72656d6f-7465-42e6-9b69-6361645f7063,rev?*%
%TF.SameCoordinates,Original*%
%TF.FileFunction,Legend,Top*%
%TF.FilePolarity,Positive*%
%FSLAX46Y46*%
G04 Gerber Fmt 4.6, Leading zero omitted, Abs format (unit mm)*
G04 Created by KiCad (PCBNEW 5.1.12-84ad8e8a86~92~ubuntu18.04.1) date 2022-01-16 18:39:34*
%MOMM*%
%LPD*%
G01*
G04 APERTURE LIST*
%ADD10C,0.150000*%
%ADD11C,0.300000*%
%ADD12C,0.100000*%
%ADD13C,0.120000*%
G04 APERTURE END LIST*
D10*
X44971428Y-108742857D02*
X44571428Y-108171428D01*
X44285714Y-108742857D02*
X44285714Y-107542857D01*
X44742857Y-107542857D01*
X44857142Y-107600000D01*
X44914285Y-107657142D01*
X44971428Y-107771428D01*
X44971428Y-107942857D01*
X44914285Y-108057142D01*
X44857142Y-108114285D01*
X44742857Y-108171428D01*
X44285714Y-108171428D01*
X45485714Y-108114285D02*
X45885714Y-108114285D01*
X46057142Y-108742857D02*
X45485714Y-108742857D01*
X45485714Y-107542857D01*
X46057142Y-107542857D01*
X46400000Y-107542857D02*
X46800000Y-108742857D01*
X47200000Y-107542857D01*
X47314285Y-108857142D02*
X48228571Y-108857142D01*
X48400000Y-107542857D02*
X48685714Y-108742857D01*
X48914285Y-107885714D01*
X49142857Y-108742857D01*
X49428571Y-107542857D01*
X17333333Y-80371428D02*
X17333333Y-82371428D01*
X17333333Y-80466666D02*
X17523809Y-80371428D01*
X17904761Y-80371428D01*
X18095238Y-80466666D01*
X18190476Y-80561904D01*
X18285714Y-80752380D01*
X18285714Y-81323809D01*
X18190476Y-81514285D01*
X18095238Y-81609523D01*
X17904761Y-81704761D01*
X17523809Y-81704761D01*
X17333333Y-81609523D01*
X18952380Y-80371428D02*
X19428571Y-81704761D01*
X19904761Y-80371428D01*
X20952380Y-81704761D02*
X20761904Y-81609523D01*
X20666666Y-81514285D01*
X20571428Y-81323809D01*
X20571428Y-80752380D01*
X20666666Y-80561904D01*
X20761904Y-80466666D01*
X20952380Y-80371428D01*
X21238095Y-80371428D01*
X21428571Y-80466666D01*
X21523809Y-80561904D01*
X21619047Y-80752380D01*
X21619047Y-81323809D01*
X21523809Y-81514285D01*
X21428571Y-81609523D01*
X21238095Y-81704761D01*
X20952380Y-81704761D01*
X22380952Y-81609523D02*
X22571428Y-81704761D01*
X22952380Y-81704761D01*
X23142857Y-81609523D01*
X23238095Y-81419047D01*
X23238095Y-81323809D01*
X23142857Y-81133333D01*
X22952380Y-81038095D01*
X22666666Y-81038095D01*
X22476190Y-80942857D01*
X22380952Y-80752380D01*
X22380952Y-80657142D01*
X22476190Y-80466666D01*
X22666666Y-80371428D01*
X22952380Y-80371428D01*
X23142857Y-80466666D01*
X24095238Y-81514285D02*
X24190476Y-81609523D01*
X24095238Y-81704761D01*
X24000000Y-81609523D01*
X24095238Y-81514285D01*
X24095238Y-81704761D01*
X25333333Y-81704761D02*
X25142857Y-81609523D01*
X25047619Y-81514285D01*
X24952380Y-81323809D01*
X24952380Y-80752380D01*
X25047619Y-80561904D01*
X25142857Y-80466666D01*
X25333333Y-80371428D01*
X25619047Y-80371428D01*
X25809523Y-80466666D01*
X25904761Y-80561904D01*
X26000000Y-80752380D01*
X26000000Y-81323809D01*
X25904761Y-81514285D01*
X25809523Y-81609523D01*
X25619047Y-81704761D01*
X25333333Y-81704761D01*
X26857142Y-81704761D02*
X26857142Y-80371428D01*
X26857142Y-80752380D02*
X26952380Y-80561904D01*
X27047619Y-80466666D01*
X27238095Y-80371428D01*
X27428571Y-80371428D01*
X28952380Y-80371428D02*
X28952380Y-81990476D01*
X28857142Y-82180952D01*
X28761904Y-82276190D01*
X28571428Y-82371428D01*
X28285714Y-82371428D01*
X28095238Y-82276190D01*
X28952380Y-81609523D02*
X28761904Y-81704761D01*
X28380952Y-81704761D01*
X28190476Y-81609523D01*
X28095238Y-81514285D01*
X28000000Y-81323809D01*
X28000000Y-80752380D01*
X28095238Y-80561904D01*
X28190476Y-80466666D01*
X28380952Y-80371428D01*
X28761904Y-80371428D01*
X28952380Y-80466666D01*
X31333333Y-79609523D02*
X29619047Y-82180952D01*
X32857142Y-81609523D02*
X32666666Y-81704761D01*
X32285714Y-81704761D01*
X32095238Y-81609523D01*
X32000000Y-81514285D01*
X31904761Y-81323809D01*
X31904761Y-80752380D01*
X32000000Y-80561904D01*
X32095238Y-80466666D01*
X32285714Y-80371428D01*
X32666666Y-80371428D01*
X32857142Y-80466666D01*
X34000000Y-81704761D02*
X33809523Y-81609523D01*
X33714285Y-81514285D01*
X33619047Y-81323809D01*
X33619047Y-80752380D01*
X33714285Y-80561904D01*
X33809523Y-80466666D01*
X34000000Y-80371428D01*
X34285714Y-80371428D01*
X34476190Y-80466666D01*
X34571428Y-80561904D01*
X34666666Y-80752380D01*
X34666666Y-81323809D01*
X34571428Y-81514285D01*
X34476190Y-81609523D01*
X34285714Y-81704761D01*
X34000000Y-81704761D01*
X35428571Y-79895238D02*
X35523809Y-79800000D01*
X35714285Y-79704761D01*
X36190476Y-79704761D01*
X36380952Y-79800000D01*
X36476190Y-79895238D01*
X36571428Y-80085714D01*
X36571428Y-80276190D01*
X36476190Y-80561904D01*
X35333333Y-81704761D01*
X36571428Y-81704761D01*
X38857142Y-79609523D02*
X37142857Y-82180952D01*
X39523809Y-81704761D02*
X39523809Y-80371428D01*
X39523809Y-80752380D02*
X39619047Y-80561904D01*
X39714285Y-80466666D01*
X39904761Y-80371428D01*
X40095238Y-80371428D01*
X41523809Y-81609523D02*
X41333333Y-81704761D01*
X40952380Y-81704761D01*
X40761904Y-81609523D01*
X40666666Y-81419047D01*
X40666666Y-80657142D01*
X40761904Y-80466666D01*
X40952380Y-80371428D01*
X41333333Y-80371428D01*
X41523809Y-80466666D01*
X41619047Y-80657142D01*
X41619047Y-80847619D01*
X40666666Y-81038095D01*
X42285714Y-80371428D02*
X42761904Y-81704761D01*
X43238095Y-80371428D01*
X43523809Y-81895238D02*
X45047619Y-81895238D01*
X45333333Y-80371428D02*
X45714285Y-81704761D01*
X46095238Y-80752380D01*
X46476190Y-81704761D01*
X46857142Y-80371428D01*
X43085714Y-11468571D02*
X43142857Y-11297142D01*
X43142857Y-11011428D01*
X43085714Y-10897142D01*
X43028571Y-10840000D01*
X42914285Y-10782857D01*
X42800000Y-10782857D01*
X42685714Y-10840000D01*
X42628571Y-10897142D01*
X42571428Y-11011428D01*
X42514285Y-11240000D01*
X42457142Y-11354285D01*
X42400000Y-11411428D01*
X42285714Y-11468571D01*
X42171428Y-11468571D01*
X42057142Y-11411428D01*
X42000000Y-11354285D01*
X41942857Y-11240000D01*
X41942857Y-10954285D01*
X42000000Y-10782857D01*
X43028571Y-9582857D02*
X43085714Y-9640000D01*
X43142857Y-9811428D01*
X43142857Y-9925714D01*
X43085714Y-10097142D01*
X42971428Y-10211428D01*
X42857142Y-10268571D01*
X42628571Y-10325714D01*
X42457142Y-10325714D01*
X42228571Y-10268571D01*
X42114285Y-10211428D01*
X42000000Y-10097142D01*
X41942857Y-9925714D01*
X41942857Y-9811428D01*
X42000000Y-9640000D01*
X42057142Y-9582857D01*
X43142857Y-8497142D02*
X43142857Y-9068571D01*
X41942857Y-9068571D01*
X36952857Y-11474285D02*
X36952857Y-10731428D01*
X37410000Y-11131428D01*
X37410000Y-10960000D01*
X37467142Y-10845714D01*
X37524285Y-10788571D01*
X37638571Y-10731428D01*
X37924285Y-10731428D01*
X38038571Y-10788571D01*
X38095714Y-10845714D01*
X38152857Y-10960000D01*
X38152857Y-11302857D01*
X38095714Y-11417142D01*
X38038571Y-11474285D01*
X36952857Y-10388571D02*
X38152857Y-9988571D01*
X36952857Y-9588571D01*
X34320000Y-10765714D02*
X34262857Y-10880000D01*
X34262857Y-11051428D01*
X34320000Y-11222857D01*
X34434285Y-11337142D01*
X34548571Y-11394285D01*
X34777142Y-11451428D01*
X34948571Y-11451428D01*
X35177142Y-11394285D01*
X35291428Y-11337142D01*
X35405714Y-11222857D01*
X35462857Y-11051428D01*
X35462857Y-10937142D01*
X35405714Y-10765714D01*
X35348571Y-10708571D01*
X34948571Y-10708571D01*
X34948571Y-10937142D01*
X40575714Y-11497142D02*
X40632857Y-11325714D01*
X40632857Y-11040000D01*
X40575714Y-10925714D01*
X40518571Y-10868571D01*
X40404285Y-10811428D01*
X40290000Y-10811428D01*
X40175714Y-10868571D01*
X40118571Y-10925714D01*
X40061428Y-11040000D01*
X40004285Y-11268571D01*
X39947142Y-11382857D01*
X39890000Y-11440000D01*
X39775714Y-11497142D01*
X39661428Y-11497142D01*
X39547142Y-11440000D01*
X39490000Y-11382857D01*
X39432857Y-11268571D01*
X39432857Y-10982857D01*
X39490000Y-10811428D01*
X40632857Y-10297142D02*
X39432857Y-10297142D01*
X39432857Y-10011428D01*
X39490000Y-9840000D01*
X39604285Y-9725714D01*
X39718571Y-9668571D01*
X39947142Y-9611428D01*
X40118571Y-9611428D01*
X40347142Y-9668571D01*
X40461428Y-9725714D01*
X40575714Y-9840000D01*
X40632857Y-10011428D01*
X40632857Y-10297142D01*
X40290000Y-9154285D02*
X40290000Y-8582857D01*
X40632857Y-9268571D02*
X39432857Y-8868571D01*
X40632857Y-8468571D01*
X42699047Y-67488571D02*
X42365714Y-67488571D01*
X42365714Y-68012380D02*
X42365714Y-67012380D01*
X42841904Y-67012380D01*
X43603809Y-67964761D02*
X43508571Y-68012380D01*
X43318095Y-68012380D01*
X43222857Y-67964761D01*
X43175238Y-67869523D01*
X43175238Y-67488571D01*
X43222857Y-67393333D01*
X43318095Y-67345714D01*
X43508571Y-67345714D01*
X43603809Y-67393333D01*
X43651428Y-67488571D01*
X43651428Y-67583809D01*
X43175238Y-67679047D01*
X44508571Y-68012380D02*
X44508571Y-67488571D01*
X44460952Y-67393333D01*
X44365714Y-67345714D01*
X44175238Y-67345714D01*
X44080000Y-67393333D01*
X44508571Y-67964761D02*
X44413333Y-68012380D01*
X44175238Y-68012380D01*
X44080000Y-67964761D01*
X44032380Y-67869523D01*
X44032380Y-67774285D01*
X44080000Y-67679047D01*
X44175238Y-67631428D01*
X44413333Y-67631428D01*
X44508571Y-67583809D01*
X44841904Y-67345714D02*
X45222857Y-67345714D01*
X44984761Y-67012380D02*
X44984761Y-67869523D01*
X45032380Y-67964761D01*
X45127619Y-68012380D01*
X45222857Y-68012380D01*
X45556190Y-68012380D02*
X45556190Y-67012380D01*
X45984761Y-68012380D02*
X45984761Y-67488571D01*
X45937142Y-67393333D01*
X45841904Y-67345714D01*
X45699047Y-67345714D01*
X45603809Y-67393333D01*
X45556190Y-67440952D01*
X46841904Y-67964761D02*
X46746666Y-68012380D01*
X46556190Y-68012380D01*
X46460952Y-67964761D01*
X46413333Y-67869523D01*
X46413333Y-67488571D01*
X46460952Y-67393333D01*
X46556190Y-67345714D01*
X46746666Y-67345714D01*
X46841904Y-67393333D01*
X46889523Y-67488571D01*
X46889523Y-67583809D01*
X46413333Y-67679047D01*
X47318095Y-68012380D02*
X47318095Y-67345714D01*
X47318095Y-67536190D02*
X47365714Y-67440952D01*
X47413333Y-67393333D01*
X47508571Y-67345714D01*
X47603809Y-67345714D01*
X47841904Y-67345714D02*
X48032380Y-68012380D01*
X48222857Y-67536190D01*
X48413333Y-68012380D01*
X48603809Y-67345714D01*
X48984761Y-68012380D02*
X48984761Y-67345714D01*
X48984761Y-67012380D02*
X48937142Y-67060000D01*
X48984761Y-67107619D01*
X49032380Y-67060000D01*
X48984761Y-67012380D01*
X48984761Y-67107619D01*
X49460952Y-67345714D02*
X49460952Y-68012380D01*
X49460952Y-67440952D02*
X49508571Y-67393333D01*
X49603809Y-67345714D01*
X49746666Y-67345714D01*
X49841904Y-67393333D01*
X49889523Y-67488571D01*
X49889523Y-68012380D01*
X50794285Y-67345714D02*
X50794285Y-68155238D01*
X50746666Y-68250476D01*
X50699047Y-68298095D01*
X50603809Y-68345714D01*
X50460952Y-68345714D01*
X50365714Y-68298095D01*
X50794285Y-67964761D02*
X50699047Y-68012380D01*
X50508571Y-68012380D01*
X50413333Y-67964761D01*
X50365714Y-67917142D01*
X50318095Y-67821904D01*
X50318095Y-67536190D01*
X50365714Y-67440952D01*
X50413333Y-67393333D01*
X50508571Y-67345714D01*
X50699047Y-67345714D01*
X50794285Y-67393333D01*
X45935714Y-91568571D02*
X45602380Y-91568571D01*
X45602380Y-92092380D02*
X45602380Y-91092380D01*
X46078571Y-91092380D01*
X46840476Y-92044761D02*
X46745238Y-92092380D01*
X46554761Y-92092380D01*
X46459523Y-92044761D01*
X46411904Y-91949523D01*
X46411904Y-91568571D01*
X46459523Y-91473333D01*
X46554761Y-91425714D01*
X46745238Y-91425714D01*
X46840476Y-91473333D01*
X46888095Y-91568571D01*
X46888095Y-91663809D01*
X46411904Y-91759047D01*
X47745238Y-92092380D02*
X47745238Y-91568571D01*
X47697619Y-91473333D01*
X47602380Y-91425714D01*
X47411904Y-91425714D01*
X47316666Y-91473333D01*
X47745238Y-92044761D02*
X47650000Y-92092380D01*
X47411904Y-92092380D01*
X47316666Y-92044761D01*
X47269047Y-91949523D01*
X47269047Y-91854285D01*
X47316666Y-91759047D01*
X47411904Y-91711428D01*
X47650000Y-91711428D01*
X47745238Y-91663809D01*
X48078571Y-91425714D02*
X48459523Y-91425714D01*
X48221428Y-91092380D02*
X48221428Y-91949523D01*
X48269047Y-92044761D01*
X48364285Y-92092380D01*
X48459523Y-92092380D01*
X48792857Y-92092380D02*
X48792857Y-91092380D01*
X49221428Y-92092380D02*
X49221428Y-91568571D01*
X49173809Y-91473333D01*
X49078571Y-91425714D01*
X48935714Y-91425714D01*
X48840476Y-91473333D01*
X48792857Y-91520952D01*
X50078571Y-92044761D02*
X49983333Y-92092380D01*
X49792857Y-92092380D01*
X49697619Y-92044761D01*
X49650000Y-91949523D01*
X49650000Y-91568571D01*
X49697619Y-91473333D01*
X49792857Y-91425714D01*
X49983333Y-91425714D01*
X50078571Y-91473333D01*
X50126190Y-91568571D01*
X50126190Y-91663809D01*
X49650000Y-91759047D01*
X50554761Y-92092380D02*
X50554761Y-91425714D01*
X50554761Y-91616190D02*
X50602380Y-91520952D01*
X50650000Y-91473333D01*
X50745238Y-91425714D01*
X50840476Y-91425714D01*
X35509523Y-88052380D02*
X35033333Y-88052380D01*
X35033333Y-87052380D01*
X35842857Y-88052380D02*
X35842857Y-87385714D01*
X35842857Y-87052380D02*
X35795238Y-87100000D01*
X35842857Y-87147619D01*
X35890476Y-87100000D01*
X35842857Y-87052380D01*
X35842857Y-87147619D01*
X36319047Y-88052380D02*
X36319047Y-87052380D01*
X36700000Y-87052380D01*
X36795238Y-87100000D01*
X36842857Y-87147619D01*
X36890476Y-87242857D01*
X36890476Y-87385714D01*
X36842857Y-87480952D01*
X36795238Y-87528571D01*
X36700000Y-87576190D01*
X36319047Y-87576190D01*
X37461904Y-88052380D02*
X37366666Y-88004761D01*
X37319047Y-87957142D01*
X37271428Y-87861904D01*
X37271428Y-87576190D01*
X37319047Y-87480952D01*
X37366666Y-87433333D01*
X37461904Y-87385714D01*
X37604761Y-87385714D01*
X37700000Y-87433333D01*
X37747619Y-87480952D01*
X37795238Y-87576190D01*
X37795238Y-87861904D01*
X37747619Y-87957142D01*
X37700000Y-88004761D01*
X37604761Y-88052380D01*
X37461904Y-88052380D01*
X38890476Y-87052380D02*
X39509523Y-87052380D01*
X39176190Y-87433333D01*
X39319047Y-87433333D01*
X39414285Y-87480952D01*
X39461904Y-87528571D01*
X39509523Y-87623809D01*
X39509523Y-87861904D01*
X39461904Y-87957142D01*
X39414285Y-88004761D01*
X39319047Y-88052380D01*
X39033333Y-88052380D01*
X38938095Y-88004761D01*
X38890476Y-87957142D01*
X39938095Y-87957142D02*
X39985714Y-88004761D01*
X39938095Y-88052380D01*
X39890476Y-88004761D01*
X39938095Y-87957142D01*
X39938095Y-88052380D01*
X40319047Y-87052380D02*
X40985714Y-87052380D01*
X40557142Y-88052380D01*
X41223809Y-87052380D02*
X41557142Y-88052380D01*
X41890476Y-87052380D01*
X43414285Y-87385714D02*
X43414285Y-88052380D01*
X43176190Y-87004761D02*
X42938095Y-87719047D01*
X43557142Y-87719047D01*
X44128571Y-87052380D02*
X44223809Y-87052380D01*
X44319047Y-87100000D01*
X44366666Y-87147619D01*
X44414285Y-87242857D01*
X44461904Y-87433333D01*
X44461904Y-87671428D01*
X44414285Y-87861904D01*
X44366666Y-87957142D01*
X44319047Y-88004761D01*
X44223809Y-88052380D01*
X44128571Y-88052380D01*
X44033333Y-88004761D01*
X43985714Y-87957142D01*
X43938095Y-87861904D01*
X43890476Y-87671428D01*
X43890476Y-87433333D01*
X43938095Y-87242857D01*
X43985714Y-87147619D01*
X44033333Y-87100000D01*
X44128571Y-87052380D01*
X45080952Y-87052380D02*
X45176190Y-87052380D01*
X45271428Y-87100000D01*
X45319047Y-87147619D01*
X45366666Y-87242857D01*
X45414285Y-87433333D01*
X45414285Y-87671428D01*
X45366666Y-87861904D01*
X45319047Y-87957142D01*
X45271428Y-88004761D01*
X45176190Y-88052380D01*
X45080952Y-88052380D01*
X44985714Y-88004761D01*
X44938095Y-87957142D01*
X44890476Y-87861904D01*
X44842857Y-87671428D01*
X44842857Y-87433333D01*
X44890476Y-87242857D01*
X44938095Y-87147619D01*
X44985714Y-87100000D01*
X45080952Y-87052380D01*
X46604761Y-88052380D02*
X46604761Y-87385714D01*
X46604761Y-87480952D02*
X46652380Y-87433333D01*
X46747619Y-87385714D01*
X46890476Y-87385714D01*
X46985714Y-87433333D01*
X47033333Y-87528571D01*
X47033333Y-88052380D01*
X47033333Y-87528571D02*
X47080952Y-87433333D01*
X47176190Y-87385714D01*
X47319047Y-87385714D01*
X47414285Y-87433333D01*
X47461904Y-87528571D01*
X47461904Y-88052380D01*
X47890476Y-87766666D02*
X48366666Y-87766666D01*
X47795238Y-88052380D02*
X48128571Y-87052380D01*
X48461904Y-88052380D01*
X48795238Y-88052380D02*
X48795238Y-87052380D01*
X48795238Y-87528571D02*
X49366666Y-87528571D01*
X49366666Y-88052380D02*
X49366666Y-87052380D01*
D11*
X35442857Y-103585714D02*
X36357142Y-103585714D01*
X40542857Y-103585714D02*
X41457142Y-103585714D01*
X41000000Y-104042857D02*
X41000000Y-103128571D01*
D10*
X14060000Y-88800000D02*
X50060000Y-88800000D01*
X14060000Y-73000000D02*
X50060000Y-73000000D01*
X27577142Y-56426428D02*
X26777142Y-56426428D01*
X28034285Y-56140714D02*
X27177142Y-55855000D01*
X27177142Y-56597857D01*
X26891428Y-57055000D02*
X26834285Y-57112142D01*
X26777142Y-57055000D01*
X26834285Y-56997857D01*
X26891428Y-57055000D01*
X26777142Y-57055000D01*
X27977142Y-57512142D02*
X27977142Y-58312142D01*
X26777142Y-57797857D01*
X26777142Y-58769285D02*
X27977142Y-58769285D01*
X26777142Y-59455000D02*
X27462857Y-58940714D01*
X27977142Y-59455000D02*
X27291428Y-58769285D01*
X50027142Y-14802857D02*
X50255714Y-14802857D01*
X50370000Y-14860000D01*
X50484285Y-14974285D01*
X50541428Y-15202857D01*
X50541428Y-15602857D01*
X50484285Y-15831428D01*
X50370000Y-15945714D01*
X50255714Y-16002857D01*
X50027142Y-16002857D01*
X49912857Y-15945714D01*
X49798571Y-15831428D01*
X49741428Y-15602857D01*
X49741428Y-15202857D01*
X49798571Y-14974285D01*
X49912857Y-14860000D01*
X50027142Y-14802857D01*
X51055714Y-16002857D02*
X51055714Y-14802857D01*
X51741428Y-16002857D01*
X51741428Y-14802857D01*
X675714Y-35742380D02*
X199523Y-35742380D01*
X199523Y-34742380D01*
X1199523Y-34742380D02*
X1390000Y-34742380D01*
X1485238Y-34790000D01*
X1580476Y-34885238D01*
X1628095Y-35075714D01*
X1628095Y-35409047D01*
X1580476Y-35599523D01*
X1485238Y-35694761D01*
X1390000Y-35742380D01*
X1199523Y-35742380D01*
X1104285Y-35694761D01*
X1009047Y-35599523D01*
X961428Y-35409047D01*
X961428Y-35075714D01*
X1009047Y-34885238D01*
X1104285Y-34790000D01*
X1199523Y-34742380D01*
X2580476Y-34790000D02*
X2485238Y-34742380D01*
X2342380Y-34742380D01*
X2199523Y-34790000D01*
X2104285Y-34885238D01*
X2056666Y-34980476D01*
X2009047Y-35170952D01*
X2009047Y-35313809D01*
X2056666Y-35504285D01*
X2104285Y-35599523D01*
X2199523Y-35694761D01*
X2342380Y-35742380D01*
X2437619Y-35742380D01*
X2580476Y-35694761D01*
X2628095Y-35647142D01*
X2628095Y-35313809D01*
X2437619Y-35313809D01*
X2148095Y-26990000D02*
X2043333Y-26937619D01*
X1886190Y-26937619D01*
X1729047Y-26990000D01*
X1624285Y-27094761D01*
X1571904Y-27199523D01*
X1519523Y-27409047D01*
X1519523Y-27566190D01*
X1571904Y-27775714D01*
X1624285Y-27880476D01*
X1729047Y-27985238D01*
X1886190Y-28037619D01*
X1990952Y-28037619D01*
X2148095Y-27985238D01*
X2200476Y-27932857D01*
X2200476Y-27566190D01*
X1990952Y-27566190D01*
X6686190Y-44365238D02*
X6790952Y-44417619D01*
X7000476Y-44417619D01*
X7105238Y-44365238D01*
X7157619Y-44260476D01*
X7157619Y-44208095D01*
X7105238Y-44103333D01*
X7000476Y-44050952D01*
X6843333Y-44050952D01*
X6738571Y-43998571D01*
X6686190Y-43893809D01*
X6686190Y-43841428D01*
X6738571Y-43736666D01*
X6843333Y-43684285D01*
X7000476Y-43684285D01*
X7105238Y-43736666D01*
X7576666Y-44365238D02*
X7681428Y-44417619D01*
X7890952Y-44417619D01*
X7995714Y-44365238D01*
X8048095Y-44260476D01*
X8048095Y-44208095D01*
X7995714Y-44103333D01*
X7890952Y-44050952D01*
X7733809Y-44050952D01*
X7629047Y-43998571D01*
X7576666Y-43893809D01*
X7576666Y-43841428D01*
X7629047Y-43736666D01*
X7733809Y-43684285D01*
X7890952Y-43684285D01*
X7995714Y-43736666D01*
X8990952Y-44417619D02*
X8990952Y-43317619D01*
X8990952Y-44365238D02*
X8886190Y-44417619D01*
X8676666Y-44417619D01*
X8571904Y-44365238D01*
X8519523Y-44312857D01*
X8467142Y-44208095D01*
X8467142Y-43893809D01*
X8519523Y-43789047D01*
X8571904Y-43736666D01*
X8676666Y-43684285D01*
X8886190Y-43684285D01*
X8990952Y-43736666D01*
X10090952Y-44417619D02*
X9462380Y-44417619D01*
X9776666Y-44417619D02*
X9776666Y-43317619D01*
X9671904Y-43474761D01*
X9567142Y-43579523D01*
X9462380Y-43631904D01*
X10457619Y-43317619D02*
X11138571Y-43317619D01*
X10771904Y-43736666D01*
X10929047Y-43736666D01*
X11033809Y-43789047D01*
X11086190Y-43841428D01*
X11138571Y-43946190D01*
X11138571Y-44208095D01*
X11086190Y-44312857D01*
X11033809Y-44365238D01*
X10929047Y-44417619D01*
X10614761Y-44417619D01*
X10510000Y-44365238D01*
X10457619Y-44312857D01*
X11819523Y-43317619D02*
X11924285Y-43317619D01*
X12029047Y-43370000D01*
X12081428Y-43422380D01*
X12133809Y-43527142D01*
X12186190Y-43736666D01*
X12186190Y-43998571D01*
X12133809Y-44208095D01*
X12081428Y-44312857D01*
X12029047Y-44365238D01*
X11924285Y-44417619D01*
X11819523Y-44417619D01*
X11714761Y-44365238D01*
X11662380Y-44312857D01*
X11610000Y-44208095D01*
X11557619Y-43998571D01*
X11557619Y-43736666D01*
X11610000Y-43527142D01*
X11662380Y-43422380D01*
X11714761Y-43370000D01*
X11819523Y-43317619D01*
X13129047Y-43317619D02*
X12919523Y-43317619D01*
X12814761Y-43370000D01*
X12762380Y-43422380D01*
X12657619Y-43579523D01*
X12605238Y-43789047D01*
X12605238Y-44208095D01*
X12657619Y-44312857D01*
X12710000Y-44365238D01*
X12814761Y-44417619D01*
X13024285Y-44417619D01*
X13129047Y-44365238D01*
X13181428Y-44312857D01*
X13233809Y-44208095D01*
X13233809Y-43946190D01*
X13181428Y-43841428D01*
X13129047Y-43789047D01*
X13024285Y-43736666D01*
X12814761Y-43736666D01*
X12710000Y-43789047D01*
X12657619Y-43841428D01*
X12605238Y-43946190D01*
X155714Y-20424761D02*
X298571Y-20472380D01*
X536666Y-20472380D01*
X631904Y-20424761D01*
X679523Y-20377142D01*
X727142Y-20281904D01*
X727142Y-20186666D01*
X679523Y-20091428D01*
X631904Y-20043809D01*
X536666Y-19996190D01*
X346190Y-19948571D01*
X250952Y-19900952D01*
X203333Y-19853333D01*
X155714Y-19758095D01*
X155714Y-19662857D01*
X203333Y-19567619D01*
X250952Y-19520000D01*
X346190Y-19472380D01*
X584285Y-19472380D01*
X727142Y-19520000D01*
X1155714Y-20472380D02*
X1155714Y-19472380D01*
X1393809Y-19472380D01*
X1536666Y-19520000D01*
X1631904Y-19615238D01*
X1679523Y-19710476D01*
X1727142Y-19900952D01*
X1727142Y-20043809D01*
X1679523Y-20234285D01*
X1631904Y-20329523D01*
X1536666Y-20424761D01*
X1393809Y-20472380D01*
X1155714Y-20472380D01*
X2108095Y-20186666D02*
X2584285Y-20186666D01*
X2012857Y-20472380D02*
X2346190Y-19472380D01*
X2679523Y-20472380D01*
X239523Y-22924761D02*
X382380Y-22972380D01*
X620476Y-22972380D01*
X715714Y-22924761D01*
X763333Y-22877142D01*
X810952Y-22781904D01*
X810952Y-22686666D01*
X763333Y-22591428D01*
X715714Y-22543809D01*
X620476Y-22496190D01*
X430000Y-22448571D01*
X334761Y-22400952D01*
X287142Y-22353333D01*
X239523Y-22258095D01*
X239523Y-22162857D01*
X287142Y-22067619D01*
X334761Y-22020000D01*
X430000Y-21972380D01*
X668095Y-21972380D01*
X810952Y-22020000D01*
X1810952Y-22877142D02*
X1763333Y-22924761D01*
X1620476Y-22972380D01*
X1525238Y-22972380D01*
X1382380Y-22924761D01*
X1287142Y-22829523D01*
X1239523Y-22734285D01*
X1191904Y-22543809D01*
X1191904Y-22400952D01*
X1239523Y-22210476D01*
X1287142Y-22115238D01*
X1382380Y-22020000D01*
X1525238Y-21972380D01*
X1620476Y-21972380D01*
X1763333Y-22020000D01*
X1810952Y-22067619D01*
X2715714Y-22972380D02*
X2239523Y-22972380D01*
X2239523Y-21972380D01*
X901904Y-16637619D02*
X1582857Y-16637619D01*
X1216190Y-17056666D01*
X1373333Y-17056666D01*
X1478095Y-17109047D01*
X1530476Y-17161428D01*
X1582857Y-17266190D01*
X1582857Y-17528095D01*
X1530476Y-17632857D01*
X1478095Y-17685238D01*
X1373333Y-17737619D01*
X1059047Y-17737619D01*
X954285Y-17685238D01*
X901904Y-17632857D01*
X1897142Y-16637619D02*
X2263809Y-17737619D01*
X2630476Y-16637619D01*
X1354285Y-24340000D02*
X1249523Y-24287619D01*
X1092380Y-24287619D01*
X935238Y-24340000D01*
X830476Y-24444761D01*
X778095Y-24549523D01*
X725714Y-24759047D01*
X725714Y-24916190D01*
X778095Y-25125714D01*
X830476Y-25230476D01*
X935238Y-25335238D01*
X1092380Y-25387619D01*
X1197142Y-25387619D01*
X1354285Y-25335238D01*
X1406666Y-25282857D01*
X1406666Y-24916190D01*
X1197142Y-24916190D01*
X2454285Y-25387619D02*
X1825714Y-25387619D01*
X2140000Y-25387619D02*
X2140000Y-24287619D01*
X2035238Y-24444761D01*
X1930476Y-24549523D01*
X1825714Y-24601904D01*
X1386666Y-30587619D02*
X1020000Y-30063809D01*
X758095Y-30587619D02*
X758095Y-29487619D01*
X1177142Y-29487619D01*
X1281904Y-29540000D01*
X1334285Y-29592380D01*
X1386666Y-29697142D01*
X1386666Y-29854285D01*
X1334285Y-29959047D01*
X1281904Y-30011428D01*
X1177142Y-30063809D01*
X758095Y-30063809D01*
X1753333Y-29487619D02*
X2486666Y-30587619D01*
X2486666Y-29487619D02*
X1753333Y-30587619D01*
X911904Y-32297619D02*
X1540476Y-32297619D01*
X1226190Y-33397619D02*
X1226190Y-32297619D01*
X1802380Y-32297619D02*
X2535714Y-33397619D01*
X2535714Y-32297619D02*
X1802380Y-33397619D01*
X254285Y-45052380D02*
X254285Y-44052380D01*
X635238Y-44052380D01*
X730476Y-44100000D01*
X778095Y-44147619D01*
X825714Y-44242857D01*
X825714Y-44385714D01*
X778095Y-44480952D01*
X730476Y-44528571D01*
X635238Y-44576190D01*
X254285Y-44576190D01*
X1825714Y-45052380D02*
X1492380Y-44576190D01*
X1254285Y-45052380D02*
X1254285Y-44052380D01*
X1635238Y-44052380D01*
X1730476Y-44100000D01*
X1778095Y-44147619D01*
X1825714Y-44242857D01*
X1825714Y-44385714D01*
X1778095Y-44480952D01*
X1730476Y-44528571D01*
X1635238Y-44576190D01*
X1254285Y-44576190D01*
X2444761Y-44052380D02*
X2635238Y-44052380D01*
X2730476Y-44100000D01*
X2825714Y-44195238D01*
X2873333Y-44385714D01*
X2873333Y-44719047D01*
X2825714Y-44909523D01*
X2730476Y-45004761D01*
X2635238Y-45052380D01*
X2444761Y-45052380D01*
X2349523Y-45004761D01*
X2254285Y-44909523D01*
X2206666Y-44719047D01*
X2206666Y-44385714D01*
X2254285Y-44195238D01*
X2349523Y-44100000D01*
X2444761Y-44052380D01*
X3825714Y-44100000D02*
X3730476Y-44052380D01*
X3587619Y-44052380D01*
X3444761Y-44100000D01*
X3349523Y-44195238D01*
X3301904Y-44290476D01*
X3254285Y-44480952D01*
X3254285Y-44623809D01*
X3301904Y-44814285D01*
X3349523Y-44909523D01*
X3444761Y-45004761D01*
X3587619Y-45052380D01*
X3682857Y-45052380D01*
X3825714Y-45004761D01*
X3873333Y-44957142D01*
X3873333Y-44623809D01*
X3682857Y-44623809D01*
X49127142Y-24482857D02*
X49355714Y-24482857D01*
X49470000Y-24540000D01*
X49584285Y-24654285D01*
X49641428Y-24882857D01*
X49641428Y-25282857D01*
X49584285Y-25511428D01*
X49470000Y-25625714D01*
X49355714Y-25682857D01*
X49127142Y-25682857D01*
X49012857Y-25625714D01*
X48898571Y-25511428D01*
X48841428Y-25282857D01*
X48841428Y-24882857D01*
X48898571Y-24654285D01*
X49012857Y-24540000D01*
X49127142Y-24482857D01*
X50555714Y-25054285D02*
X50155714Y-25054285D01*
X50155714Y-25682857D02*
X50155714Y-24482857D01*
X50727142Y-24482857D01*
X51584285Y-25054285D02*
X51184285Y-25054285D01*
X51184285Y-25682857D02*
X51184285Y-24482857D01*
X51755714Y-24482857D01*
X45232857Y-40267142D02*
X45518571Y-40362380D01*
X45613809Y-40457619D01*
X45709047Y-40648095D01*
X45709047Y-40933809D01*
X45613809Y-41124285D01*
X45518571Y-41219523D01*
X45328095Y-41314761D01*
X44566190Y-41314761D01*
X44566190Y-39314761D01*
X45232857Y-39314761D01*
X45423333Y-39410000D01*
X45518571Y-39505238D01*
X45613809Y-39695714D01*
X45613809Y-39886190D01*
X45518571Y-40076666D01*
X45423333Y-40171904D01*
X45232857Y-40267142D01*
X44566190Y-40267142D01*
X46857142Y-102832857D02*
X46457142Y-102261428D01*
X46171428Y-102832857D02*
X46171428Y-101632857D01*
X46628571Y-101632857D01*
X46742857Y-101690000D01*
X46800000Y-101747142D01*
X46857142Y-101861428D01*
X46857142Y-102032857D01*
X46800000Y-102147142D01*
X46742857Y-102204285D01*
X46628571Y-102261428D01*
X46171428Y-102261428D01*
X47371428Y-102204285D02*
X47771428Y-102204285D01*
X47942857Y-102832857D02*
X47371428Y-102832857D01*
X47371428Y-101632857D01*
X47942857Y-101632857D01*
X48400000Y-102775714D02*
X48571428Y-102832857D01*
X48857142Y-102832857D01*
X48971428Y-102775714D01*
X49028571Y-102718571D01*
X49085714Y-102604285D01*
X49085714Y-102490000D01*
X49028571Y-102375714D01*
X48971428Y-102318571D01*
X48857142Y-102261428D01*
X48628571Y-102204285D01*
X48514285Y-102147142D01*
X48457142Y-102090000D01*
X48400000Y-101975714D01*
X48400000Y-101861428D01*
X48457142Y-101747142D01*
X48514285Y-101690000D01*
X48628571Y-101632857D01*
X48914285Y-101632857D01*
X49085714Y-101690000D01*
X49600000Y-102204285D02*
X50000000Y-102204285D01*
X50171428Y-102832857D02*
X49600000Y-102832857D01*
X49600000Y-101632857D01*
X50171428Y-101632857D01*
X50514285Y-101632857D02*
X51200000Y-101632857D01*
X50857142Y-102832857D02*
X50857142Y-101632857D01*
X33846714Y-38498142D02*
X33903857Y-38326714D01*
X33903857Y-38041000D01*
X33846714Y-37926714D01*
X33789571Y-37869571D01*
X33675285Y-37812428D01*
X33561000Y-37812428D01*
X33446714Y-37869571D01*
X33389571Y-37926714D01*
X33332428Y-38041000D01*
X33275285Y-38269571D01*
X33218142Y-38383857D01*
X33161000Y-38441000D01*
X33046714Y-38498142D01*
X32932428Y-38498142D01*
X32818142Y-38441000D01*
X32761000Y-38383857D01*
X32703857Y-38269571D01*
X32703857Y-37983857D01*
X32761000Y-37812428D01*
X33903857Y-37298142D02*
X32703857Y-37298142D01*
X32703857Y-37012428D01*
X32761000Y-36841000D01*
X32875285Y-36726714D01*
X32989571Y-36669571D01*
X33218142Y-36612428D01*
X33389571Y-36612428D01*
X33618142Y-36669571D01*
X33732428Y-36726714D01*
X33846714Y-36841000D01*
X33903857Y-37012428D01*
X33903857Y-37298142D01*
X33561000Y-36155285D02*
X33561000Y-35583857D01*
X33903857Y-36269571D02*
X32703857Y-35869571D01*
X33903857Y-35469571D01*
X37871000Y-37812428D02*
X37813857Y-37926714D01*
X37813857Y-38098143D01*
X37871000Y-38269571D01*
X37985285Y-38383857D01*
X38099571Y-38441000D01*
X38328142Y-38498143D01*
X38499571Y-38498143D01*
X38728142Y-38441000D01*
X38842428Y-38383857D01*
X38956714Y-38269571D01*
X39013857Y-38098143D01*
X39013857Y-37983857D01*
X38956714Y-37812428D01*
X38899571Y-37755285D01*
X38499571Y-37755285D01*
X38499571Y-37983857D01*
X39013857Y-37241000D02*
X37813857Y-37241000D01*
X39013857Y-36555285D01*
X37813857Y-36555285D01*
X39013857Y-35983857D02*
X37813857Y-35983857D01*
X37813857Y-35698143D01*
X37871000Y-35526714D01*
X37985285Y-35412428D01*
X38099571Y-35355285D01*
X38328142Y-35298143D01*
X38499571Y-35298143D01*
X38728142Y-35355285D01*
X38842428Y-35412428D01*
X38956714Y-35526714D01*
X39013857Y-35698143D01*
X39013857Y-35983857D01*
X40323857Y-38555285D02*
X40323857Y-37812428D01*
X40781000Y-38212428D01*
X40781000Y-38041000D01*
X40838142Y-37926714D01*
X40895285Y-37869571D01*
X41009571Y-37812428D01*
X41295285Y-37812428D01*
X41409571Y-37869571D01*
X41466714Y-37926714D01*
X41523857Y-38041000D01*
X41523857Y-38383857D01*
X41466714Y-38498142D01*
X41409571Y-38555285D01*
X40323857Y-37469571D02*
X41523857Y-37069571D01*
X40323857Y-36669571D01*
X36436714Y-38498142D02*
X36493857Y-38326713D01*
X36493857Y-38040999D01*
X36436714Y-37926713D01*
X36379571Y-37869571D01*
X36265285Y-37812428D01*
X36151000Y-37812428D01*
X36036714Y-37869571D01*
X35979571Y-37926713D01*
X35922428Y-38040999D01*
X35865285Y-38269571D01*
X35808142Y-38383856D01*
X35751000Y-38440999D01*
X35636714Y-38498142D01*
X35522428Y-38498142D01*
X35408142Y-38440999D01*
X35351000Y-38383856D01*
X35293857Y-38269571D01*
X35293857Y-37983856D01*
X35351000Y-37812428D01*
X36379571Y-36612428D02*
X36436714Y-36669571D01*
X36493857Y-36840999D01*
X36493857Y-36955285D01*
X36436714Y-37126713D01*
X36322428Y-37240999D01*
X36208142Y-37298142D01*
X35979571Y-37355285D01*
X35808142Y-37355285D01*
X35579571Y-37298142D01*
X35465285Y-37240999D01*
X35351000Y-37126713D01*
X35293857Y-36955285D01*
X35293857Y-36840999D01*
X35351000Y-36669571D01*
X35408142Y-36612428D01*
X36493857Y-35526713D02*
X36493857Y-36098142D01*
X35293857Y-36098142D01*
X44413809Y-31043333D02*
X45366190Y-31043333D01*
X44223333Y-31614761D02*
X44890000Y-29614761D01*
X45556666Y-31614761D01*
X23891742Y-56426428D02*
X23091742Y-56426428D01*
X24348885Y-56140714D02*
X23491742Y-55855000D01*
X23491742Y-56597857D01*
X23206028Y-57055000D02*
X23148885Y-57112142D01*
X23091742Y-57055000D01*
X23148885Y-56997857D01*
X23206028Y-57055000D01*
X23091742Y-57055000D01*
X24291742Y-57512142D02*
X24291742Y-58312142D01*
X23091742Y-57797857D01*
X23091742Y-58769285D02*
X24291742Y-58769285D01*
X23091742Y-59455000D02*
X23777457Y-58940714D01*
X24291742Y-59455000D02*
X23606028Y-58769285D01*
D12*
X8818142Y-41096714D02*
X8989571Y-41153857D01*
X9275285Y-41153857D01*
X9389571Y-41096714D01*
X9446714Y-41039571D01*
X9503857Y-40925285D01*
X9503857Y-40811000D01*
X9446714Y-40696714D01*
X9389571Y-40639571D01*
X9275285Y-40582428D01*
X9046714Y-40525285D01*
X8932428Y-40468142D01*
X8875285Y-40411000D01*
X8818142Y-40296714D01*
X8818142Y-40182428D01*
X8875285Y-40068142D01*
X8932428Y-40011000D01*
X9046714Y-39953857D01*
X9332428Y-39953857D01*
X9503857Y-40011000D01*
X10703857Y-41039571D02*
X10646714Y-41096714D01*
X10475285Y-41153857D01*
X10361000Y-41153857D01*
X10189571Y-41096714D01*
X10075285Y-40982428D01*
X10018142Y-40868142D01*
X9961000Y-40639571D01*
X9961000Y-40468142D01*
X10018142Y-40239571D01*
X10075285Y-40125285D01*
X10189571Y-40011000D01*
X10361000Y-39953857D01*
X10475285Y-39953857D01*
X10646714Y-40011000D01*
X10703857Y-40068142D01*
X11218142Y-41153857D02*
X11218142Y-39953857D01*
X11503857Y-39953857D01*
X11675285Y-40011000D01*
X11789571Y-40125285D01*
X11846714Y-40239571D01*
X11903857Y-40468142D01*
X11903857Y-40639571D01*
X11846714Y-40868142D01*
X11789571Y-40982428D01*
X11675285Y-41096714D01*
X11503857Y-41153857D01*
X11218142Y-41153857D01*
X12303857Y-39953857D02*
X13046714Y-39953857D01*
X12646714Y-40411000D01*
X12818142Y-40411000D01*
X12932428Y-40468142D01*
X12989571Y-40525285D01*
X13046714Y-40639571D01*
X13046714Y-40925285D01*
X12989571Y-41039571D01*
X12932428Y-41096714D01*
X12818142Y-41153857D01*
X12475285Y-41153857D01*
X12361000Y-41096714D01*
X12303857Y-41039571D01*
X13789571Y-39953857D02*
X13903857Y-39953857D01*
X14018142Y-40011000D01*
X14075285Y-40068142D01*
X14132428Y-40182428D01*
X14189571Y-40411000D01*
X14189571Y-40696714D01*
X14132428Y-40925285D01*
X14075285Y-41039571D01*
X14018142Y-41096714D01*
X13903857Y-41153857D01*
X13789571Y-41153857D01*
X13675285Y-41096714D01*
X13618142Y-41039571D01*
X13561000Y-40925285D01*
X13503857Y-40696714D01*
X13503857Y-40411000D01*
X13561000Y-40182428D01*
X13618142Y-40068142D01*
X13675285Y-40011000D01*
X13789571Y-39953857D01*
X15961000Y-41611000D02*
X15903857Y-41553857D01*
X15789571Y-41382428D01*
X15732428Y-41268142D01*
X15675285Y-41096714D01*
X15618142Y-40811000D01*
X15618142Y-40582428D01*
X15675285Y-40296714D01*
X15732428Y-40125285D01*
X15789571Y-40011000D01*
X15903857Y-39839571D01*
X15961000Y-39782428D01*
X17103857Y-41039571D02*
X17046714Y-41096714D01*
X16875285Y-41153857D01*
X16761000Y-41153857D01*
X16589571Y-41096714D01*
X16475285Y-40982428D01*
X16418142Y-40868142D01*
X16361000Y-40639571D01*
X16361000Y-40468142D01*
X16418142Y-40239571D01*
X16475285Y-40125285D01*
X16589571Y-40011000D01*
X16761000Y-39953857D01*
X16875285Y-39953857D01*
X17046714Y-40011000D01*
X17103857Y-40068142D01*
X17846714Y-39953857D02*
X18075285Y-39953857D01*
X18189571Y-40011000D01*
X18303857Y-40125285D01*
X18361000Y-40353857D01*
X18361000Y-40753857D01*
X18303857Y-40982428D01*
X18189571Y-41096714D01*
X18075285Y-41153857D01*
X17846714Y-41153857D01*
X17732428Y-41096714D01*
X17618142Y-40982428D01*
X17561000Y-40753857D01*
X17561000Y-40353857D01*
X17618142Y-40125285D01*
X17732428Y-40011000D01*
X17846714Y-39953857D01*
X18818142Y-40068142D02*
X18875285Y-40011000D01*
X18989571Y-39953857D01*
X19275285Y-39953857D01*
X19389571Y-40011000D01*
X19446714Y-40068142D01*
X19503857Y-40182428D01*
X19503857Y-40296714D01*
X19446714Y-40468142D01*
X18761000Y-41153857D01*
X19503857Y-41153857D01*
X19903857Y-41611000D02*
X19961000Y-41553857D01*
X20075285Y-41382428D01*
X20132428Y-41268142D01*
X20189571Y-41096714D01*
X20246714Y-40811000D01*
X20246714Y-40582428D01*
X20189571Y-40296714D01*
X20132428Y-40125285D01*
X20075285Y-40011000D01*
X19961000Y-39839571D01*
X19903857Y-39782428D01*
D13*
X42981000Y-41771000D02*
X42981000Y-18001000D01*
X6621000Y-41771000D02*
X42981000Y-41771000D01*
X6621000Y-18001000D02*
X42981000Y-18001000D01*
X6621000Y-18001000D02*
X6621000Y-41771000D01*
X12587000Y-92719000D02*
X12587000Y-92939000D01*
X507000Y-92719000D02*
X12587000Y-92719000D01*
X507000Y-100489000D02*
X507000Y-92719000D01*
X12577000Y-100489000D02*
X507000Y-100489000D01*
D10*
X20206342Y-56426428D02*
X19406342Y-56426428D01*
X20663485Y-56140714D02*
X19806342Y-55855000D01*
X19806342Y-56597857D01*
X19520628Y-57055000D02*
X19463485Y-57112142D01*
X19406342Y-57055000D01*
X19463485Y-56997857D01*
X19520628Y-57055000D01*
X19406342Y-57055000D01*
X20606342Y-57512142D02*
X20606342Y-58312142D01*
X19406342Y-57797857D01*
X19406342Y-58769285D02*
X20606342Y-58769285D01*
X19406342Y-59455000D02*
X20092057Y-58940714D01*
X20606342Y-59455000D02*
X19920628Y-58769285D01*
X9150142Y-56426428D02*
X8350142Y-56426428D01*
X9607285Y-56140714D02*
X8750142Y-55855000D01*
X8750142Y-56597857D01*
X8464428Y-57055000D02*
X8407285Y-57112142D01*
X8350142Y-57055000D01*
X8407285Y-56997857D01*
X8464428Y-57055000D01*
X8350142Y-57055000D01*
X9550142Y-57512142D02*
X9550142Y-58312142D01*
X8350142Y-57797857D01*
X8350142Y-58769285D02*
X9550142Y-58769285D01*
X8350142Y-59455000D02*
X9035857Y-58940714D01*
X9550142Y-59455000D02*
X8864428Y-58769285D01*
X16520942Y-56426428D02*
X15720942Y-56426428D01*
X16978085Y-56140714D02*
X16120942Y-55855000D01*
X16120942Y-56597857D01*
X15835228Y-57055000D02*
X15778085Y-57112142D01*
X15720942Y-57055000D01*
X15778085Y-56997857D01*
X15835228Y-57055000D01*
X15720942Y-57055000D01*
X16920942Y-57512142D02*
X16920942Y-58312142D01*
X15720942Y-57797857D01*
X15720942Y-58769285D02*
X16920942Y-58769285D01*
X15720942Y-59455000D02*
X16406657Y-58940714D01*
X16920942Y-59455000D02*
X16235228Y-58769285D01*
X12835542Y-56426428D02*
X12035542Y-56426428D01*
X13292685Y-56140714D02*
X12435542Y-55855000D01*
X12435542Y-56597857D01*
X12149828Y-57055000D02*
X12092685Y-57112142D01*
X12035542Y-57055000D01*
X12092685Y-56997857D01*
X12149828Y-57055000D01*
X12035542Y-57055000D01*
X13235542Y-57512142D02*
X13235542Y-58312142D01*
X12035542Y-57797857D01*
X12035542Y-58769285D02*
X13235542Y-58769285D01*
X12035542Y-59455000D02*
X12721257Y-58940714D01*
X13235542Y-59455000D02*
X12549828Y-58769285D01*
X3249857Y-97836714D02*
X3249857Y-98408143D01*
X3821285Y-98465285D01*
X3764142Y-98408143D01*
X3707000Y-98293857D01*
X3707000Y-98008143D01*
X3764142Y-97893857D01*
X3821285Y-97836714D01*
X3935571Y-97779571D01*
X4221285Y-97779571D01*
X4335571Y-97836714D01*
X4392714Y-97893857D01*
X4449857Y-98008143D01*
X4449857Y-98293857D01*
X4392714Y-98408143D01*
X4335571Y-98465285D01*
X3249857Y-97436714D02*
X4449857Y-97036714D01*
X3249857Y-96636714D01*
X6037000Y-99265285D02*
X5979857Y-99379571D01*
X5979857Y-99551000D01*
X6037000Y-99722428D01*
X6151285Y-99836714D01*
X6265571Y-99893857D01*
X6494142Y-99951000D01*
X6665571Y-99951000D01*
X6894142Y-99893857D01*
X7008428Y-99836714D01*
X7122714Y-99722428D01*
X7179857Y-99551000D01*
X7179857Y-99436714D01*
X7122714Y-99265285D01*
X7065571Y-99208142D01*
X6665571Y-99208142D01*
X6665571Y-99436714D01*
X7179857Y-98693857D02*
X5979857Y-98693857D01*
X7179857Y-98008142D01*
X5979857Y-98008142D01*
X7179857Y-97436714D02*
X5979857Y-97436714D01*
X5979857Y-97151000D01*
X6037000Y-96979571D01*
X6151285Y-96865285D01*
X6265571Y-96808142D01*
X6494142Y-96751000D01*
X6665571Y-96751000D01*
X6894142Y-96808142D01*
X7008428Y-96865285D01*
X7122714Y-96979571D01*
X7179857Y-97151000D01*
X7179857Y-97436714D01*
X8379857Y-99265285D02*
X9579857Y-98865285D01*
X8379857Y-98465285D01*
X9579857Y-98065285D02*
X8379857Y-98065285D01*
X9579857Y-97493857D02*
X8379857Y-97493857D01*
X9579857Y-96808142D01*
X8379857Y-96808142D01*
D13*
X12578600Y-92932000D02*
X12578600Y-100482000D01*
%TO.C,J2*%
X16110000Y-10685000D02*
X16110000Y-13185000D01*
X16110000Y-13185000D02*
X15060000Y-13185000D01*
X15060000Y-13185000D02*
X15060000Y-14175000D01*
X9890000Y-10685000D02*
X9890000Y-13185000D01*
X9890000Y-13185000D02*
X10940000Y-13185000D01*
X14940000Y-8715000D02*
X11060000Y-8715000D01*
%TO.C,J7*%
X17000000Y-44470000D02*
G75*
G03*
X17000000Y-44470000I-1500000J0D01*
G01*
X38000000Y-44470000D02*
G75*
G03*
X38000000Y-44470000I-1500000J0D01*
G01*
X13500000Y-68300000D02*
X38500000Y-68300000D01*
X13500000Y-42300000D02*
X13500000Y-68300000D01*
X38500000Y-42300000D02*
X38500000Y-68300000D01*
X13500000Y-42300000D02*
X38500000Y-42300000D01*
X20860000Y-43630000D02*
X20860000Y-42300000D01*
X20860000Y-42300000D02*
X22190000Y-42300000D01*
X23460000Y-42300000D02*
X31140000Y-42300000D01*
X31140000Y-44960000D02*
X31140000Y-42300000D01*
X23460000Y-44960000D02*
X31140000Y-44960000D01*
X23460000Y-44960000D02*
X23460000Y-42300000D01*
%TO.C,J4*%
X36230000Y-14500000D02*
X36230000Y-11840000D01*
X36230000Y-14500000D02*
X43910000Y-14500000D01*
X43910000Y-14500000D02*
X43910000Y-11840000D01*
X36230000Y-11840000D02*
X43910000Y-11840000D01*
X33630000Y-11840000D02*
X34960000Y-11840000D01*
X33630000Y-13170000D02*
X33630000Y-11840000D01*
%TO.C,J11*%
X42680000Y-98200000D02*
G75*
G03*
X42680000Y-98200000I-1680000J0D01*
G01*
X33440000Y-102300000D02*
X43560000Y-102300000D01*
X33440000Y-100800000D02*
X43560000Y-100800000D01*
X33440000Y-95899000D02*
X43560000Y-95899000D01*
X33440000Y-92939000D02*
X43560000Y-92939000D01*
X33440000Y-102860000D02*
X43560000Y-102860000D01*
X33440000Y-92939000D02*
X33440000Y-102860000D01*
X43560000Y-92939000D02*
X43560000Y-102860000D01*
X42275000Y-97131000D02*
X42228000Y-97177000D01*
X39966000Y-99439000D02*
X39931000Y-99474000D01*
X42070000Y-96925000D02*
X42035000Y-96961000D01*
X39773000Y-99223000D02*
X39726000Y-99269000D01*
X33200000Y-102360000D02*
X33200000Y-103100000D01*
X33200000Y-103100000D02*
X33700000Y-103100000D01*
X36028805Y-99880253D02*
G75*
G02*
X35316000Y-99735000I-28805J1680253D01*
G01*
X34464574Y-98883042D02*
G75*
G02*
X34465000Y-97516000I1535426J683042D01*
G01*
X35316958Y-96664574D02*
G75*
G02*
X36684000Y-96665000I683042J-1535426D01*
G01*
X37535426Y-97516958D02*
G75*
G02*
X37535000Y-98884000I-1535426J-683042D01*
G01*
X36683318Y-99734756D02*
G75*
G02*
X36000000Y-99880000I-683318J1534756D01*
G01*
%TO.C,J8*%
X49170000Y-18950000D02*
X51830000Y-18950000D01*
X49170000Y-18950000D02*
X49170000Y-24090000D01*
X49170000Y-24090000D02*
X51830000Y-24090000D01*
X51830000Y-18950000D02*
X51830000Y-24090000D01*
X51830000Y-16350000D02*
X51830000Y-17680000D01*
X50500000Y-16350000D02*
X51830000Y-16350000D01*
%TO.C,J3*%
X2800000Y-41180000D02*
X140000Y-41180000D01*
X2800000Y-41180000D02*
X2800000Y-36040000D01*
X2800000Y-36040000D02*
X140000Y-36040000D01*
X140000Y-41180000D02*
X140000Y-36040000D01*
X140000Y-43780000D02*
X140000Y-42450000D01*
X1470000Y-43780000D02*
X140000Y-43780000D01*
%TO.C,J6*%
X12020000Y-17470000D02*
X12020000Y-14810000D01*
X12020000Y-17470000D02*
X42560000Y-17470000D01*
X42560000Y-17470000D02*
X42560000Y-14810000D01*
X12020000Y-14810000D02*
X42560000Y-14810000D01*
X9420000Y-14810000D02*
X10750000Y-14810000D01*
X9420000Y-16140000D02*
X9420000Y-14810000D01*
%TO.C,Q1*%
X34820000Y-51730000D02*
X34820000Y-61970000D01*
X50710000Y-51730000D02*
X50710000Y-61970000D01*
X50710000Y-51730000D02*
X34820000Y-51730000D01*
X50710000Y-61970000D02*
X34820000Y-61970000D01*
X34820000Y-54310000D02*
X32280000Y-54310000D01*
X34820000Y-56850000D02*
X32280000Y-56850000D01*
X34820000Y-59390000D02*
X32280000Y-59390000D01*
%TO.C,BZ1*%
X12250000Y-81110000D02*
G75*
G03*
X12250000Y-81110000I-6000000J0D01*
G01*
%TO.C,J5*%
X3160000Y-18840000D02*
X5820000Y-18840000D01*
X3160000Y-18840000D02*
X3160000Y-34140000D01*
X3160000Y-34140000D02*
X5820000Y-34140000D01*
X5820000Y-18840000D02*
X5820000Y-34140000D01*
X5820000Y-16240000D02*
X5820000Y-17570000D01*
X4490000Y-16240000D02*
X5820000Y-16240000D01*
%TO.C,U2*%
X508000Y-45644000D02*
X508000Y-68634000D01*
X51308000Y-68634000D02*
X51308000Y-45644000D01*
X508000Y-68634000D02*
X51308000Y-68634000D01*
X508000Y-45644000D02*
X51308000Y-45644000D01*
X5398000Y-65964000D02*
X5398000Y-68624000D01*
X36048000Y-65964000D02*
X36048000Y-67294000D01*
X33448000Y-65964000D02*
X33448000Y-68624000D01*
X33448000Y-65964000D02*
X5398000Y-65964000D01*
X33448000Y-68624000D02*
X5398000Y-68624000D01*
X34718000Y-65964000D02*
X36048000Y-65964000D01*
X5528000Y-45644000D02*
X5528000Y-48304000D01*
X43688000Y-48304000D02*
X5528000Y-48304000D01*
X43688000Y-45644000D02*
X43688000Y-48304000D01*
X44958000Y-45644000D02*
X46288000Y-45644000D01*
X46288000Y-45644000D02*
X46288000Y-46974000D01*
%TO.C,U1*%
X46288000Y-69270000D02*
X46288000Y-70600000D01*
X44958000Y-69270000D02*
X46288000Y-69270000D01*
X43688000Y-69270000D02*
X43688000Y-71930000D01*
X43688000Y-71930000D02*
X5528000Y-71930000D01*
X5528000Y-69270000D02*
X5528000Y-71930000D01*
X34718000Y-89590000D02*
X36048000Y-89590000D01*
X33448000Y-92250000D02*
X5398000Y-92250000D01*
X33448000Y-89590000D02*
X5398000Y-89590000D01*
X33448000Y-89590000D02*
X33448000Y-92250000D01*
X36048000Y-89590000D02*
X36048000Y-90920000D01*
X5398000Y-89590000D02*
X5398000Y-92250000D01*
X508000Y-69270000D02*
X51308000Y-69270000D01*
X508000Y-92260000D02*
X51308000Y-92260000D01*
X51308000Y-92260000D02*
X51308000Y-69270000D01*
X508000Y-69270000D02*
X508000Y-92260000D01*
%TO.C,R6*%
X27590000Y-63330000D02*
X27590000Y-62640000D01*
X27590000Y-52710000D02*
X27590000Y-53400000D01*
X29310000Y-62640000D02*
X29310000Y-53400000D01*
X25870000Y-62640000D02*
X29310000Y-62640000D01*
X25870000Y-53400000D02*
X25870000Y-62640000D01*
X29310000Y-53400000D02*
X25870000Y-53400000D01*
%TO.C,SW3*%
X49954214Y-97180000D02*
G75*
G03*
X49954214Y-97180000I-1414214J0D01*
G01*
X45420000Y-94210000D02*
X45420000Y-100150000D01*
X51660000Y-94210000D02*
X51660000Y-100150000D01*
X47200000Y-94060000D02*
X49880000Y-94060000D01*
X49880000Y-100300000D02*
X47200000Y-100300000D01*
%TO.C,R1*%
X10440000Y-53400000D02*
X7000000Y-53400000D01*
X7000000Y-53400000D02*
X7000000Y-62640000D01*
X7000000Y-62640000D02*
X10440000Y-62640000D01*
X10440000Y-62640000D02*
X10440000Y-53400000D01*
X8720000Y-52710000D02*
X8720000Y-53400000D01*
X8720000Y-63330000D02*
X8720000Y-62640000D01*
%TO.C,J1*%
X39703000Y-39081000D02*
X39703000Y-41741000D01*
X39703000Y-39081000D02*
X24403000Y-39081000D01*
X24403000Y-39081000D02*
X24403000Y-41741000D01*
X39703000Y-41741000D02*
X24403000Y-41741000D01*
X42303000Y-41741000D02*
X40973000Y-41741000D01*
X42303000Y-40411000D02*
X42303000Y-41741000D01*
%TO.C,SW2*%
X46690000Y-37020000D02*
X46460000Y-37020000D01*
X50360000Y-36500000D02*
X50360000Y-44220000D01*
X50360000Y-44220000D02*
X46460000Y-44220000D01*
X43350000Y-36500000D02*
X43350000Y-37020000D01*
X50360000Y-36500000D02*
X46460000Y-36500000D01*
X46690000Y-43700000D02*
X46460000Y-43700000D01*
X43860000Y-37020000D02*
X43350000Y-37020000D01*
X43860000Y-36500000D02*
X43350000Y-36500000D01*
X46690000Y-43160000D02*
X46690000Y-43700000D01*
X43860000Y-43700000D02*
X43350000Y-43700000D01*
X43350000Y-43700000D02*
X43350000Y-44220000D01*
X43860000Y-44220000D02*
X43350000Y-44220000D01*
X46690000Y-37020000D02*
X46690000Y-37560000D01*
X46690000Y-38660000D02*
X46690000Y-42060000D01*
%TO.C,SW1*%
X46690000Y-28660000D02*
X46690000Y-32060000D01*
X46690000Y-27020000D02*
X46690000Y-27560000D01*
X43860000Y-34220000D02*
X43350000Y-34220000D01*
X43350000Y-33700000D02*
X43350000Y-34220000D01*
X43860000Y-33700000D02*
X43350000Y-33700000D01*
X46690000Y-33160000D02*
X46690000Y-33700000D01*
X43860000Y-26500000D02*
X43350000Y-26500000D01*
X43860000Y-27020000D02*
X43350000Y-27020000D01*
X46690000Y-33700000D02*
X46460000Y-33700000D01*
X50360000Y-26500000D02*
X46460000Y-26500000D01*
X43350000Y-26500000D02*
X43350000Y-27020000D01*
X50360000Y-34220000D02*
X46460000Y-34220000D01*
X50360000Y-26500000D02*
X50360000Y-34220000D01*
X46690000Y-27020000D02*
X46460000Y-27020000D01*
%TO.C,D1*%
X17030000Y-103885000D02*
X20970000Y-103885000D01*
X17030000Y-103645000D02*
X20970000Y-103645000D01*
X17030000Y-103765000D02*
X20970000Y-103765000D01*
X19000000Y-95940000D02*
X19000000Y-96080000D01*
X19000000Y-105360000D02*
X19000000Y-105220000D01*
X17030000Y-96080000D02*
X17030000Y-105220000D01*
X20970000Y-96080000D02*
X17030000Y-96080000D01*
X20970000Y-105220000D02*
X20970000Y-96080000D01*
X17030000Y-105220000D02*
X20970000Y-105220000D01*
%TO.C,C2*%
X11820000Y-106250000D02*
G75*
G03*
X11820000Y-106250000I-2620000J0D01*
G01*
X11780000Y-106250000D02*
X6620000Y-106250000D01*
X11780000Y-106290000D02*
X6620000Y-106290000D01*
X11779000Y-106330000D02*
X6621000Y-106330000D01*
X11778000Y-106370000D02*
X6622000Y-106370000D01*
X11776000Y-106410000D02*
X6624000Y-106410000D01*
X11773000Y-106450000D02*
X6627000Y-106450000D01*
X11769000Y-106490000D02*
X10240000Y-106490000D01*
X8160000Y-106490000D02*
X6631000Y-106490000D01*
X11765000Y-106530000D02*
X10240000Y-106530000D01*
X8160000Y-106530000D02*
X6635000Y-106530000D01*
X11761000Y-106570000D02*
X10240000Y-106570000D01*
X8160000Y-106570000D02*
X6639000Y-106570000D01*
X11756000Y-106610000D02*
X10240000Y-106610000D01*
X8160000Y-106610000D02*
X6644000Y-106610000D01*
X11750000Y-106650000D02*
X10240000Y-106650000D01*
X8160000Y-106650000D02*
X6650000Y-106650000D01*
X11743000Y-106690000D02*
X10240000Y-106690000D01*
X8160000Y-106690000D02*
X6657000Y-106690000D01*
X11736000Y-106730000D02*
X10240000Y-106730000D01*
X8160000Y-106730000D02*
X6664000Y-106730000D01*
X11728000Y-106770000D02*
X10240000Y-106770000D01*
X8160000Y-106770000D02*
X6672000Y-106770000D01*
X11720000Y-106810000D02*
X10240000Y-106810000D01*
X8160000Y-106810000D02*
X6680000Y-106810000D01*
X11711000Y-106850000D02*
X10240000Y-106850000D01*
X8160000Y-106850000D02*
X6689000Y-106850000D01*
X11701000Y-106890000D02*
X10240000Y-106890000D01*
X8160000Y-106890000D02*
X6699000Y-106890000D01*
X11691000Y-106930000D02*
X10240000Y-106930000D01*
X8160000Y-106930000D02*
X6709000Y-106930000D01*
X11680000Y-106971000D02*
X10240000Y-106971000D01*
X8160000Y-106971000D02*
X6720000Y-106971000D01*
X11668000Y-107011000D02*
X10240000Y-107011000D01*
X8160000Y-107011000D02*
X6732000Y-107011000D01*
X11655000Y-107051000D02*
X10240000Y-107051000D01*
X8160000Y-107051000D02*
X6745000Y-107051000D01*
X11642000Y-107091000D02*
X10240000Y-107091000D01*
X8160000Y-107091000D02*
X6758000Y-107091000D01*
X11628000Y-107131000D02*
X10240000Y-107131000D01*
X8160000Y-107131000D02*
X6772000Y-107131000D01*
X11614000Y-107171000D02*
X10240000Y-107171000D01*
X8160000Y-107171000D02*
X6786000Y-107171000D01*
X11598000Y-107211000D02*
X10240000Y-107211000D01*
X8160000Y-107211000D02*
X6802000Y-107211000D01*
X11582000Y-107251000D02*
X10240000Y-107251000D01*
X8160000Y-107251000D02*
X6818000Y-107251000D01*
X11565000Y-107291000D02*
X10240000Y-107291000D01*
X8160000Y-107291000D02*
X6835000Y-107291000D01*
X11548000Y-107331000D02*
X10240000Y-107331000D01*
X8160000Y-107331000D02*
X6852000Y-107331000D01*
X11529000Y-107371000D02*
X10240000Y-107371000D01*
X8160000Y-107371000D02*
X6871000Y-107371000D01*
X11510000Y-107411000D02*
X10240000Y-107411000D01*
X8160000Y-107411000D02*
X6890000Y-107411000D01*
X11490000Y-107451000D02*
X10240000Y-107451000D01*
X8160000Y-107451000D02*
X6910000Y-107451000D01*
X11468000Y-107491000D02*
X10240000Y-107491000D01*
X8160000Y-107491000D02*
X6932000Y-107491000D01*
X11447000Y-107531000D02*
X10240000Y-107531000D01*
X8160000Y-107531000D02*
X6953000Y-107531000D01*
X11424000Y-107571000D02*
X10240000Y-107571000D01*
X8160000Y-107571000D02*
X6976000Y-107571000D01*
X11400000Y-107611000D02*
X10240000Y-107611000D01*
X8160000Y-107611000D02*
X7000000Y-107611000D01*
X11375000Y-107651000D02*
X10240000Y-107651000D01*
X8160000Y-107651000D02*
X7025000Y-107651000D01*
X11349000Y-107691000D02*
X10240000Y-107691000D01*
X8160000Y-107691000D02*
X7051000Y-107691000D01*
X11322000Y-107731000D02*
X10240000Y-107731000D01*
X8160000Y-107731000D02*
X7078000Y-107731000D01*
X11295000Y-107771000D02*
X10240000Y-107771000D01*
X8160000Y-107771000D02*
X7105000Y-107771000D01*
X11265000Y-107811000D02*
X10240000Y-107811000D01*
X8160000Y-107811000D02*
X7135000Y-107811000D01*
X11235000Y-107851000D02*
X10240000Y-107851000D01*
X8160000Y-107851000D02*
X7165000Y-107851000D01*
X11204000Y-107891000D02*
X10240000Y-107891000D01*
X8160000Y-107891000D02*
X7196000Y-107891000D01*
X11171000Y-107931000D02*
X10240000Y-107931000D01*
X8160000Y-107931000D02*
X7229000Y-107931000D01*
X11137000Y-107971000D02*
X10240000Y-107971000D01*
X8160000Y-107971000D02*
X7263000Y-107971000D01*
X11101000Y-108011000D02*
X10240000Y-108011000D01*
X8160000Y-108011000D02*
X7299000Y-108011000D01*
X11064000Y-108051000D02*
X10240000Y-108051000D01*
X8160000Y-108051000D02*
X7336000Y-108051000D01*
X11026000Y-108091000D02*
X10240000Y-108091000D01*
X8160000Y-108091000D02*
X7374000Y-108091000D01*
X10985000Y-108131000D02*
X10240000Y-108131000D01*
X8160000Y-108131000D02*
X7415000Y-108131000D01*
X10943000Y-108171000D02*
X10240000Y-108171000D01*
X8160000Y-108171000D02*
X7457000Y-108171000D01*
X10899000Y-108211000D02*
X10240000Y-108211000D01*
X8160000Y-108211000D02*
X7501000Y-108211000D01*
X10853000Y-108251000D02*
X10240000Y-108251000D01*
X8160000Y-108251000D02*
X7547000Y-108251000D01*
X10805000Y-108291000D02*
X10240000Y-108291000D01*
X8160000Y-108291000D02*
X7595000Y-108291000D01*
X10754000Y-108331000D02*
X10240000Y-108331000D01*
X8160000Y-108331000D02*
X7646000Y-108331000D01*
X10700000Y-108371000D02*
X10240000Y-108371000D01*
X8160000Y-108371000D02*
X7700000Y-108371000D01*
X10643000Y-108411000D02*
X10240000Y-108411000D01*
X8160000Y-108411000D02*
X7757000Y-108411000D01*
X10583000Y-108451000D02*
X10240000Y-108451000D01*
X8160000Y-108451000D02*
X7817000Y-108451000D01*
X10519000Y-108491000D02*
X10240000Y-108491000D01*
X8160000Y-108491000D02*
X7881000Y-108491000D01*
X10451000Y-108531000D02*
X10240000Y-108531000D01*
X8160000Y-108531000D02*
X7949000Y-108531000D01*
X10378000Y-108571000D02*
X8022000Y-108571000D01*
X10298000Y-108611000D02*
X8102000Y-108611000D01*
X10211000Y-108651000D02*
X8189000Y-108651000D01*
X10115000Y-108691000D02*
X8285000Y-108691000D01*
X10005000Y-108731000D02*
X8395000Y-108731000D01*
X9877000Y-108771000D02*
X8523000Y-108771000D01*
X9718000Y-108811000D02*
X8682000Y-108811000D01*
X9484000Y-108851000D02*
X8916000Y-108851000D01*
X10675000Y-103445225D02*
X10675000Y-103945225D01*
X10925000Y-103695225D02*
X10425000Y-103695225D01*
%TO.C,C1*%
X15625000Y-100495225D02*
X15125000Y-100495225D01*
X15375000Y-100245225D02*
X15375000Y-100745225D01*
X14184000Y-105651000D02*
X13616000Y-105651000D01*
X14418000Y-105611000D02*
X13382000Y-105611000D01*
X14577000Y-105571000D02*
X13223000Y-105571000D01*
X14705000Y-105531000D02*
X13095000Y-105531000D01*
X14815000Y-105491000D02*
X12985000Y-105491000D01*
X14911000Y-105451000D02*
X12889000Y-105451000D01*
X14998000Y-105411000D02*
X12802000Y-105411000D01*
X15078000Y-105371000D02*
X12722000Y-105371000D01*
X12860000Y-105331000D02*
X12649000Y-105331000D01*
X15151000Y-105331000D02*
X14940000Y-105331000D01*
X12860000Y-105291000D02*
X12581000Y-105291000D01*
X15219000Y-105291000D02*
X14940000Y-105291000D01*
X12860000Y-105251000D02*
X12517000Y-105251000D01*
X15283000Y-105251000D02*
X14940000Y-105251000D01*
X12860000Y-105211000D02*
X12457000Y-105211000D01*
X15343000Y-105211000D02*
X14940000Y-105211000D01*
X12860000Y-105171000D02*
X12400000Y-105171000D01*
X15400000Y-105171000D02*
X14940000Y-105171000D01*
X12860000Y-105131000D02*
X12346000Y-105131000D01*
X15454000Y-105131000D02*
X14940000Y-105131000D01*
X12860000Y-105091000D02*
X12295000Y-105091000D01*
X15505000Y-105091000D02*
X14940000Y-105091000D01*
X12860000Y-105051000D02*
X12247000Y-105051000D01*
X15553000Y-105051000D02*
X14940000Y-105051000D01*
X12860000Y-105011000D02*
X12201000Y-105011000D01*
X15599000Y-105011000D02*
X14940000Y-105011000D01*
X12860000Y-104971000D02*
X12157000Y-104971000D01*
X15643000Y-104971000D02*
X14940000Y-104971000D01*
X12860000Y-104931000D02*
X12115000Y-104931000D01*
X15685000Y-104931000D02*
X14940000Y-104931000D01*
X12860000Y-104891000D02*
X12074000Y-104891000D01*
X15726000Y-104891000D02*
X14940000Y-104891000D01*
X12860000Y-104851000D02*
X12036000Y-104851000D01*
X15764000Y-104851000D02*
X14940000Y-104851000D01*
X12860000Y-104811000D02*
X11999000Y-104811000D01*
X15801000Y-104811000D02*
X14940000Y-104811000D01*
X12860000Y-104771000D02*
X11963000Y-104771000D01*
X15837000Y-104771000D02*
X14940000Y-104771000D01*
X12860000Y-104731000D02*
X11929000Y-104731000D01*
X15871000Y-104731000D02*
X14940000Y-104731000D01*
X12860000Y-104691000D02*
X11896000Y-104691000D01*
X15904000Y-104691000D02*
X14940000Y-104691000D01*
X12860000Y-104651000D02*
X11865000Y-104651000D01*
X15935000Y-104651000D02*
X14940000Y-104651000D01*
X12860000Y-104611000D02*
X11835000Y-104611000D01*
X15965000Y-104611000D02*
X14940000Y-104611000D01*
X12860000Y-104571000D02*
X11805000Y-104571000D01*
X15995000Y-104571000D02*
X14940000Y-104571000D01*
X12860000Y-104531000D02*
X11778000Y-104531000D01*
X16022000Y-104531000D02*
X14940000Y-104531000D01*
X12860000Y-104491000D02*
X11751000Y-104491000D01*
X16049000Y-104491000D02*
X14940000Y-104491000D01*
X12860000Y-104451000D02*
X11725000Y-104451000D01*
X16075000Y-104451000D02*
X14940000Y-104451000D01*
X12860000Y-104411000D02*
X11700000Y-104411000D01*
X16100000Y-104411000D02*
X14940000Y-104411000D01*
X12860000Y-104371000D02*
X11676000Y-104371000D01*
X16124000Y-104371000D02*
X14940000Y-104371000D01*
X12860000Y-104331000D02*
X11653000Y-104331000D01*
X16147000Y-104331000D02*
X14940000Y-104331000D01*
X12860000Y-104291000D02*
X11632000Y-104291000D01*
X16168000Y-104291000D02*
X14940000Y-104291000D01*
X12860000Y-104251000D02*
X11610000Y-104251000D01*
X16190000Y-104251000D02*
X14940000Y-104251000D01*
X12860000Y-104211000D02*
X11590000Y-104211000D01*
X16210000Y-104211000D02*
X14940000Y-104211000D01*
X12860000Y-104171000D02*
X11571000Y-104171000D01*
X16229000Y-104171000D02*
X14940000Y-104171000D01*
X12860000Y-104131000D02*
X11552000Y-104131000D01*
X16248000Y-104131000D02*
X14940000Y-104131000D01*
X12860000Y-104091000D02*
X11535000Y-104091000D01*
X16265000Y-104091000D02*
X14940000Y-104091000D01*
X12860000Y-104051000D02*
X11518000Y-104051000D01*
X16282000Y-104051000D02*
X14940000Y-104051000D01*
X12860000Y-104011000D02*
X11502000Y-104011000D01*
X16298000Y-104011000D02*
X14940000Y-104011000D01*
X12860000Y-103971000D02*
X11486000Y-103971000D01*
X16314000Y-103971000D02*
X14940000Y-103971000D01*
X12860000Y-103931000D02*
X11472000Y-103931000D01*
X16328000Y-103931000D02*
X14940000Y-103931000D01*
X12860000Y-103891000D02*
X11458000Y-103891000D01*
X16342000Y-103891000D02*
X14940000Y-103891000D01*
X12860000Y-103851000D02*
X11445000Y-103851000D01*
X16355000Y-103851000D02*
X14940000Y-103851000D01*
X12860000Y-103811000D02*
X11432000Y-103811000D01*
X16368000Y-103811000D02*
X14940000Y-103811000D01*
X12860000Y-103771000D02*
X11420000Y-103771000D01*
X16380000Y-103771000D02*
X14940000Y-103771000D01*
X12860000Y-103730000D02*
X11409000Y-103730000D01*
X16391000Y-103730000D02*
X14940000Y-103730000D01*
X12860000Y-103690000D02*
X11399000Y-103690000D01*
X16401000Y-103690000D02*
X14940000Y-103690000D01*
X12860000Y-103650000D02*
X11389000Y-103650000D01*
X16411000Y-103650000D02*
X14940000Y-103650000D01*
X12860000Y-103610000D02*
X11380000Y-103610000D01*
X16420000Y-103610000D02*
X14940000Y-103610000D01*
X12860000Y-103570000D02*
X11372000Y-103570000D01*
X16428000Y-103570000D02*
X14940000Y-103570000D01*
X12860000Y-103530000D02*
X11364000Y-103530000D01*
X16436000Y-103530000D02*
X14940000Y-103530000D01*
X12860000Y-103490000D02*
X11357000Y-103490000D01*
X16443000Y-103490000D02*
X14940000Y-103490000D01*
X12860000Y-103450000D02*
X11350000Y-103450000D01*
X16450000Y-103450000D02*
X14940000Y-103450000D01*
X12860000Y-103410000D02*
X11344000Y-103410000D01*
X16456000Y-103410000D02*
X14940000Y-103410000D01*
X12860000Y-103370000D02*
X11339000Y-103370000D01*
X16461000Y-103370000D02*
X14940000Y-103370000D01*
X12860000Y-103330000D02*
X11335000Y-103330000D01*
X16465000Y-103330000D02*
X14940000Y-103330000D01*
X12860000Y-103290000D02*
X11331000Y-103290000D01*
X16469000Y-103290000D02*
X14940000Y-103290000D01*
X16473000Y-103250000D02*
X11327000Y-103250000D01*
X16476000Y-103210000D02*
X11324000Y-103210000D01*
X16478000Y-103170000D02*
X11322000Y-103170000D01*
X16479000Y-103130000D02*
X11321000Y-103130000D01*
X16480000Y-103090000D02*
X11320000Y-103090000D01*
X16480000Y-103050000D02*
X11320000Y-103050000D01*
X16520000Y-103050000D02*
G75*
G03*
X16520000Y-103050000I-2620000J0D01*
G01*
%TO.C,J9*%
X7777000Y-93479000D02*
X7777000Y-96139000D01*
X7777000Y-93479000D02*
X2637000Y-93479000D01*
X2637000Y-93479000D02*
X2637000Y-96139000D01*
X7777000Y-96139000D02*
X2637000Y-96139000D01*
X10377000Y-96139000D02*
X9047000Y-96139000D01*
X10377000Y-94809000D02*
X10377000Y-96139000D01*
%TO.C,R5*%
X22090000Y-62640000D02*
X25530000Y-62640000D01*
X25530000Y-62640000D02*
X25530000Y-53400000D01*
X25530000Y-53400000D02*
X22090000Y-53400000D01*
X22090000Y-53400000D02*
X22090000Y-62640000D01*
X23810000Y-63330000D02*
X23810000Y-62640000D01*
X23810000Y-52710000D02*
X23810000Y-53400000D01*
%TO.C,J10*%
X21308000Y-93842000D02*
X23908000Y-93842000D01*
X21308000Y-108542000D02*
X21308000Y-93842000D01*
X30508000Y-93842000D02*
X30508000Y-95742000D01*
X27808000Y-93842000D02*
X30508000Y-93842000D01*
X30508000Y-108542000D02*
X21308000Y-108542000D01*
X30508000Y-99742000D02*
X30508000Y-108542000D01*
X21108000Y-94692000D02*
X21108000Y-93642000D01*
X22158000Y-93642000D02*
X21108000Y-93642000D01*
%TO.C,R3*%
X18030000Y-53400000D02*
X14590000Y-53400000D01*
X14590000Y-53400000D02*
X14590000Y-62640000D01*
X14590000Y-62640000D02*
X18030000Y-62640000D01*
X18030000Y-62640000D02*
X18030000Y-53400000D01*
X16310000Y-52710000D02*
X16310000Y-53400000D01*
X16310000Y-63330000D02*
X16310000Y-62640000D01*
%TO.C,R2*%
X14180000Y-53400000D02*
X10740000Y-53400000D01*
X10740000Y-53400000D02*
X10740000Y-62640000D01*
X10740000Y-62640000D02*
X14180000Y-62640000D01*
X14180000Y-62640000D02*
X14180000Y-53400000D01*
X12460000Y-52710000D02*
X12460000Y-53400000D01*
X12460000Y-63330000D02*
X12460000Y-62640000D01*
%TO.C,R4*%
X18320000Y-62640000D02*
X21760000Y-62640000D01*
X21760000Y-62640000D02*
X21760000Y-53400000D01*
X21760000Y-53400000D02*
X18320000Y-53400000D01*
X18320000Y-53400000D02*
X18320000Y-62640000D01*
X20040000Y-63330000D02*
X20040000Y-62640000D01*
X20040000Y-52710000D02*
X20040000Y-53400000D01*
%TO.C,J2*%
D10*
X8452380Y-12333333D02*
X9166666Y-12333333D01*
X9309523Y-12380952D01*
X9404761Y-12476190D01*
X9452380Y-12619047D01*
X9452380Y-12714285D01*
X8547619Y-11904761D02*
X8500000Y-11857142D01*
X8452380Y-11761904D01*
X8452380Y-11523809D01*
X8500000Y-11428571D01*
X8547619Y-11380952D01*
X8642857Y-11333333D01*
X8738095Y-11333333D01*
X8880952Y-11380952D01*
X9452380Y-11952380D01*
X9452380Y-11333333D01*
%TO.C,J7*%
X19466666Y-43252380D02*
X19466666Y-43966666D01*
X19419047Y-44109523D01*
X19323809Y-44204761D01*
X19180952Y-44252380D01*
X19085714Y-44252380D01*
X19847619Y-43252380D02*
X20514285Y-43252380D01*
X20085714Y-44252380D01*
%TO.C,J4*%
X44242380Y-13493333D02*
X44956666Y-13493333D01*
X45099523Y-13540952D01*
X45194761Y-13636190D01*
X45242380Y-13779047D01*
X45242380Y-13874285D01*
X44575714Y-12588571D02*
X45242380Y-12588571D01*
X44194761Y-12826666D02*
X44909047Y-13064761D01*
X44909047Y-12445714D01*
%TO.C,J11*%
X37600476Y-93962380D02*
X37600476Y-94676666D01*
X37552857Y-94819523D01*
X37457619Y-94914761D01*
X37314761Y-94962380D01*
X37219523Y-94962380D01*
X38600476Y-94962380D02*
X38029047Y-94962380D01*
X38314761Y-94962380D02*
X38314761Y-93962380D01*
X38219523Y-94105238D01*
X38124285Y-94200476D01*
X38029047Y-94248095D01*
X39552857Y-94962380D02*
X38981428Y-94962380D01*
X39267142Y-94962380D02*
X39267142Y-93962380D01*
X39171904Y-94105238D01*
X39076666Y-94200476D01*
X38981428Y-94248095D01*
%TO.C,J8*%
X47852380Y-20153333D02*
X48566666Y-20153333D01*
X48709523Y-20200952D01*
X48804761Y-20296190D01*
X48852380Y-20439047D01*
X48852380Y-20534285D01*
X48280952Y-19534285D02*
X48233333Y-19629523D01*
X48185714Y-19677142D01*
X48090476Y-19724761D01*
X48042857Y-19724761D01*
X47947619Y-19677142D01*
X47900000Y-19629523D01*
X47852380Y-19534285D01*
X47852380Y-19343809D01*
X47900000Y-19248571D01*
X47947619Y-19200952D01*
X48042857Y-19153333D01*
X48090476Y-19153333D01*
X48185714Y-19200952D01*
X48233333Y-19248571D01*
X48280952Y-19343809D01*
X48280952Y-19534285D01*
X48328571Y-19629523D01*
X48376190Y-19677142D01*
X48471428Y-19724761D01*
X48661904Y-19724761D01*
X48757142Y-19677142D01*
X48804761Y-19629523D01*
X48852380Y-19534285D01*
X48852380Y-19343809D01*
X48804761Y-19248571D01*
X48757142Y-19200952D01*
X48661904Y-19153333D01*
X48471428Y-19153333D01*
X48376190Y-19200952D01*
X48328571Y-19248571D01*
X48280952Y-19343809D01*
%TO.C,J3*%
X3326666Y-38572380D02*
X3326666Y-39286666D01*
X3279047Y-39429523D01*
X3183809Y-39524761D01*
X3040952Y-39572380D01*
X2945714Y-39572380D01*
X3707619Y-38572380D02*
X4326666Y-38572380D01*
X3993333Y-38953333D01*
X4136190Y-38953333D01*
X4231428Y-39000952D01*
X4279047Y-39048571D01*
X4326666Y-39143809D01*
X4326666Y-39381904D01*
X4279047Y-39477142D01*
X4231428Y-39524761D01*
X4136190Y-39572380D01*
X3850476Y-39572380D01*
X3755238Y-39524761D01*
X3707619Y-39477142D01*
%TO.C,J6*%
X42972380Y-16433333D02*
X43686666Y-16433333D01*
X43829523Y-16480952D01*
X43924761Y-16576190D01*
X43972380Y-16719047D01*
X43972380Y-16814285D01*
X42972380Y-15528571D02*
X42972380Y-15719047D01*
X43020000Y-15814285D01*
X43067619Y-15861904D01*
X43210476Y-15957142D01*
X43400952Y-16004761D01*
X43781904Y-16004761D01*
X43877142Y-15957142D01*
X43924761Y-15909523D01*
X43972380Y-15814285D01*
X43972380Y-15623809D01*
X43924761Y-15528571D01*
X43877142Y-15480952D01*
X43781904Y-15433333D01*
X43543809Y-15433333D01*
X43448571Y-15480952D01*
X43400952Y-15528571D01*
X43353333Y-15623809D01*
X43353333Y-15814285D01*
X43400952Y-15909523D01*
X43448571Y-15957142D01*
X43543809Y-16004761D01*
%TO.C,Q1*%
X43444761Y-51137619D02*
X43349523Y-51090000D01*
X43254285Y-50994761D01*
X43111428Y-50851904D01*
X43016190Y-50804285D01*
X42920952Y-50804285D01*
X42968571Y-51042380D02*
X42873333Y-50994761D01*
X42778095Y-50899523D01*
X42730476Y-50709047D01*
X42730476Y-50375714D01*
X42778095Y-50185238D01*
X42873333Y-50090000D01*
X42968571Y-50042380D01*
X43159047Y-50042380D01*
X43254285Y-50090000D01*
X43349523Y-50185238D01*
X43397142Y-50375714D01*
X43397142Y-50709047D01*
X43349523Y-50899523D01*
X43254285Y-50994761D01*
X43159047Y-51042380D01*
X42968571Y-51042380D01*
X44349523Y-51042380D02*
X43778095Y-51042380D01*
X44063809Y-51042380D02*
X44063809Y-50042380D01*
X43968571Y-50185238D01*
X43873333Y-50280476D01*
X43778095Y-50328095D01*
%TO.C,BZ1*%
X5339047Y-81028571D02*
X5481904Y-81076190D01*
X5529523Y-81123809D01*
X5577142Y-81219047D01*
X5577142Y-81361904D01*
X5529523Y-81457142D01*
X5481904Y-81504761D01*
X5386666Y-81552380D01*
X5005714Y-81552380D01*
X5005714Y-80552380D01*
X5339047Y-80552380D01*
X5434285Y-80600000D01*
X5481904Y-80647619D01*
X5529523Y-80742857D01*
X5529523Y-80838095D01*
X5481904Y-80933333D01*
X5434285Y-80980952D01*
X5339047Y-81028571D01*
X5005714Y-81028571D01*
X5910476Y-80552380D02*
X6577142Y-80552380D01*
X5910476Y-81552380D01*
X6577142Y-81552380D01*
X7481904Y-81552380D02*
X6910476Y-81552380D01*
X7196190Y-81552380D02*
X7196190Y-80552380D01*
X7100952Y-80695238D01*
X7005714Y-80790476D01*
X6910476Y-80838095D01*
%TO.C,J5*%
X4156666Y-14252380D02*
X4156666Y-14966666D01*
X4109047Y-15109523D01*
X4013809Y-15204761D01*
X3870952Y-15252380D01*
X3775714Y-15252380D01*
X5109047Y-14252380D02*
X4632857Y-14252380D01*
X4585238Y-14728571D01*
X4632857Y-14680952D01*
X4728095Y-14633333D01*
X4966190Y-14633333D01*
X5061428Y-14680952D01*
X5109047Y-14728571D01*
X5156666Y-14823809D01*
X5156666Y-15061904D01*
X5109047Y-15157142D01*
X5061428Y-15204761D01*
X4966190Y-15252380D01*
X4728095Y-15252380D01*
X4632857Y-15204761D01*
X4585238Y-15157142D01*
%TO.C,U2*%
X46740380Y-47735904D02*
X47549904Y-47735904D01*
X47645142Y-47688285D01*
X47692761Y-47640666D01*
X47740380Y-47545428D01*
X47740380Y-47354952D01*
X47692761Y-47259714D01*
X47645142Y-47212095D01*
X47549904Y-47164476D01*
X46740380Y-47164476D01*
X46835619Y-46735904D02*
X46788000Y-46688285D01*
X46740380Y-46593047D01*
X46740380Y-46354952D01*
X46788000Y-46259714D01*
X46835619Y-46212095D01*
X46930857Y-46164476D01*
X47026095Y-46164476D01*
X47168952Y-46212095D01*
X47740380Y-46783523D01*
X47740380Y-46164476D01*
%TO.C,U1*%
X46740380Y-71361904D02*
X47549904Y-71361904D01*
X47645142Y-71314285D01*
X47692761Y-71266666D01*
X47740380Y-71171428D01*
X47740380Y-70980952D01*
X47692761Y-70885714D01*
X47645142Y-70838095D01*
X47549904Y-70790476D01*
X46740380Y-70790476D01*
X47740380Y-69790476D02*
X47740380Y-70361904D01*
X47740380Y-70076190D02*
X46740380Y-70076190D01*
X46883238Y-70171428D01*
X46978476Y-70266666D01*
X47026095Y-70361904D01*
%TO.C,R6*%
X27383333Y-50162380D02*
X27050000Y-49686190D01*
X26811904Y-50162380D02*
X26811904Y-49162380D01*
X27192857Y-49162380D01*
X27288095Y-49210000D01*
X27335714Y-49257619D01*
X27383333Y-49352857D01*
X27383333Y-49495714D01*
X27335714Y-49590952D01*
X27288095Y-49638571D01*
X27192857Y-49686190D01*
X26811904Y-49686190D01*
X28240476Y-49162380D02*
X28050000Y-49162380D01*
X27954761Y-49210000D01*
X27907142Y-49257619D01*
X27811904Y-49400476D01*
X27764285Y-49590952D01*
X27764285Y-49971904D01*
X27811904Y-50067142D01*
X27859523Y-50114761D01*
X27954761Y-50162380D01*
X28145238Y-50162380D01*
X28240476Y-50114761D01*
X28288095Y-50067142D01*
X28335714Y-49971904D01*
X28335714Y-49733809D01*
X28288095Y-49638571D01*
X28240476Y-49590952D01*
X28145238Y-49543333D01*
X27954761Y-49543333D01*
X27859523Y-49590952D01*
X27811904Y-49638571D01*
X27764285Y-49733809D01*
%TO.C,SW3*%
X51238761Y-98813333D02*
X51286380Y-98670476D01*
X51286380Y-98432380D01*
X51238761Y-98337142D01*
X51191142Y-98289523D01*
X51095904Y-98241904D01*
X51000666Y-98241904D01*
X50905428Y-98289523D01*
X50857809Y-98337142D01*
X50810190Y-98432380D01*
X50762571Y-98622857D01*
X50714952Y-98718095D01*
X50667333Y-98765714D01*
X50572095Y-98813333D01*
X50476857Y-98813333D01*
X50381619Y-98765714D01*
X50334000Y-98718095D01*
X50286380Y-98622857D01*
X50286380Y-98384761D01*
X50334000Y-98241904D01*
X50286380Y-97908571D02*
X51286380Y-97670476D01*
X50572095Y-97480000D01*
X51286380Y-97289523D01*
X50286380Y-97051428D01*
X50286380Y-96765714D02*
X50286380Y-96146666D01*
X50667333Y-96480000D01*
X50667333Y-96337142D01*
X50714952Y-96241904D01*
X50762571Y-96194285D01*
X50857809Y-96146666D01*
X51095904Y-96146666D01*
X51191142Y-96194285D01*
X51238761Y-96241904D01*
X51286380Y-96337142D01*
X51286380Y-96622857D01*
X51238761Y-96718095D01*
X51191142Y-96765714D01*
%TO.C,R1*%
X8593333Y-50162380D02*
X8260000Y-49686190D01*
X8021904Y-50162380D02*
X8021904Y-49162380D01*
X8402857Y-49162380D01*
X8498095Y-49210000D01*
X8545714Y-49257619D01*
X8593333Y-49352857D01*
X8593333Y-49495714D01*
X8545714Y-49590952D01*
X8498095Y-49638571D01*
X8402857Y-49686190D01*
X8021904Y-49686190D01*
X9545714Y-50162380D02*
X8974285Y-50162380D01*
X9260000Y-50162380D02*
X9260000Y-49162380D01*
X9164761Y-49305238D01*
X9069523Y-49400476D01*
X8974285Y-49448095D01*
%TO.C,J1*%
X23023380Y-40684333D02*
X23737666Y-40684333D01*
X23880523Y-40731952D01*
X23975761Y-40827190D01*
X24023380Y-40970047D01*
X24023380Y-41065285D01*
X24023380Y-39684333D02*
X24023380Y-40255761D01*
X24023380Y-39970047D02*
X23023380Y-39970047D01*
X23166238Y-40065285D01*
X23261476Y-40160523D01*
X23309095Y-40255761D01*
%TO.C,SW2*%
X49634761Y-41803333D02*
X49682380Y-41660476D01*
X49682380Y-41422380D01*
X49634761Y-41327142D01*
X49587142Y-41279523D01*
X49491904Y-41231904D01*
X49396666Y-41231904D01*
X49301428Y-41279523D01*
X49253809Y-41327142D01*
X49206190Y-41422380D01*
X49158571Y-41612857D01*
X49110952Y-41708095D01*
X49063333Y-41755714D01*
X48968095Y-41803333D01*
X48872857Y-41803333D01*
X48777619Y-41755714D01*
X48730000Y-41708095D01*
X48682380Y-41612857D01*
X48682380Y-41374761D01*
X48730000Y-41231904D01*
X48682380Y-40898571D02*
X49682380Y-40660476D01*
X48968095Y-40470000D01*
X49682380Y-40279523D01*
X48682380Y-40041428D01*
X48777619Y-39708095D02*
X48730000Y-39660476D01*
X48682380Y-39565238D01*
X48682380Y-39327142D01*
X48730000Y-39231904D01*
X48777619Y-39184285D01*
X48872857Y-39136666D01*
X48968095Y-39136666D01*
X49110952Y-39184285D01*
X49682380Y-39755714D01*
X49682380Y-39136666D01*
%TO.C,SW1*%
X49784761Y-31743333D02*
X49832380Y-31600476D01*
X49832380Y-31362380D01*
X49784761Y-31267142D01*
X49737142Y-31219523D01*
X49641904Y-31171904D01*
X49546666Y-31171904D01*
X49451428Y-31219523D01*
X49403809Y-31267142D01*
X49356190Y-31362380D01*
X49308571Y-31552857D01*
X49260952Y-31648095D01*
X49213333Y-31695714D01*
X49118095Y-31743333D01*
X49022857Y-31743333D01*
X48927619Y-31695714D01*
X48880000Y-31648095D01*
X48832380Y-31552857D01*
X48832380Y-31314761D01*
X48880000Y-31171904D01*
X48832380Y-30838571D02*
X49832380Y-30600476D01*
X49118095Y-30410000D01*
X49832380Y-30219523D01*
X48832380Y-29981428D01*
X49832380Y-29076666D02*
X49832380Y-29648095D01*
X49832380Y-29362380D02*
X48832380Y-29362380D01*
X48975238Y-29457619D01*
X49070476Y-29552857D01*
X49118095Y-29648095D01*
%TO.C,D1*%
X16652380Y-97938095D02*
X15652380Y-97938095D01*
X15652380Y-97700000D01*
X15700000Y-97557142D01*
X15795238Y-97461904D01*
X15890476Y-97414285D01*
X16080952Y-97366666D01*
X16223809Y-97366666D01*
X16414285Y-97414285D01*
X16509523Y-97461904D01*
X16604761Y-97557142D01*
X16652380Y-97700000D01*
X16652380Y-97938095D01*
X16652380Y-96414285D02*
X16652380Y-96985714D01*
X16652380Y-96700000D02*
X15652380Y-96700000D01*
X15795238Y-96795238D01*
X15890476Y-96890476D01*
X15938095Y-96985714D01*
X19702380Y-103161904D02*
X18702380Y-103161904D01*
X19702380Y-102590476D02*
X19130952Y-103019047D01*
X18702380Y-102590476D02*
X19273809Y-103161904D01*
%TO.C,C2*%
X9033333Y-103157142D02*
X8985714Y-103204761D01*
X8842857Y-103252380D01*
X8747619Y-103252380D01*
X8604761Y-103204761D01*
X8509523Y-103109523D01*
X8461904Y-103014285D01*
X8414285Y-102823809D01*
X8414285Y-102680952D01*
X8461904Y-102490476D01*
X8509523Y-102395238D01*
X8604761Y-102300000D01*
X8747619Y-102252380D01*
X8842857Y-102252380D01*
X8985714Y-102300000D01*
X9033333Y-102347619D01*
X9414285Y-102347619D02*
X9461904Y-102300000D01*
X9557142Y-102252380D01*
X9795238Y-102252380D01*
X9890476Y-102300000D01*
X9938095Y-102347619D01*
X9985714Y-102442857D01*
X9985714Y-102538095D01*
X9938095Y-102680952D01*
X9366666Y-103252380D01*
X9985714Y-103252380D01*
%TO.C,C1*%
X13933333Y-106957142D02*
X13885714Y-107004761D01*
X13742857Y-107052380D01*
X13647619Y-107052380D01*
X13504761Y-107004761D01*
X13409523Y-106909523D01*
X13361904Y-106814285D01*
X13314285Y-106623809D01*
X13314285Y-106480952D01*
X13361904Y-106290476D01*
X13409523Y-106195238D01*
X13504761Y-106100000D01*
X13647619Y-106052380D01*
X13742857Y-106052380D01*
X13885714Y-106100000D01*
X13933333Y-106147619D01*
X14885714Y-107052380D02*
X14314285Y-107052380D01*
X14600000Y-107052380D02*
X14600000Y-106052380D01*
X14504761Y-106195238D01*
X14409523Y-106290476D01*
X14314285Y-106338095D01*
%TO.C,J9*%
X1312380Y-94973333D02*
X2026666Y-94973333D01*
X2169523Y-95020952D01*
X2264761Y-95116190D01*
X2312380Y-95259047D01*
X2312380Y-95354285D01*
X2312380Y-94449523D02*
X2312380Y-94259047D01*
X2264761Y-94163809D01*
X2217142Y-94116190D01*
X2074285Y-94020952D01*
X1883809Y-93973333D01*
X1502857Y-93973333D01*
X1407619Y-94020952D01*
X1360000Y-94068571D01*
X1312380Y-94163809D01*
X1312380Y-94354285D01*
X1360000Y-94449523D01*
X1407619Y-94497142D01*
X1502857Y-94544761D01*
X1740952Y-94544761D01*
X1836190Y-94497142D01*
X1883809Y-94449523D01*
X1931428Y-94354285D01*
X1931428Y-94163809D01*
X1883809Y-94068571D01*
X1836190Y-94020952D01*
X1740952Y-93973333D01*
%TO.C,R5*%
X23703333Y-50162380D02*
X23370000Y-49686190D01*
X23131904Y-50162380D02*
X23131904Y-49162380D01*
X23512857Y-49162380D01*
X23608095Y-49210000D01*
X23655714Y-49257619D01*
X23703333Y-49352857D01*
X23703333Y-49495714D01*
X23655714Y-49590952D01*
X23608095Y-49638571D01*
X23512857Y-49686190D01*
X23131904Y-49686190D01*
X24608095Y-49162380D02*
X24131904Y-49162380D01*
X24084285Y-49638571D01*
X24131904Y-49590952D01*
X24227142Y-49543333D01*
X24465238Y-49543333D01*
X24560476Y-49590952D01*
X24608095Y-49638571D01*
X24655714Y-49733809D01*
X24655714Y-49971904D01*
X24608095Y-50067142D01*
X24560476Y-50114761D01*
X24465238Y-50162380D01*
X24227142Y-50162380D01*
X24131904Y-50114761D01*
X24084285Y-50067142D01*
%TO.C,J10*%
X30782380Y-107279523D02*
X31496666Y-107279523D01*
X31639523Y-107327142D01*
X31734761Y-107422380D01*
X31782380Y-107565238D01*
X31782380Y-107660476D01*
X31782380Y-106279523D02*
X31782380Y-106850952D01*
X31782380Y-106565238D02*
X30782380Y-106565238D01*
X30925238Y-106660476D01*
X31020476Y-106755714D01*
X31068095Y-106850952D01*
X30782380Y-105660476D02*
X30782380Y-105565238D01*
X30830000Y-105470000D01*
X30877619Y-105422380D01*
X30972857Y-105374761D01*
X31163333Y-105327142D01*
X31401428Y-105327142D01*
X31591904Y-105374761D01*
X31687142Y-105422380D01*
X31734761Y-105470000D01*
X31782380Y-105565238D01*
X31782380Y-105660476D01*
X31734761Y-105755714D01*
X31687142Y-105803333D01*
X31591904Y-105850952D01*
X31401428Y-105898571D01*
X31163333Y-105898571D01*
X30972857Y-105850952D01*
X30877619Y-105803333D01*
X30830000Y-105755714D01*
X30782380Y-105660476D01*
%TO.C,R3*%
X16123333Y-50162380D02*
X15790000Y-49686190D01*
X15551904Y-50162380D02*
X15551904Y-49162380D01*
X15932857Y-49162380D01*
X16028095Y-49210000D01*
X16075714Y-49257619D01*
X16123333Y-49352857D01*
X16123333Y-49495714D01*
X16075714Y-49590952D01*
X16028095Y-49638571D01*
X15932857Y-49686190D01*
X15551904Y-49686190D01*
X16456666Y-49162380D02*
X17075714Y-49162380D01*
X16742380Y-49543333D01*
X16885238Y-49543333D01*
X16980476Y-49590952D01*
X17028095Y-49638571D01*
X17075714Y-49733809D01*
X17075714Y-49971904D01*
X17028095Y-50067142D01*
X16980476Y-50114761D01*
X16885238Y-50162380D01*
X16599523Y-50162380D01*
X16504285Y-50114761D01*
X16456666Y-50067142D01*
%TO.C,R2*%
X12283333Y-50162380D02*
X11950000Y-49686190D01*
X11711904Y-50162380D02*
X11711904Y-49162380D01*
X12092857Y-49162380D01*
X12188095Y-49210000D01*
X12235714Y-49257619D01*
X12283333Y-49352857D01*
X12283333Y-49495714D01*
X12235714Y-49590952D01*
X12188095Y-49638571D01*
X12092857Y-49686190D01*
X11711904Y-49686190D01*
X12664285Y-49257619D02*
X12711904Y-49210000D01*
X12807142Y-49162380D01*
X13045238Y-49162380D01*
X13140476Y-49210000D01*
X13188095Y-49257619D01*
X13235714Y-49352857D01*
X13235714Y-49448095D01*
X13188095Y-49590952D01*
X12616666Y-50162380D01*
X13235714Y-50162380D01*
%TO.C,R4*%
X19953333Y-50162380D02*
X19620000Y-49686190D01*
X19381904Y-50162380D02*
X19381904Y-49162380D01*
X19762857Y-49162380D01*
X19858095Y-49210000D01*
X19905714Y-49257619D01*
X19953333Y-49352857D01*
X19953333Y-49495714D01*
X19905714Y-49590952D01*
X19858095Y-49638571D01*
X19762857Y-49686190D01*
X19381904Y-49686190D01*
X20810476Y-49495714D02*
X20810476Y-50162380D01*
X20572380Y-49114761D02*
X20334285Y-49829047D01*
X20953333Y-49829047D01*
%TD*%
M02*
