%TF.GenerationSoftware,KiCad,Pcbnew,5.1.6-c6e7f7d~87~ubuntu18.04.1*%
%TF.CreationDate,2021-09-22T20:52:25-04:00*%
%TF.ProjectId,remote,72656d6f-7465-42e6-9b69-6361645f7063,rev?*%
%TF.SameCoordinates,Original*%
%TF.FileFunction,Legend,Top*%
%TF.FilePolarity,Positive*%
%FSLAX46Y46*%
G04 Gerber Fmt 4.6, Leading zero omitted, Abs format (unit mm)*
G04 Created by KiCad (PCBNEW 5.1.6-c6e7f7d~87~ubuntu18.04.1) date 2021-09-22 20:52:25*
%MOMM*%
%LPD*%
G01*
G04 APERTURE LIST*
%ADD10C,0.150000*%
%ADD11C,0.100000*%
%ADD12C,0.300000*%
%ADD13C,0.120000*%
G04 APERTURE END LIST*
D10*
X6702857Y-75500000D02*
X6588571Y-75442857D01*
X6417143Y-75442857D01*
X6245714Y-75500000D01*
X6131428Y-75614285D01*
X6074285Y-75728571D01*
X6017143Y-75957142D01*
X6017143Y-76128571D01*
X6074285Y-76357142D01*
X6131428Y-76471428D01*
X6245714Y-76585714D01*
X6417143Y-76642857D01*
X6531428Y-76642857D01*
X6702857Y-76585714D01*
X6760000Y-76528571D01*
X6760000Y-76128571D01*
X6531428Y-76128571D01*
X7274285Y-76642857D02*
X7274285Y-75442857D01*
X7960000Y-76642857D01*
X7960000Y-75442857D01*
X8531428Y-76642857D02*
X8531428Y-75442857D01*
X8817143Y-75442857D01*
X8988571Y-75500000D01*
X9102857Y-75614285D01*
X9160000Y-75728571D01*
X9217143Y-75957142D01*
X9217143Y-76128571D01*
X9160000Y-76357142D01*
X9102857Y-76471428D01*
X8988571Y-76585714D01*
X8817143Y-76642857D01*
X8531428Y-76642857D01*
X5902857Y-72882857D02*
X6302857Y-74082857D01*
X6702857Y-72882857D01*
X7502857Y-73454285D02*
X7674286Y-73511428D01*
X7731428Y-73568571D01*
X7788571Y-73682857D01*
X7788571Y-73854285D01*
X7731428Y-73968571D01*
X7674286Y-74025714D01*
X7560000Y-74082857D01*
X7102857Y-74082857D01*
X7102857Y-72882857D01*
X7502857Y-72882857D01*
X7617143Y-72940000D01*
X7674286Y-72997142D01*
X7731428Y-73111428D01*
X7731428Y-73225714D01*
X7674286Y-73340000D01*
X7617143Y-73397142D01*
X7502857Y-73454285D01*
X7102857Y-73454285D01*
X8245714Y-73740000D02*
X8817143Y-73740000D01*
X8131428Y-74082857D02*
X8531428Y-72882857D01*
X8931428Y-74082857D01*
X9160000Y-72882857D02*
X9845714Y-72882857D01*
X9502857Y-74082857D02*
X9502857Y-72882857D01*
X5893333Y-70407619D02*
X6260000Y-71507619D01*
X6626666Y-70407619D01*
X7360000Y-70931428D02*
X7517142Y-70983809D01*
X7569523Y-71036190D01*
X7621904Y-71140952D01*
X7621904Y-71298095D01*
X7569523Y-71402857D01*
X7517142Y-71455238D01*
X7412380Y-71507619D01*
X6993333Y-71507619D01*
X6993333Y-70407619D01*
X7360000Y-70407619D01*
X7464761Y-70460000D01*
X7517142Y-70512380D01*
X7569523Y-70617142D01*
X7569523Y-70721904D01*
X7517142Y-70826666D01*
X7464761Y-70879047D01*
X7360000Y-70931428D01*
X6993333Y-70931428D01*
X8040952Y-71193333D02*
X8564761Y-71193333D01*
X7936190Y-71507619D02*
X8302857Y-70407619D01*
X8669523Y-71507619D01*
X8879047Y-70407619D02*
X9507619Y-70407619D01*
X9193333Y-71507619D02*
X9193333Y-70407619D01*
X9612380Y-71612380D02*
X10450476Y-71612380D01*
X10712380Y-70931428D02*
X11079047Y-70931428D01*
X11236190Y-71507619D02*
X10712380Y-71507619D01*
X10712380Y-70407619D01*
X11236190Y-70407619D01*
X11602857Y-70407619D02*
X12336190Y-71507619D01*
X12336190Y-70407619D02*
X11602857Y-71507619D01*
X12598095Y-70407619D02*
X13226666Y-70407619D01*
X12912380Y-71507619D02*
X12912380Y-70407619D01*
X34825714Y-32367142D02*
X34882857Y-32195714D01*
X34882857Y-31910000D01*
X34825714Y-31795714D01*
X34768571Y-31738571D01*
X34654285Y-31681428D01*
X34540000Y-31681428D01*
X34425714Y-31738571D01*
X34368571Y-31795714D01*
X34311428Y-31910000D01*
X34254285Y-32138571D01*
X34197142Y-32252857D01*
X34140000Y-32310000D01*
X34025714Y-32367142D01*
X33911428Y-32367142D01*
X33797142Y-32310000D01*
X33740000Y-32252857D01*
X33682857Y-32138571D01*
X33682857Y-31852857D01*
X33740000Y-31681428D01*
X34882857Y-31167142D02*
X33682857Y-31167142D01*
X33682857Y-30881428D01*
X33740000Y-30710000D01*
X33854285Y-30595714D01*
X33968571Y-30538571D01*
X34197142Y-30481428D01*
X34368571Y-30481428D01*
X34597142Y-30538571D01*
X34711428Y-30595714D01*
X34825714Y-30710000D01*
X34882857Y-30881428D01*
X34882857Y-31167142D01*
X34540000Y-30024285D02*
X34540000Y-29452857D01*
X34882857Y-30138571D02*
X33682857Y-29738571D01*
X34882857Y-29338571D01*
X37415714Y-32367142D02*
X37472857Y-32195713D01*
X37472857Y-31909999D01*
X37415714Y-31795713D01*
X37358571Y-31738571D01*
X37244285Y-31681428D01*
X37130000Y-31681428D01*
X37015714Y-31738571D01*
X36958571Y-31795713D01*
X36901428Y-31909999D01*
X36844285Y-32138571D01*
X36787142Y-32252856D01*
X36730000Y-32309999D01*
X36615714Y-32367142D01*
X36501428Y-32367142D01*
X36387142Y-32309999D01*
X36330000Y-32252856D01*
X36272857Y-32138571D01*
X36272857Y-31852856D01*
X36330000Y-31681428D01*
X37358571Y-30481428D02*
X37415714Y-30538571D01*
X37472857Y-30709999D01*
X37472857Y-30824285D01*
X37415714Y-30995713D01*
X37301428Y-31109999D01*
X37187142Y-31167142D01*
X36958571Y-31224285D01*
X36787142Y-31224285D01*
X36558571Y-31167142D01*
X36444285Y-31109999D01*
X36330000Y-30995713D01*
X36272857Y-30824285D01*
X36272857Y-30709999D01*
X36330000Y-30538571D01*
X36387142Y-30481428D01*
X37472857Y-29395713D02*
X37472857Y-29967142D01*
X36272857Y-29967142D01*
X38850000Y-31681428D02*
X38792857Y-31795714D01*
X38792857Y-31967143D01*
X38850000Y-32138571D01*
X38964285Y-32252857D01*
X39078571Y-32310000D01*
X39307142Y-32367143D01*
X39478571Y-32367143D01*
X39707142Y-32310000D01*
X39821428Y-32252857D01*
X39935714Y-32138571D01*
X39992857Y-31967143D01*
X39992857Y-31852857D01*
X39935714Y-31681428D01*
X39878571Y-31624285D01*
X39478571Y-31624285D01*
X39478571Y-31852857D01*
X39992857Y-31110000D02*
X38792857Y-31110000D01*
X39992857Y-30424285D01*
X38792857Y-30424285D01*
X39992857Y-29852857D02*
X38792857Y-29852857D01*
X38792857Y-29567143D01*
X38850000Y-29395714D01*
X38964285Y-29281428D01*
X39078571Y-29224285D01*
X39307142Y-29167143D01*
X39478571Y-29167143D01*
X39707142Y-29224285D01*
X39821428Y-29281428D01*
X39935714Y-29395714D01*
X39992857Y-29567143D01*
X39992857Y-29852857D01*
X17154761Y-3174285D02*
X17202380Y-3031428D01*
X17202380Y-2793333D01*
X17154761Y-2698095D01*
X17107142Y-2650476D01*
X17011904Y-2602857D01*
X16916666Y-2602857D01*
X16821428Y-2650476D01*
X16773809Y-2698095D01*
X16726190Y-2793333D01*
X16678571Y-2983809D01*
X16630952Y-3079047D01*
X16583333Y-3126666D01*
X16488095Y-3174285D01*
X16392857Y-3174285D01*
X16297619Y-3126666D01*
X16250000Y-3079047D01*
X16202380Y-2983809D01*
X16202380Y-2745714D01*
X16250000Y-2602857D01*
X17202380Y-2174285D02*
X16202380Y-2174285D01*
X16202380Y-1936190D01*
X16250000Y-1793333D01*
X16345238Y-1698095D01*
X16440476Y-1650476D01*
X16630952Y-1602857D01*
X16773809Y-1602857D01*
X16964285Y-1650476D01*
X17059523Y-1698095D01*
X17154761Y-1793333D01*
X17202380Y-1936190D01*
X17202380Y-2174285D01*
X16916666Y-1221904D02*
X16916666Y-745714D01*
X17202380Y-1317142D02*
X16202380Y-983809D01*
X17202380Y-650476D01*
X14754761Y-3150476D02*
X14802380Y-3007619D01*
X14802380Y-2769523D01*
X14754761Y-2674285D01*
X14707142Y-2626666D01*
X14611904Y-2579047D01*
X14516666Y-2579047D01*
X14421428Y-2626666D01*
X14373809Y-2674285D01*
X14326190Y-2769523D01*
X14278571Y-2960000D01*
X14230952Y-3055238D01*
X14183333Y-3102857D01*
X14088095Y-3150476D01*
X13992857Y-3150476D01*
X13897619Y-3102857D01*
X13850000Y-3055238D01*
X13802380Y-2960000D01*
X13802380Y-2721904D01*
X13850000Y-2579047D01*
X14707142Y-1579047D02*
X14754761Y-1626666D01*
X14802380Y-1769523D01*
X14802380Y-1864761D01*
X14754761Y-2007619D01*
X14659523Y-2102857D01*
X14564285Y-2150476D01*
X14373809Y-2198095D01*
X14230952Y-2198095D01*
X14040476Y-2150476D01*
X13945238Y-2102857D01*
X13850000Y-2007619D01*
X13802380Y-1864761D01*
X13802380Y-1769523D01*
X13850000Y-1626666D01*
X13897619Y-1579047D01*
X14802380Y-674285D02*
X14802380Y-1150476D01*
X13802380Y-1150476D01*
X8630000Y-2691904D02*
X8582380Y-2787142D01*
X8582380Y-2930000D01*
X8630000Y-3072857D01*
X8725238Y-3168095D01*
X8820476Y-3215714D01*
X9010952Y-3263333D01*
X9153809Y-3263333D01*
X9344285Y-3215714D01*
X9439523Y-3168095D01*
X9534761Y-3072857D01*
X9582380Y-2930000D01*
X9582380Y-2834761D01*
X9534761Y-2691904D01*
X9487142Y-2644285D01*
X9153809Y-2644285D01*
X9153809Y-2834761D01*
X9582380Y-2215714D02*
X8582380Y-2215714D01*
X9582380Y-1644285D01*
X8582380Y-1644285D01*
X9582380Y-1168095D02*
X8582380Y-1168095D01*
X8582380Y-930000D01*
X8630000Y-787142D01*
X8725238Y-691904D01*
X8820476Y-644285D01*
X9010952Y-596666D01*
X9153809Y-596666D01*
X9344285Y-644285D01*
X9439523Y-691904D01*
X9534761Y-787142D01*
X9582380Y-930000D01*
X9582380Y-1168095D01*
X11112380Y-3201904D02*
X11112380Y-2582857D01*
X11493333Y-2916190D01*
X11493333Y-2773333D01*
X11540952Y-2678095D01*
X11588571Y-2630476D01*
X11683809Y-2582857D01*
X11921904Y-2582857D01*
X12017142Y-2630476D01*
X12064761Y-2678095D01*
X12112380Y-2773333D01*
X12112380Y-3059047D01*
X12064761Y-3154285D01*
X12017142Y-3201904D01*
X11112380Y-2297142D02*
X12112380Y-1963809D01*
X11112380Y-1630476D01*
X33387619Y-91348095D02*
X33387619Y-90667142D01*
X33806666Y-91033809D01*
X33806666Y-90876666D01*
X33859047Y-90771904D01*
X33911428Y-90719523D01*
X34016190Y-90667142D01*
X34278095Y-90667142D01*
X34382857Y-90719523D01*
X34435238Y-90771904D01*
X34487619Y-90876666D01*
X34487619Y-91190952D01*
X34435238Y-91295714D01*
X34382857Y-91348095D01*
X33387619Y-90352857D02*
X34487619Y-89986190D01*
X33387619Y-89619523D01*
X2227142Y-73927142D02*
X2227142Y-74155714D01*
X2170000Y-74270000D01*
X2055714Y-74384285D01*
X1827142Y-74441428D01*
X1427142Y-74441428D01*
X1198571Y-74384285D01*
X1084285Y-74270000D01*
X1027142Y-74155714D01*
X1027142Y-73927142D01*
X1084285Y-73812857D01*
X1198571Y-73698571D01*
X1427142Y-73641428D01*
X1827142Y-73641428D01*
X2055714Y-73698571D01*
X2170000Y-73812857D01*
X2227142Y-73927142D01*
X1655714Y-75355714D02*
X1655714Y-74955714D01*
X1027142Y-74955714D02*
X2227142Y-74955714D01*
X2227142Y-75527142D01*
X1655714Y-76384285D02*
X1655714Y-75984285D01*
X1027142Y-75984285D02*
X2227142Y-75984285D01*
X2227142Y-76555714D01*
X2247142Y-70857142D02*
X2247142Y-71085714D01*
X2190000Y-71200000D01*
X2075714Y-71314285D01*
X1847142Y-71371428D01*
X1447142Y-71371428D01*
X1218571Y-71314285D01*
X1104285Y-71200000D01*
X1047142Y-71085714D01*
X1047142Y-70857142D01*
X1104285Y-70742857D01*
X1218571Y-70628571D01*
X1447142Y-70571428D01*
X1847142Y-70571428D01*
X2075714Y-70628571D01*
X2190000Y-70742857D01*
X2247142Y-70857142D01*
X1047142Y-71885714D02*
X2247142Y-71885714D01*
X1047142Y-72571428D01*
X2247142Y-72571428D01*
D11*
X40892857Y-59224285D02*
X40492857Y-59224285D01*
X40492857Y-59852857D02*
X40492857Y-58652857D01*
X41064285Y-58652857D01*
X41978571Y-59795714D02*
X41864285Y-59852857D01*
X41635714Y-59852857D01*
X41521428Y-59795714D01*
X41464285Y-59681428D01*
X41464285Y-59224285D01*
X41521428Y-59110000D01*
X41635714Y-59052857D01*
X41864285Y-59052857D01*
X41978571Y-59110000D01*
X42035714Y-59224285D01*
X42035714Y-59338571D01*
X41464285Y-59452857D01*
X43064285Y-59852857D02*
X43064285Y-59224285D01*
X43007142Y-59110000D01*
X42892857Y-59052857D01*
X42664285Y-59052857D01*
X42550000Y-59110000D01*
X43064285Y-59795714D02*
X42950000Y-59852857D01*
X42664285Y-59852857D01*
X42550000Y-59795714D01*
X42492857Y-59681428D01*
X42492857Y-59567142D01*
X42550000Y-59452857D01*
X42664285Y-59395714D01*
X42950000Y-59395714D01*
X43064285Y-59338571D01*
X43464285Y-59052857D02*
X43921428Y-59052857D01*
X43635714Y-58652857D02*
X43635714Y-59681428D01*
X43692857Y-59795714D01*
X43807142Y-59852857D01*
X43921428Y-59852857D01*
X44321428Y-59852857D02*
X44321428Y-58652857D01*
X44835714Y-59852857D02*
X44835714Y-59224285D01*
X44778571Y-59110000D01*
X44664285Y-59052857D01*
X44492857Y-59052857D01*
X44378571Y-59110000D01*
X44321428Y-59167142D01*
X45864285Y-59795714D02*
X45750000Y-59852857D01*
X45521428Y-59852857D01*
X45407142Y-59795714D01*
X45350000Y-59681428D01*
X45350000Y-59224285D01*
X45407142Y-59110000D01*
X45521428Y-59052857D01*
X45750000Y-59052857D01*
X45864285Y-59110000D01*
X45921428Y-59224285D01*
X45921428Y-59338571D01*
X45350000Y-59452857D01*
X46435714Y-59852857D02*
X46435714Y-59052857D01*
X46435714Y-59281428D02*
X46492857Y-59167142D01*
X46550000Y-59110000D01*
X46664285Y-59052857D01*
X46778571Y-59052857D01*
X41022857Y-83534285D02*
X40622857Y-83534285D01*
X40622857Y-84162857D02*
X40622857Y-82962857D01*
X41194285Y-82962857D01*
X42108571Y-84105714D02*
X41994285Y-84162857D01*
X41765714Y-84162857D01*
X41651428Y-84105714D01*
X41594285Y-83991428D01*
X41594285Y-83534285D01*
X41651428Y-83420000D01*
X41765714Y-83362857D01*
X41994285Y-83362857D01*
X42108571Y-83420000D01*
X42165714Y-83534285D01*
X42165714Y-83648571D01*
X41594285Y-83762857D01*
X43194285Y-84162857D02*
X43194285Y-83534285D01*
X43137142Y-83420000D01*
X43022857Y-83362857D01*
X42794285Y-83362857D01*
X42680000Y-83420000D01*
X43194285Y-84105714D02*
X43080000Y-84162857D01*
X42794285Y-84162857D01*
X42680000Y-84105714D01*
X42622857Y-83991428D01*
X42622857Y-83877142D01*
X42680000Y-83762857D01*
X42794285Y-83705714D01*
X43080000Y-83705714D01*
X43194285Y-83648571D01*
X43594285Y-83362857D02*
X44051428Y-83362857D01*
X43765714Y-82962857D02*
X43765714Y-83991428D01*
X43822857Y-84105714D01*
X43937142Y-84162857D01*
X44051428Y-84162857D01*
X44451428Y-84162857D02*
X44451428Y-82962857D01*
X44965714Y-84162857D02*
X44965714Y-83534285D01*
X44908571Y-83420000D01*
X44794285Y-83362857D01*
X44622857Y-83362857D01*
X44508571Y-83420000D01*
X44451428Y-83477142D01*
X45994285Y-84105714D02*
X45880000Y-84162857D01*
X45651428Y-84162857D01*
X45537142Y-84105714D01*
X45480000Y-83991428D01*
X45480000Y-83534285D01*
X45537142Y-83420000D01*
X45651428Y-83362857D01*
X45880000Y-83362857D01*
X45994285Y-83420000D01*
X46051428Y-83534285D01*
X46051428Y-83648571D01*
X45480000Y-83762857D01*
X46565714Y-84162857D02*
X46565714Y-83362857D01*
X46565714Y-83591428D02*
X46622857Y-83477142D01*
X46680000Y-83420000D01*
X46794285Y-83362857D01*
X46908571Y-83362857D01*
D10*
X41302857Y-32424285D02*
X41302857Y-31681428D01*
X41760000Y-32081428D01*
X41760000Y-31910000D01*
X41817142Y-31795714D01*
X41874285Y-31738571D01*
X41988571Y-31681428D01*
X42274285Y-31681428D01*
X42388571Y-31738571D01*
X42445714Y-31795714D01*
X42502857Y-31910000D01*
X42502857Y-32252857D01*
X42445714Y-32367142D01*
X42388571Y-32424285D01*
X41302857Y-31338571D02*
X42502857Y-30938571D01*
X41302857Y-30538571D01*
D11*
X9797142Y-34965714D02*
X9968571Y-35022857D01*
X10254285Y-35022857D01*
X10368571Y-34965714D01*
X10425714Y-34908571D01*
X10482857Y-34794285D01*
X10482857Y-34680000D01*
X10425714Y-34565714D01*
X10368571Y-34508571D01*
X10254285Y-34451428D01*
X10025714Y-34394285D01*
X9911428Y-34337142D01*
X9854285Y-34280000D01*
X9797142Y-34165714D01*
X9797142Y-34051428D01*
X9854285Y-33937142D01*
X9911428Y-33880000D01*
X10025714Y-33822857D01*
X10311428Y-33822857D01*
X10482857Y-33880000D01*
X11682857Y-34908571D02*
X11625714Y-34965714D01*
X11454285Y-35022857D01*
X11340000Y-35022857D01*
X11168571Y-34965714D01*
X11054285Y-34851428D01*
X10997142Y-34737142D01*
X10940000Y-34508571D01*
X10940000Y-34337142D01*
X10997142Y-34108571D01*
X11054285Y-33994285D01*
X11168571Y-33880000D01*
X11340000Y-33822857D01*
X11454285Y-33822857D01*
X11625714Y-33880000D01*
X11682857Y-33937142D01*
X12197142Y-35022857D02*
X12197142Y-33822857D01*
X12482857Y-33822857D01*
X12654285Y-33880000D01*
X12768571Y-33994285D01*
X12825714Y-34108571D01*
X12882857Y-34337142D01*
X12882857Y-34508571D01*
X12825714Y-34737142D01*
X12768571Y-34851428D01*
X12654285Y-34965714D01*
X12482857Y-35022857D01*
X12197142Y-35022857D01*
X13282857Y-33822857D02*
X14025714Y-33822857D01*
X13625714Y-34280000D01*
X13797142Y-34280000D01*
X13911428Y-34337142D01*
X13968571Y-34394285D01*
X14025714Y-34508571D01*
X14025714Y-34794285D01*
X13968571Y-34908571D01*
X13911428Y-34965714D01*
X13797142Y-35022857D01*
X13454285Y-35022857D01*
X13340000Y-34965714D01*
X13282857Y-34908571D01*
X14768571Y-33822857D02*
X14882857Y-33822857D01*
X14997142Y-33880000D01*
X15054285Y-33937142D01*
X15111428Y-34051428D01*
X15168571Y-34280000D01*
X15168571Y-34565714D01*
X15111428Y-34794285D01*
X15054285Y-34908571D01*
X14997142Y-34965714D01*
X14882857Y-35022857D01*
X14768571Y-35022857D01*
X14654285Y-34965714D01*
X14597142Y-34908571D01*
X14540000Y-34794285D01*
X14482857Y-34565714D01*
X14482857Y-34280000D01*
X14540000Y-34051428D01*
X14597142Y-33937142D01*
X14654285Y-33880000D01*
X14768571Y-33822857D01*
X16940000Y-35480000D02*
X16882857Y-35422857D01*
X16768571Y-35251428D01*
X16711428Y-35137142D01*
X16654285Y-34965714D01*
X16597142Y-34680000D01*
X16597142Y-34451428D01*
X16654285Y-34165714D01*
X16711428Y-33994285D01*
X16768571Y-33880000D01*
X16882857Y-33708571D01*
X16940000Y-33651428D01*
X18082857Y-34908571D02*
X18025714Y-34965714D01*
X17854285Y-35022857D01*
X17740000Y-35022857D01*
X17568571Y-34965714D01*
X17454285Y-34851428D01*
X17397142Y-34737142D01*
X17340000Y-34508571D01*
X17340000Y-34337142D01*
X17397142Y-34108571D01*
X17454285Y-33994285D01*
X17568571Y-33880000D01*
X17740000Y-33822857D01*
X17854285Y-33822857D01*
X18025714Y-33880000D01*
X18082857Y-33937142D01*
X18825714Y-33822857D02*
X19054285Y-33822857D01*
X19168571Y-33880000D01*
X19282857Y-33994285D01*
X19340000Y-34222857D01*
X19340000Y-34622857D01*
X19282857Y-34851428D01*
X19168571Y-34965714D01*
X19054285Y-35022857D01*
X18825714Y-35022857D01*
X18711428Y-34965714D01*
X18597142Y-34851428D01*
X18540000Y-34622857D01*
X18540000Y-34222857D01*
X18597142Y-33994285D01*
X18711428Y-33880000D01*
X18825714Y-33822857D01*
X19797142Y-33937142D02*
X19854285Y-33880000D01*
X19968571Y-33822857D01*
X20254285Y-33822857D01*
X20368571Y-33880000D01*
X20425714Y-33937142D01*
X20482857Y-34051428D01*
X20482857Y-34165714D01*
X20425714Y-34337142D01*
X19740000Y-35022857D01*
X20482857Y-35022857D01*
X20882857Y-35480000D02*
X20940000Y-35422857D01*
X21054285Y-35251428D01*
X21111428Y-35137142D01*
X21168571Y-34965714D01*
X21225714Y-34680000D01*
X21225714Y-34451428D01*
X21168571Y-34165714D01*
X21111428Y-33994285D01*
X21054285Y-33880000D01*
X20940000Y-33708571D01*
X20882857Y-33651428D01*
D10*
X30792000Y-92011429D02*
X30739619Y-92116191D01*
X30739619Y-92273334D01*
X30792000Y-92430476D01*
X30896761Y-92535238D01*
X31001523Y-92587619D01*
X31211047Y-92640000D01*
X31368190Y-92640000D01*
X31577714Y-92587619D01*
X31682476Y-92535238D01*
X31787238Y-92430476D01*
X31839619Y-92273334D01*
X31839619Y-92168572D01*
X31787238Y-92011429D01*
X31734857Y-91959048D01*
X31368190Y-91959048D01*
X31368190Y-92168572D01*
X31839619Y-91487619D02*
X30739619Y-91487619D01*
X31839619Y-90859048D01*
X30739619Y-90859048D01*
X31839619Y-90335238D02*
X30739619Y-90335238D01*
X30739619Y-90073334D01*
X30792000Y-89916191D01*
X30896761Y-89811429D01*
X31001523Y-89759048D01*
X31211047Y-89706667D01*
X31368190Y-89706667D01*
X31577714Y-89759048D01*
X31682476Y-89811429D01*
X31787238Y-89916191D01*
X31839619Y-90073334D01*
X31839619Y-90335238D01*
X28915333Y-91278095D02*
X28915333Y-90754285D01*
X29229619Y-91382857D02*
X28129619Y-91016190D01*
X29229619Y-90649523D01*
X28129619Y-90073333D02*
X28129619Y-89968571D01*
X28182000Y-89863809D01*
X28234380Y-89811428D01*
X28339142Y-89759047D01*
X28548666Y-89706666D01*
X28810571Y-89706666D01*
X29020095Y-89759047D01*
X29124857Y-89811428D01*
X29177238Y-89863809D01*
X29229619Y-89968571D01*
X29229619Y-90073333D01*
X29177238Y-90178095D01*
X29124857Y-90230476D01*
X29020095Y-90282857D01*
X28810571Y-90335238D01*
X28548666Y-90335238D01*
X28339142Y-90282857D01*
X28234380Y-90230476D01*
X28182000Y-90178095D01*
X28129619Y-90073333D01*
X26455333Y-91278095D02*
X26455333Y-90754285D01*
X26769619Y-91382857D02*
X25669619Y-91016190D01*
X26769619Y-90649523D01*
X26769619Y-89706666D02*
X26769619Y-90335238D01*
X26769619Y-90020952D02*
X25669619Y-90020952D01*
X25826761Y-90125714D01*
X25931523Y-90230476D01*
X25983904Y-90335238D01*
X23985333Y-91278095D02*
X23985333Y-90754285D01*
X24299619Y-91382857D02*
X23199619Y-91016190D01*
X24299619Y-90649523D01*
X23304380Y-90335238D02*
X23252000Y-90282857D01*
X23199619Y-90178095D01*
X23199619Y-89916190D01*
X23252000Y-89811428D01*
X23304380Y-89759047D01*
X23409142Y-89706666D01*
X23513904Y-89706666D01*
X23671047Y-89759047D01*
X24299619Y-90387619D01*
X24299619Y-89706666D01*
X21629619Y-90754286D02*
X21105809Y-91120953D01*
X21629619Y-91382857D02*
X20529619Y-91382857D01*
X20529619Y-90963810D01*
X20582000Y-90859048D01*
X20634380Y-90806667D01*
X20739142Y-90754286D01*
X20896285Y-90754286D01*
X21001047Y-90806667D01*
X21053428Y-90859048D01*
X21105809Y-90963810D01*
X21105809Y-91382857D01*
X20529619Y-90387619D02*
X21629619Y-89654286D01*
X20529619Y-89654286D02*
X21629619Y-90387619D01*
X17879619Y-91278095D02*
X17879619Y-90649523D01*
X18979619Y-90963809D02*
X17879619Y-90963809D01*
X17879619Y-90387619D02*
X18979619Y-89654285D01*
X17879619Y-89654285D02*
X18979619Y-90387619D01*
D12*
X1847563Y-9150152D02*
X999035Y-8301624D01*
X1201065Y-8099593D01*
X1362690Y-8018781D01*
X1524314Y-8018781D01*
X1645532Y-8059187D01*
X1847563Y-8180406D01*
X1968781Y-8301624D01*
X2089999Y-8503654D01*
X2130406Y-8624873D01*
X2130406Y-8786497D01*
X2049593Y-8948122D01*
X1847563Y-9150152D01*
X2251624Y-7049035D02*
X1847563Y-7453096D01*
X2211218Y-7897563D01*
X2211218Y-7816751D01*
X2251624Y-7695532D01*
X2453654Y-7493502D01*
X2574873Y-7453096D01*
X2655685Y-7453096D01*
X2776903Y-7493502D01*
X2978934Y-7695532D01*
X3019340Y-7816751D01*
X3019340Y-7897563D01*
X2978934Y-8018781D01*
X2776903Y-8220812D01*
X2655685Y-8261218D01*
X2574873Y-8261218D01*
X49162487Y-7475329D02*
X49566548Y-7879390D01*
X48839238Y-7636954D02*
X49970609Y-7071268D01*
X49404923Y-8202639D01*
X50455482Y-7556142D02*
X50980761Y-8081421D01*
X50374670Y-8121827D01*
X50495888Y-8243045D01*
X50536294Y-8364264D01*
X50536294Y-8445076D01*
X50495888Y-8566294D01*
X50293857Y-8768325D01*
X50172639Y-8808731D01*
X50091827Y-8808731D01*
X49970609Y-8768325D01*
X49728172Y-8525888D01*
X49687766Y-8404670D01*
X49687766Y-8323857D01*
X48896192Y-29823096D02*
X48977004Y-29984720D01*
X49179035Y-30186751D01*
X49300253Y-30227157D01*
X49381065Y-30227157D01*
X49502284Y-30186751D01*
X49583096Y-30105938D01*
X49623502Y-29984720D01*
X49623502Y-29903908D01*
X49583096Y-29782690D01*
X49461877Y-29580659D01*
X49421471Y-29459441D01*
X49421471Y-29378629D01*
X49461877Y-29257410D01*
X49542690Y-29176598D01*
X49663908Y-29136192D01*
X49744720Y-29136192D01*
X49865938Y-29176598D01*
X50067969Y-29378629D01*
X50148781Y-29540253D01*
X49704314Y-30712030D02*
X50552842Y-29863502D01*
X50754873Y-30065532D01*
X50835685Y-30227157D01*
X50835685Y-30388781D01*
X50795279Y-30510000D01*
X50674061Y-30712030D01*
X50552842Y-30833248D01*
X50350812Y-30954467D01*
X50229593Y-30994873D01*
X50067969Y-30994873D01*
X49906345Y-30914061D01*
X49704314Y-30712030D01*
X50754873Y-31277715D02*
X51158934Y-31681776D01*
X50431624Y-31439340D02*
X51562995Y-30873654D01*
X50997309Y-32005025D01*
X1263299Y-31943604D02*
X1424923Y-31862792D01*
X1626954Y-31660761D01*
X1667360Y-31539543D01*
X1667360Y-31458731D01*
X1626954Y-31337512D01*
X1546142Y-31256700D01*
X1424923Y-31216294D01*
X1344111Y-31216294D01*
X1222893Y-31256700D01*
X1020862Y-31377918D01*
X899644Y-31418325D01*
X818832Y-31418325D01*
X697613Y-31377918D01*
X616801Y-31297106D01*
X576395Y-31175888D01*
X576395Y-31095076D01*
X616801Y-30973857D01*
X818832Y-30771827D01*
X980456Y-30691015D01*
X2556294Y-30569796D02*
X2556294Y-30650609D01*
X2475482Y-30812233D01*
X2394670Y-30893045D01*
X2233045Y-30973857D01*
X2071421Y-30973857D01*
X1950203Y-30933451D01*
X1748172Y-30812233D01*
X1626954Y-30691015D01*
X1505735Y-30488984D01*
X1465329Y-30367766D01*
X1465329Y-30206142D01*
X1546142Y-30044517D01*
X1626954Y-29963705D01*
X1788578Y-29882893D01*
X1869390Y-29882893D01*
X3404822Y-29882893D02*
X3000761Y-30286954D01*
X2152233Y-29438426D01*
X799238Y-85622233D02*
X678019Y-85662639D01*
X556801Y-85783857D01*
X475989Y-85945482D01*
X475989Y-86107106D01*
X516395Y-86228325D01*
X637613Y-86430355D01*
X758832Y-86551573D01*
X960862Y-86672792D01*
X1082081Y-86713198D01*
X1243705Y-86713198D01*
X1405329Y-86632386D01*
X1486142Y-86551573D01*
X1566954Y-86389949D01*
X1566954Y-86309137D01*
X1284111Y-86026294D01*
X1122487Y-86187918D01*
X2011421Y-86026294D02*
X1162893Y-85177766D01*
X2496294Y-85541421D01*
X1647766Y-84692893D01*
X2900355Y-85137360D02*
X2051827Y-84288832D01*
X2253857Y-84086801D01*
X2415482Y-84005989D01*
X2577106Y-84005989D01*
X2698325Y-84046395D01*
X2900355Y-84167613D01*
X3021573Y-84288832D01*
X3142792Y-84490862D01*
X3183198Y-84612081D01*
X3183198Y-84773705D01*
X3102386Y-84935329D01*
X2900355Y-85137360D01*
D10*
X3509142Y-50455714D02*
X2309142Y-50855714D01*
X3509142Y-51255714D01*
X2309142Y-51655714D02*
X3509142Y-51655714D01*
X2309142Y-52227142D02*
X3509142Y-52227142D01*
X2309142Y-52912857D01*
X3509142Y-52912857D01*
X3482000Y-45915714D02*
X3539142Y-45801428D01*
X3539142Y-45630000D01*
X3482000Y-45458571D01*
X3367714Y-45344285D01*
X3253428Y-45287142D01*
X3024857Y-45230000D01*
X2853428Y-45230000D01*
X2624857Y-45287142D01*
X2510571Y-45344285D01*
X2396285Y-45458571D01*
X2339142Y-45630000D01*
X2339142Y-45744285D01*
X2396285Y-45915714D01*
X2453428Y-45972857D01*
X2853428Y-45972857D01*
X2853428Y-45744285D01*
X2339142Y-46487142D02*
X3539142Y-46487142D01*
X2339142Y-47172857D01*
X3539142Y-47172857D01*
X2339142Y-47744285D02*
X3539142Y-47744285D01*
X3539142Y-48030000D01*
X3482000Y-48201428D01*
X3367714Y-48315714D01*
X3253428Y-48372857D01*
X3024857Y-48430000D01*
X2853428Y-48430000D01*
X2624857Y-48372857D01*
X2510571Y-48315714D01*
X2396285Y-48201428D01*
X2339142Y-48030000D01*
X2339142Y-47744285D01*
X49384857Y-67697142D02*
X49670571Y-67792380D01*
X49765809Y-67887619D01*
X49861047Y-68078095D01*
X49861047Y-68363809D01*
X49765809Y-68554285D01*
X49670571Y-68649523D01*
X49480095Y-68744761D01*
X48718190Y-68744761D01*
X48718190Y-66744761D01*
X49384857Y-66744761D01*
X49575333Y-66840000D01*
X49670571Y-66935238D01*
X49765809Y-67125714D01*
X49765809Y-67316190D01*
X49670571Y-67506666D01*
X49575333Y-67601904D01*
X49384857Y-67697142D01*
X48718190Y-67697142D01*
D12*
X50218172Y-84798832D02*
X50743451Y-85324111D01*
X50137360Y-85364517D01*
X50258578Y-85485735D01*
X50298984Y-85606954D01*
X50298984Y-85687766D01*
X50258578Y-85808984D01*
X50056548Y-86011015D01*
X49935329Y-86051421D01*
X49854517Y-86051421D01*
X49733299Y-86011015D01*
X49490862Y-85768578D01*
X49450456Y-85647360D01*
X49450456Y-85566548D01*
X50985888Y-85566548D02*
X50420203Y-86697918D01*
X51551573Y-86132233D01*
D13*
X43960000Y-35640000D02*
X43960000Y-11870000D01*
X7600000Y-35640000D02*
X43960000Y-35640000D01*
X7600000Y-11870000D02*
X43960000Y-11870000D01*
X7600000Y-11870000D02*
X7600000Y-35640000D01*
X37074000Y-79260000D02*
X36854000Y-79260000D01*
X37074000Y-67180000D02*
X37074000Y-79260000D01*
X29304000Y-67180000D02*
X37074000Y-67180000D01*
X29304000Y-79250000D02*
X29304000Y-67180000D01*
D10*
X33673142Y-47219428D02*
X32873142Y-47219428D01*
X34130285Y-46933714D02*
X33273142Y-46648000D01*
X33273142Y-47390857D01*
X32987428Y-47848000D02*
X32930285Y-47905142D01*
X32873142Y-47848000D01*
X32930285Y-47790857D01*
X32987428Y-47848000D01*
X32873142Y-47848000D01*
X34073142Y-48305142D02*
X34073142Y-49105142D01*
X32873142Y-48590857D01*
X32873142Y-49562285D02*
X34073142Y-49562285D01*
X32873142Y-50248000D02*
X33558857Y-49733714D01*
X34073142Y-50248000D02*
X33387428Y-49562285D01*
X17925142Y-47219428D02*
X17125142Y-47219428D01*
X18382285Y-46933714D02*
X17525142Y-46648000D01*
X17525142Y-47390857D01*
X17239428Y-47848000D02*
X17182285Y-47905142D01*
X17125142Y-47848000D01*
X17182285Y-47790857D01*
X17239428Y-47848000D01*
X17125142Y-47848000D01*
X18325142Y-48305142D02*
X18325142Y-49105142D01*
X17125142Y-48590857D01*
X17125142Y-49562285D02*
X18325142Y-49562285D01*
X17125142Y-50248000D02*
X17810857Y-49733714D01*
X18325142Y-50248000D02*
X17639428Y-49562285D01*
X28339142Y-47219428D02*
X27539142Y-47219428D01*
X28796285Y-46933714D02*
X27939142Y-46648000D01*
X27939142Y-47390857D01*
X27653428Y-47848000D02*
X27596285Y-47905142D01*
X27539142Y-47848000D01*
X27596285Y-47790857D01*
X27653428Y-47848000D01*
X27539142Y-47848000D01*
X28739142Y-48305142D02*
X28739142Y-49105142D01*
X27539142Y-48590857D01*
X27539142Y-49562285D02*
X28739142Y-49562285D01*
X27539142Y-50248000D02*
X28224857Y-49733714D01*
X28739142Y-50248000D02*
X28053428Y-49562285D01*
X23005142Y-47219428D02*
X22205142Y-47219428D01*
X23462285Y-46933714D02*
X22605142Y-46648000D01*
X22605142Y-47390857D01*
X22319428Y-47848000D02*
X22262285Y-47905142D01*
X22205142Y-47848000D01*
X22262285Y-47790857D01*
X22319428Y-47848000D01*
X22205142Y-47848000D01*
X23405142Y-48305142D02*
X23405142Y-49105142D01*
X22205142Y-48590857D01*
X22205142Y-49562285D02*
X23405142Y-49562285D01*
X22205142Y-50248000D02*
X22890857Y-49733714D01*
X23405142Y-50248000D02*
X22719428Y-49562285D01*
X48908666Y-46353333D02*
X49861047Y-46353333D01*
X48718190Y-46924761D02*
X49384857Y-44924761D01*
X50051523Y-46924761D01*
X31956285Y-69922857D02*
X31384857Y-69922857D01*
X31327714Y-70494285D01*
X31384857Y-70437142D01*
X31499142Y-70380000D01*
X31784857Y-70380000D01*
X31899142Y-70437142D01*
X31956285Y-70494285D01*
X32013428Y-70608571D01*
X32013428Y-70894285D01*
X31956285Y-71008571D01*
X31899142Y-71065714D01*
X31784857Y-71122857D01*
X31499142Y-71122857D01*
X31384857Y-71065714D01*
X31327714Y-71008571D01*
X32356285Y-69922857D02*
X32756285Y-71122857D01*
X33156285Y-69922857D01*
X30527714Y-72710000D02*
X30413428Y-72652857D01*
X30242000Y-72652857D01*
X30070571Y-72710000D01*
X29956285Y-72824285D01*
X29899142Y-72938571D01*
X29842000Y-73167142D01*
X29842000Y-73338571D01*
X29899142Y-73567142D01*
X29956285Y-73681428D01*
X30070571Y-73795714D01*
X30242000Y-73852857D01*
X30356285Y-73852857D01*
X30527714Y-73795714D01*
X30584857Y-73738571D01*
X30584857Y-73338571D01*
X30356285Y-73338571D01*
X31099142Y-73852857D02*
X31099142Y-72652857D01*
X31784857Y-73852857D01*
X31784857Y-72652857D01*
X32356285Y-73852857D02*
X32356285Y-72652857D01*
X32642000Y-72652857D01*
X32813428Y-72710000D01*
X32927714Y-72824285D01*
X32984857Y-72938571D01*
X33042000Y-73167142D01*
X33042000Y-73338571D01*
X32984857Y-73567142D01*
X32927714Y-73681428D01*
X32813428Y-73795714D01*
X32642000Y-73852857D01*
X32356285Y-73852857D01*
X30527714Y-75052857D02*
X30927714Y-76252857D01*
X31327714Y-75052857D01*
X31727714Y-76252857D02*
X31727714Y-75052857D01*
X32299142Y-76252857D02*
X32299142Y-75052857D01*
X32984857Y-76252857D01*
X32984857Y-75052857D01*
X592000Y-84720000D02*
X592000Y-61860000D01*
X51392000Y-84720000D02*
X592000Y-84720000D01*
X51392000Y-61860000D02*
X592000Y-61860000D01*
X51392000Y-84720000D02*
X51392000Y-61860000D01*
X51372000Y-60376000D02*
X572000Y-60376000D01*
X51372000Y-37516000D02*
X572000Y-37516000D01*
X51372000Y-60376000D02*
X51372000Y-37516000D01*
X572000Y-60376000D02*
X572000Y-37516000D01*
D13*
X36861000Y-79251600D02*
X29311000Y-79251600D01*
%TO.C,J13*%
X8732000Y-89515000D02*
X8732000Y-87015000D01*
X8732000Y-87015000D02*
X9782000Y-87015000D01*
X9782000Y-87015000D02*
X9782000Y-86025000D01*
X14952000Y-89515000D02*
X14952000Y-87015000D01*
X14952000Y-87015000D02*
X13902000Y-87015000D01*
X9902000Y-91485000D02*
X13782000Y-91485000D01*
%TO.C,J9*%
X36202000Y-59070000D02*
X36202000Y-60400000D01*
X36202000Y-60400000D02*
X34872000Y-60400000D01*
X33602000Y-60400000D02*
X5602000Y-60400000D01*
X5602000Y-57740000D02*
X5602000Y-60400000D01*
X33602000Y-57740000D02*
X5602000Y-57740000D01*
X33602000Y-57740000D02*
X33602000Y-60400000D01*
%TO.C,J16*%
X7800000Y-5000000D02*
X7800000Y-3670000D01*
X7800000Y-3670000D02*
X9130000Y-3670000D01*
X10400000Y-3670000D02*
X18080000Y-3670000D01*
X18080000Y-6330000D02*
X18080000Y-3670000D01*
X10400000Y-6330000D02*
X18080000Y-6330000D01*
X10400000Y-6330000D02*
X10400000Y-3670000D01*
%TO.C,J15*%
X35142000Y-87550000D02*
X35142000Y-88880000D01*
X35142000Y-88880000D02*
X33812000Y-88880000D01*
X32542000Y-88880000D02*
X17242000Y-88880000D01*
X17242000Y-86220000D02*
X17242000Y-88880000D01*
X32542000Y-86220000D02*
X17242000Y-86220000D01*
X32542000Y-86220000D02*
X32542000Y-88880000D01*
%TO.C,J14*%
X46382000Y-12000000D02*
X47712000Y-12000000D01*
X47712000Y-12000000D02*
X47712000Y-13330000D01*
X47712000Y-14600000D02*
X47712000Y-29900000D01*
X45052000Y-29900000D02*
X47712000Y-29900000D01*
X45052000Y-14600000D02*
X45052000Y-29900000D01*
X45052000Y-14600000D02*
X47712000Y-14600000D01*
%TO.C,J11*%
X4172000Y-14600000D02*
X6832000Y-14600000D01*
X4172000Y-14600000D02*
X4172000Y-29900000D01*
X4172000Y-29900000D02*
X6832000Y-29900000D01*
X6832000Y-14600000D02*
X6832000Y-29900000D01*
X6832000Y-12000000D02*
X6832000Y-13330000D01*
X5502000Y-12000000D02*
X6832000Y-12000000D01*
%TO.C,J6*%
X9372000Y-10700000D02*
X9372000Y-8040000D01*
X9372000Y-10700000D02*
X44992000Y-10700000D01*
X44992000Y-10700000D02*
X44992000Y-8040000D01*
X9372000Y-8040000D02*
X44992000Y-8040000D01*
X6772000Y-8040000D02*
X8102000Y-8040000D01*
X6772000Y-9370000D02*
X6772000Y-8040000D01*
%TO.C,J17*%
X40682000Y-32950000D02*
X40682000Y-35610000D01*
X40682000Y-32950000D02*
X25382000Y-32950000D01*
X25382000Y-32950000D02*
X25382000Y-35610000D01*
X40682000Y-35610000D02*
X25382000Y-35610000D01*
X43282000Y-35610000D02*
X41952000Y-35610000D01*
X43282000Y-34280000D02*
X43282000Y-35610000D01*
%TO.C,J18*%
X37452000Y-89515000D02*
X37452000Y-87015000D01*
X37452000Y-87015000D02*
X38502000Y-87015000D01*
X38502000Y-87015000D02*
X38502000Y-86025000D01*
X43672000Y-89515000D02*
X43672000Y-87015000D01*
X43672000Y-87015000D02*
X42622000Y-87015000D01*
X38622000Y-91485000D02*
X42502000Y-91485000D01*
%TO.C,J5*%
X4110000Y-77220000D02*
X2780000Y-77220000D01*
X2780000Y-77220000D02*
X2780000Y-75890000D01*
X2780000Y-74620000D02*
X2780000Y-69480000D01*
X5440000Y-69480000D02*
X2780000Y-69480000D01*
X5440000Y-74620000D02*
X5440000Y-69480000D01*
X5440000Y-74620000D02*
X2780000Y-74620000D01*
%TO.C,SW2*%
X42028000Y-67824000D02*
X41798000Y-67824000D01*
X45698000Y-67304000D02*
X45698000Y-75024000D01*
X45698000Y-75024000D02*
X41798000Y-75024000D01*
X38688000Y-67304000D02*
X38688000Y-67824000D01*
X45698000Y-67304000D02*
X41798000Y-67304000D01*
X42028000Y-74504000D02*
X41798000Y-74504000D01*
X39198000Y-67824000D02*
X38688000Y-67824000D01*
X39198000Y-67304000D02*
X38688000Y-67304000D01*
X42028000Y-73964000D02*
X42028000Y-74504000D01*
X39198000Y-74504000D02*
X38688000Y-74504000D01*
X38688000Y-74504000D02*
X38688000Y-75024000D01*
X39198000Y-75024000D02*
X38688000Y-75024000D01*
X42028000Y-67824000D02*
X42028000Y-68364000D01*
X42028000Y-69464000D02*
X42028000Y-72864000D01*
%TO.C,SW1*%
X42028000Y-46234000D02*
X41798000Y-46234000D01*
X45698000Y-45714000D02*
X45698000Y-53434000D01*
X45698000Y-53434000D02*
X41798000Y-53434000D01*
X38688000Y-45714000D02*
X38688000Y-46234000D01*
X45698000Y-45714000D02*
X41798000Y-45714000D01*
X42028000Y-52914000D02*
X41798000Y-52914000D01*
X39198000Y-46234000D02*
X38688000Y-46234000D01*
X39198000Y-45714000D02*
X38688000Y-45714000D01*
X42028000Y-52374000D02*
X42028000Y-52914000D01*
X39198000Y-52914000D02*
X38688000Y-52914000D01*
X38688000Y-52914000D02*
X38688000Y-53434000D01*
X39198000Y-53434000D02*
X38688000Y-53434000D01*
X42028000Y-46234000D02*
X42028000Y-46774000D01*
X42028000Y-47874000D02*
X42028000Y-51274000D01*
%TO.C,J10*%
X5592000Y-38786000D02*
X5592000Y-37456000D01*
X5592000Y-37456000D02*
X6922000Y-37456000D01*
X8192000Y-37456000D02*
X46352000Y-37456000D01*
X46352000Y-40116000D02*
X46352000Y-37456000D01*
X8192000Y-40116000D02*
X46352000Y-40116000D01*
X8192000Y-40116000D02*
X8192000Y-37456000D01*
%TO.C,J2*%
X33652000Y-82090000D02*
X33652000Y-84750000D01*
X33652000Y-82090000D02*
X5652000Y-82090000D01*
X5652000Y-82090000D02*
X5652000Y-84750000D01*
X33652000Y-84750000D02*
X5652000Y-84750000D01*
X36252000Y-84750000D02*
X34922000Y-84750000D01*
X36252000Y-83420000D02*
X36252000Y-84750000D01*
%TO.C,J3*%
X8212000Y-64460000D02*
X8212000Y-61800000D01*
X8212000Y-64460000D02*
X46372000Y-64460000D01*
X46372000Y-64460000D02*
X46372000Y-61800000D01*
X8212000Y-61800000D02*
X46372000Y-61800000D01*
X5612000Y-61800000D02*
X6942000Y-61800000D01*
X5612000Y-63130000D02*
X5612000Y-61800000D01*
%TO.C,D1*%
X14072000Y-76525000D02*
X18012000Y-76525000D01*
X14072000Y-76285000D02*
X18012000Y-76285000D01*
X14072000Y-76405000D02*
X18012000Y-76405000D01*
X16042000Y-68580000D02*
X16042000Y-68720000D01*
X16042000Y-78000000D02*
X16042000Y-77860000D01*
X14072000Y-68720000D02*
X14072000Y-77860000D01*
X18012000Y-68720000D02*
X14072000Y-68720000D01*
X18012000Y-77860000D02*
X18012000Y-68720000D01*
X14072000Y-77860000D02*
X18012000Y-77860000D01*
%TO.C,C2*%
X44505225Y-77805000D02*
X44505225Y-78305000D01*
X44255225Y-78055000D02*
X44755225Y-78055000D01*
X49661000Y-79246000D02*
X49661000Y-79814000D01*
X49621000Y-79012000D02*
X49621000Y-80048000D01*
X49581000Y-78853000D02*
X49581000Y-80207000D01*
X49541000Y-78725000D02*
X49541000Y-80335000D01*
X49501000Y-78615000D02*
X49501000Y-80445000D01*
X49461000Y-78519000D02*
X49461000Y-80541000D01*
X49421000Y-78432000D02*
X49421000Y-80628000D01*
X49381000Y-78352000D02*
X49381000Y-80708000D01*
X49341000Y-80570000D02*
X49341000Y-80781000D01*
X49341000Y-78279000D02*
X49341000Y-78490000D01*
X49301000Y-80570000D02*
X49301000Y-80849000D01*
X49301000Y-78211000D02*
X49301000Y-78490000D01*
X49261000Y-80570000D02*
X49261000Y-80913000D01*
X49261000Y-78147000D02*
X49261000Y-78490000D01*
X49221000Y-80570000D02*
X49221000Y-80973000D01*
X49221000Y-78087000D02*
X49221000Y-78490000D01*
X49181000Y-80570000D02*
X49181000Y-81030000D01*
X49181000Y-78030000D02*
X49181000Y-78490000D01*
X49141000Y-80570000D02*
X49141000Y-81084000D01*
X49141000Y-77976000D02*
X49141000Y-78490000D01*
X49101000Y-80570000D02*
X49101000Y-81135000D01*
X49101000Y-77925000D02*
X49101000Y-78490000D01*
X49061000Y-80570000D02*
X49061000Y-81183000D01*
X49061000Y-77877000D02*
X49061000Y-78490000D01*
X49021000Y-80570000D02*
X49021000Y-81229000D01*
X49021000Y-77831000D02*
X49021000Y-78490000D01*
X48981000Y-80570000D02*
X48981000Y-81273000D01*
X48981000Y-77787000D02*
X48981000Y-78490000D01*
X48941000Y-80570000D02*
X48941000Y-81315000D01*
X48941000Y-77745000D02*
X48941000Y-78490000D01*
X48901000Y-80570000D02*
X48901000Y-81356000D01*
X48901000Y-77704000D02*
X48901000Y-78490000D01*
X48861000Y-80570000D02*
X48861000Y-81394000D01*
X48861000Y-77666000D02*
X48861000Y-78490000D01*
X48821000Y-80570000D02*
X48821000Y-81431000D01*
X48821000Y-77629000D02*
X48821000Y-78490000D01*
X48781000Y-80570000D02*
X48781000Y-81467000D01*
X48781000Y-77593000D02*
X48781000Y-78490000D01*
X48741000Y-80570000D02*
X48741000Y-81501000D01*
X48741000Y-77559000D02*
X48741000Y-78490000D01*
X48701000Y-80570000D02*
X48701000Y-81534000D01*
X48701000Y-77526000D02*
X48701000Y-78490000D01*
X48661000Y-80570000D02*
X48661000Y-81565000D01*
X48661000Y-77495000D02*
X48661000Y-78490000D01*
X48621000Y-80570000D02*
X48621000Y-81595000D01*
X48621000Y-77465000D02*
X48621000Y-78490000D01*
X48581000Y-80570000D02*
X48581000Y-81625000D01*
X48581000Y-77435000D02*
X48581000Y-78490000D01*
X48541000Y-80570000D02*
X48541000Y-81652000D01*
X48541000Y-77408000D02*
X48541000Y-78490000D01*
X48501000Y-80570000D02*
X48501000Y-81679000D01*
X48501000Y-77381000D02*
X48501000Y-78490000D01*
X48461000Y-80570000D02*
X48461000Y-81705000D01*
X48461000Y-77355000D02*
X48461000Y-78490000D01*
X48421000Y-80570000D02*
X48421000Y-81730000D01*
X48421000Y-77330000D02*
X48421000Y-78490000D01*
X48381000Y-80570000D02*
X48381000Y-81754000D01*
X48381000Y-77306000D02*
X48381000Y-78490000D01*
X48341000Y-80570000D02*
X48341000Y-81777000D01*
X48341000Y-77283000D02*
X48341000Y-78490000D01*
X48301000Y-80570000D02*
X48301000Y-81798000D01*
X48301000Y-77262000D02*
X48301000Y-78490000D01*
X48261000Y-80570000D02*
X48261000Y-81820000D01*
X48261000Y-77240000D02*
X48261000Y-78490000D01*
X48221000Y-80570000D02*
X48221000Y-81840000D01*
X48221000Y-77220000D02*
X48221000Y-78490000D01*
X48181000Y-80570000D02*
X48181000Y-81859000D01*
X48181000Y-77201000D02*
X48181000Y-78490000D01*
X48141000Y-80570000D02*
X48141000Y-81878000D01*
X48141000Y-77182000D02*
X48141000Y-78490000D01*
X48101000Y-80570000D02*
X48101000Y-81895000D01*
X48101000Y-77165000D02*
X48101000Y-78490000D01*
X48061000Y-80570000D02*
X48061000Y-81912000D01*
X48061000Y-77148000D02*
X48061000Y-78490000D01*
X48021000Y-80570000D02*
X48021000Y-81928000D01*
X48021000Y-77132000D02*
X48021000Y-78490000D01*
X47981000Y-80570000D02*
X47981000Y-81944000D01*
X47981000Y-77116000D02*
X47981000Y-78490000D01*
X47941000Y-80570000D02*
X47941000Y-81958000D01*
X47941000Y-77102000D02*
X47941000Y-78490000D01*
X47901000Y-80570000D02*
X47901000Y-81972000D01*
X47901000Y-77088000D02*
X47901000Y-78490000D01*
X47861000Y-80570000D02*
X47861000Y-81985000D01*
X47861000Y-77075000D02*
X47861000Y-78490000D01*
X47821000Y-80570000D02*
X47821000Y-81998000D01*
X47821000Y-77062000D02*
X47821000Y-78490000D01*
X47781000Y-80570000D02*
X47781000Y-82010000D01*
X47781000Y-77050000D02*
X47781000Y-78490000D01*
X47740000Y-80570000D02*
X47740000Y-82021000D01*
X47740000Y-77039000D02*
X47740000Y-78490000D01*
X47700000Y-80570000D02*
X47700000Y-82031000D01*
X47700000Y-77029000D02*
X47700000Y-78490000D01*
X47660000Y-80570000D02*
X47660000Y-82041000D01*
X47660000Y-77019000D02*
X47660000Y-78490000D01*
X47620000Y-80570000D02*
X47620000Y-82050000D01*
X47620000Y-77010000D02*
X47620000Y-78490000D01*
X47580000Y-80570000D02*
X47580000Y-82058000D01*
X47580000Y-77002000D02*
X47580000Y-78490000D01*
X47540000Y-80570000D02*
X47540000Y-82066000D01*
X47540000Y-76994000D02*
X47540000Y-78490000D01*
X47500000Y-80570000D02*
X47500000Y-82073000D01*
X47500000Y-76987000D02*
X47500000Y-78490000D01*
X47460000Y-80570000D02*
X47460000Y-82080000D01*
X47460000Y-76980000D02*
X47460000Y-78490000D01*
X47420000Y-80570000D02*
X47420000Y-82086000D01*
X47420000Y-76974000D02*
X47420000Y-78490000D01*
X47380000Y-80570000D02*
X47380000Y-82091000D01*
X47380000Y-76969000D02*
X47380000Y-78490000D01*
X47340000Y-80570000D02*
X47340000Y-82095000D01*
X47340000Y-76965000D02*
X47340000Y-78490000D01*
X47300000Y-80570000D02*
X47300000Y-82099000D01*
X47300000Y-76961000D02*
X47300000Y-78490000D01*
X47260000Y-76957000D02*
X47260000Y-82103000D01*
X47220000Y-76954000D02*
X47220000Y-82106000D01*
X47180000Y-76952000D02*
X47180000Y-82108000D01*
X47140000Y-76951000D02*
X47140000Y-82109000D01*
X47100000Y-76950000D02*
X47100000Y-82110000D01*
X47060000Y-76950000D02*
X47060000Y-82110000D01*
X49680000Y-79530000D02*
G75*
G03*
X49680000Y-79530000I-2620000J0D01*
G01*
%TO.C,C1*%
X38235225Y-77805000D02*
X38235225Y-78305000D01*
X37985225Y-78055000D02*
X38485225Y-78055000D01*
X43391000Y-79246000D02*
X43391000Y-79814000D01*
X43351000Y-79012000D02*
X43351000Y-80048000D01*
X43311000Y-78853000D02*
X43311000Y-80207000D01*
X43271000Y-78725000D02*
X43271000Y-80335000D01*
X43231000Y-78615000D02*
X43231000Y-80445000D01*
X43191000Y-78519000D02*
X43191000Y-80541000D01*
X43151000Y-78432000D02*
X43151000Y-80628000D01*
X43111000Y-78352000D02*
X43111000Y-80708000D01*
X43071000Y-80570000D02*
X43071000Y-80781000D01*
X43071000Y-78279000D02*
X43071000Y-78490000D01*
X43031000Y-80570000D02*
X43031000Y-80849000D01*
X43031000Y-78211000D02*
X43031000Y-78490000D01*
X42991000Y-80570000D02*
X42991000Y-80913000D01*
X42991000Y-78147000D02*
X42991000Y-78490000D01*
X42951000Y-80570000D02*
X42951000Y-80973000D01*
X42951000Y-78087000D02*
X42951000Y-78490000D01*
X42911000Y-80570000D02*
X42911000Y-81030000D01*
X42911000Y-78030000D02*
X42911000Y-78490000D01*
X42871000Y-80570000D02*
X42871000Y-81084000D01*
X42871000Y-77976000D02*
X42871000Y-78490000D01*
X42831000Y-80570000D02*
X42831000Y-81135000D01*
X42831000Y-77925000D02*
X42831000Y-78490000D01*
X42791000Y-80570000D02*
X42791000Y-81183000D01*
X42791000Y-77877000D02*
X42791000Y-78490000D01*
X42751000Y-80570000D02*
X42751000Y-81229000D01*
X42751000Y-77831000D02*
X42751000Y-78490000D01*
X42711000Y-80570000D02*
X42711000Y-81273000D01*
X42711000Y-77787000D02*
X42711000Y-78490000D01*
X42671000Y-80570000D02*
X42671000Y-81315000D01*
X42671000Y-77745000D02*
X42671000Y-78490000D01*
X42631000Y-80570000D02*
X42631000Y-81356000D01*
X42631000Y-77704000D02*
X42631000Y-78490000D01*
X42591000Y-80570000D02*
X42591000Y-81394000D01*
X42591000Y-77666000D02*
X42591000Y-78490000D01*
X42551000Y-80570000D02*
X42551000Y-81431000D01*
X42551000Y-77629000D02*
X42551000Y-78490000D01*
X42511000Y-80570000D02*
X42511000Y-81467000D01*
X42511000Y-77593000D02*
X42511000Y-78490000D01*
X42471000Y-80570000D02*
X42471000Y-81501000D01*
X42471000Y-77559000D02*
X42471000Y-78490000D01*
X42431000Y-80570000D02*
X42431000Y-81534000D01*
X42431000Y-77526000D02*
X42431000Y-78490000D01*
X42391000Y-80570000D02*
X42391000Y-81565000D01*
X42391000Y-77495000D02*
X42391000Y-78490000D01*
X42351000Y-80570000D02*
X42351000Y-81595000D01*
X42351000Y-77465000D02*
X42351000Y-78490000D01*
X42311000Y-80570000D02*
X42311000Y-81625000D01*
X42311000Y-77435000D02*
X42311000Y-78490000D01*
X42271000Y-80570000D02*
X42271000Y-81652000D01*
X42271000Y-77408000D02*
X42271000Y-78490000D01*
X42231000Y-80570000D02*
X42231000Y-81679000D01*
X42231000Y-77381000D02*
X42231000Y-78490000D01*
X42191000Y-80570000D02*
X42191000Y-81705000D01*
X42191000Y-77355000D02*
X42191000Y-78490000D01*
X42151000Y-80570000D02*
X42151000Y-81730000D01*
X42151000Y-77330000D02*
X42151000Y-78490000D01*
X42111000Y-80570000D02*
X42111000Y-81754000D01*
X42111000Y-77306000D02*
X42111000Y-78490000D01*
X42071000Y-80570000D02*
X42071000Y-81777000D01*
X42071000Y-77283000D02*
X42071000Y-78490000D01*
X42031000Y-80570000D02*
X42031000Y-81798000D01*
X42031000Y-77262000D02*
X42031000Y-78490000D01*
X41991000Y-80570000D02*
X41991000Y-81820000D01*
X41991000Y-77240000D02*
X41991000Y-78490000D01*
X41951000Y-80570000D02*
X41951000Y-81840000D01*
X41951000Y-77220000D02*
X41951000Y-78490000D01*
X41911000Y-80570000D02*
X41911000Y-81859000D01*
X41911000Y-77201000D02*
X41911000Y-78490000D01*
X41871000Y-80570000D02*
X41871000Y-81878000D01*
X41871000Y-77182000D02*
X41871000Y-78490000D01*
X41831000Y-80570000D02*
X41831000Y-81895000D01*
X41831000Y-77165000D02*
X41831000Y-78490000D01*
X41791000Y-80570000D02*
X41791000Y-81912000D01*
X41791000Y-77148000D02*
X41791000Y-78490000D01*
X41751000Y-80570000D02*
X41751000Y-81928000D01*
X41751000Y-77132000D02*
X41751000Y-78490000D01*
X41711000Y-80570000D02*
X41711000Y-81944000D01*
X41711000Y-77116000D02*
X41711000Y-78490000D01*
X41671000Y-80570000D02*
X41671000Y-81958000D01*
X41671000Y-77102000D02*
X41671000Y-78490000D01*
X41631000Y-80570000D02*
X41631000Y-81972000D01*
X41631000Y-77088000D02*
X41631000Y-78490000D01*
X41591000Y-80570000D02*
X41591000Y-81985000D01*
X41591000Y-77075000D02*
X41591000Y-78490000D01*
X41551000Y-80570000D02*
X41551000Y-81998000D01*
X41551000Y-77062000D02*
X41551000Y-78490000D01*
X41511000Y-80570000D02*
X41511000Y-82010000D01*
X41511000Y-77050000D02*
X41511000Y-78490000D01*
X41470000Y-80570000D02*
X41470000Y-82021000D01*
X41470000Y-77039000D02*
X41470000Y-78490000D01*
X41430000Y-80570000D02*
X41430000Y-82031000D01*
X41430000Y-77029000D02*
X41430000Y-78490000D01*
X41390000Y-80570000D02*
X41390000Y-82041000D01*
X41390000Y-77019000D02*
X41390000Y-78490000D01*
X41350000Y-80570000D02*
X41350000Y-82050000D01*
X41350000Y-77010000D02*
X41350000Y-78490000D01*
X41310000Y-80570000D02*
X41310000Y-82058000D01*
X41310000Y-77002000D02*
X41310000Y-78490000D01*
X41270000Y-80570000D02*
X41270000Y-82066000D01*
X41270000Y-76994000D02*
X41270000Y-78490000D01*
X41230000Y-80570000D02*
X41230000Y-82073000D01*
X41230000Y-76987000D02*
X41230000Y-78490000D01*
X41190000Y-80570000D02*
X41190000Y-82080000D01*
X41190000Y-76980000D02*
X41190000Y-78490000D01*
X41150000Y-80570000D02*
X41150000Y-82086000D01*
X41150000Y-76974000D02*
X41150000Y-78490000D01*
X41110000Y-80570000D02*
X41110000Y-82091000D01*
X41110000Y-76969000D02*
X41110000Y-78490000D01*
X41070000Y-80570000D02*
X41070000Y-82095000D01*
X41070000Y-76965000D02*
X41070000Y-78490000D01*
X41030000Y-80570000D02*
X41030000Y-82099000D01*
X41030000Y-76961000D02*
X41030000Y-78490000D01*
X40990000Y-76957000D02*
X40990000Y-82103000D01*
X40950000Y-76954000D02*
X40950000Y-82106000D01*
X40910000Y-76952000D02*
X40910000Y-82108000D01*
X40870000Y-76951000D02*
X40870000Y-82109000D01*
X40830000Y-76950000D02*
X40830000Y-82110000D01*
X40790000Y-76950000D02*
X40790000Y-82110000D01*
X43410000Y-79530000D02*
G75*
G03*
X43410000Y-79530000I-2620000J0D01*
G01*
%TO.C,J4*%
X34984000Y-77050000D02*
X33654000Y-77050000D01*
X33654000Y-77050000D02*
X33654000Y-75720000D01*
X33654000Y-74450000D02*
X33654000Y-69310000D01*
X36314000Y-69310000D02*
X33654000Y-69310000D01*
X36314000Y-74450000D02*
X36314000Y-69310000D01*
X36314000Y-74450000D02*
X33654000Y-74450000D01*
%TO.C,R4*%
X31612000Y-52970000D02*
X35052000Y-52970000D01*
X35052000Y-52970000D02*
X35052000Y-43730000D01*
X35052000Y-43730000D02*
X31612000Y-43730000D01*
X31612000Y-43730000D02*
X31612000Y-52970000D01*
X33332000Y-53660000D02*
X33332000Y-52970000D01*
X33332000Y-43040000D02*
X33332000Y-43730000D01*
%TO.C,J12*%
X42100000Y-3125000D02*
X42100000Y-5625000D01*
X42100000Y-5625000D02*
X41050000Y-5625000D01*
X41050000Y-5625000D02*
X41050000Y-6615000D01*
X35880000Y-3125000D02*
X35880000Y-5625000D01*
X35880000Y-5625000D02*
X36930000Y-5625000D01*
X40930000Y-1155000D02*
X37050000Y-1155000D01*
%TO.C,J8*%
X11582000Y-46570000D02*
G75*
G03*
X11582000Y-46570000I-2180000J0D01*
G01*
X11582000Y-51570000D02*
G75*
G03*
X11582000Y-51570000I-2180000J0D01*
G01*
X4802000Y-44010000D02*
X4802000Y-54130000D01*
X5902000Y-44010000D02*
X5902000Y-54130000D01*
X13462000Y-44010000D02*
X13462000Y-54130000D01*
X4342000Y-44010000D02*
X4342000Y-54130000D01*
X13462000Y-44010000D02*
X4342000Y-44010000D01*
X13462000Y-54130000D02*
X4342000Y-54130000D01*
X10790000Y-48224000D02*
X10683000Y-48117000D01*
X7855000Y-45288000D02*
X7748000Y-45182000D01*
X11056000Y-47958000D02*
X10949000Y-47851000D01*
X8121000Y-45022000D02*
X8014000Y-44916000D01*
X10790000Y-53224000D02*
X10394000Y-52829000D01*
X8128000Y-50563000D02*
X7748000Y-50183000D01*
X11056000Y-52958000D02*
X10676000Y-52578000D01*
X8410000Y-50312000D02*
X8014000Y-49917000D01*
X4742000Y-43770000D02*
X4102000Y-43770000D01*
X4102000Y-43770000D02*
X4102000Y-44170000D01*
%TO.C,R2*%
X21184000Y-52970000D02*
X24624000Y-52970000D01*
X24624000Y-52970000D02*
X24624000Y-43730000D01*
X24624000Y-43730000D02*
X21184000Y-43730000D01*
X21184000Y-43730000D02*
X21184000Y-52970000D01*
X22904000Y-53660000D02*
X22904000Y-52970000D01*
X22904000Y-43040000D02*
X22904000Y-43730000D01*
%TO.C,R1*%
X16004000Y-52970000D02*
X19444000Y-52970000D01*
X19444000Y-52970000D02*
X19444000Y-43730000D01*
X19444000Y-43730000D02*
X16004000Y-43730000D01*
X16004000Y-43730000D02*
X16004000Y-52970000D01*
X17724000Y-53660000D02*
X17724000Y-52970000D01*
X17724000Y-43040000D02*
X17724000Y-43730000D01*
%TO.C,R3*%
X26502000Y-52970000D02*
X29942000Y-52970000D01*
X29942000Y-52970000D02*
X29942000Y-43730000D01*
X29942000Y-43730000D02*
X26502000Y-43730000D01*
X26502000Y-43730000D02*
X26502000Y-52970000D01*
X28222000Y-53660000D02*
X28222000Y-52970000D01*
X28222000Y-43040000D02*
X28222000Y-43730000D01*
%TO.C,J13*%
D10*
X10786476Y-89208380D02*
X10786476Y-89922666D01*
X10738857Y-90065523D01*
X10643619Y-90160761D01*
X10500761Y-90208380D01*
X10405523Y-90208380D01*
X11786476Y-90208380D02*
X11215047Y-90208380D01*
X11500761Y-90208380D02*
X11500761Y-89208380D01*
X11405523Y-89351238D01*
X11310285Y-89446476D01*
X11215047Y-89494095D01*
X12119809Y-89208380D02*
X12738857Y-89208380D01*
X12405523Y-89589333D01*
X12548380Y-89589333D01*
X12643619Y-89636952D01*
X12691238Y-89684571D01*
X12738857Y-89779809D01*
X12738857Y-90017904D01*
X12691238Y-90113142D01*
X12643619Y-90160761D01*
X12548380Y-90208380D01*
X12262666Y-90208380D01*
X12167428Y-90160761D01*
X12119809Y-90113142D01*
%TO.C,J9*%
X4214380Y-59223333D02*
X4928666Y-59223333D01*
X5071523Y-59270952D01*
X5166761Y-59366190D01*
X5214380Y-59509047D01*
X5214380Y-59604285D01*
X5214380Y-58699523D02*
X5214380Y-58509047D01*
X5166761Y-58413809D01*
X5119142Y-58366190D01*
X4976285Y-58270952D01*
X4785809Y-58223333D01*
X4404857Y-58223333D01*
X4309619Y-58270952D01*
X4262000Y-58318571D01*
X4214380Y-58413809D01*
X4214380Y-58604285D01*
X4262000Y-58699523D01*
X4309619Y-58747142D01*
X4404857Y-58794761D01*
X4642952Y-58794761D01*
X4738190Y-58747142D01*
X4785809Y-58699523D01*
X4833428Y-58604285D01*
X4833428Y-58413809D01*
X4785809Y-58318571D01*
X4738190Y-58270952D01*
X4642952Y-58223333D01*
%TO.C,J15*%
X35434380Y-88499523D02*
X36148666Y-88499523D01*
X36291523Y-88547142D01*
X36386761Y-88642380D01*
X36434380Y-88785238D01*
X36434380Y-88880476D01*
X36434380Y-87499523D02*
X36434380Y-88070952D01*
X36434380Y-87785238D02*
X35434380Y-87785238D01*
X35577238Y-87880476D01*
X35672476Y-87975714D01*
X35720095Y-88070952D01*
X35434380Y-86594761D02*
X35434380Y-87070952D01*
X35910571Y-87118571D01*
X35862952Y-87070952D01*
X35815333Y-86975714D01*
X35815333Y-86737619D01*
X35862952Y-86642380D01*
X35910571Y-86594761D01*
X36005809Y-86547142D01*
X36243904Y-86547142D01*
X36339142Y-86594761D01*
X36386761Y-86642380D01*
X36434380Y-86737619D01*
X36434380Y-86975714D01*
X36386761Y-87070952D01*
X36339142Y-87118571D01*
%TO.C,J14*%
X48014380Y-15839523D02*
X48728666Y-15839523D01*
X48871523Y-15887142D01*
X48966761Y-15982380D01*
X49014380Y-16125238D01*
X49014380Y-16220476D01*
X49014380Y-14839523D02*
X49014380Y-15410952D01*
X49014380Y-15125238D02*
X48014380Y-15125238D01*
X48157238Y-15220476D01*
X48252476Y-15315714D01*
X48300095Y-15410952D01*
X48347714Y-13982380D02*
X49014380Y-13982380D01*
X47966761Y-14220476D02*
X48681047Y-14458571D01*
X48681047Y-13839523D01*
%TO.C,J11*%
X2604380Y-14069523D02*
X3318666Y-14069523D01*
X3461523Y-14117142D01*
X3556761Y-14212380D01*
X3604380Y-14355238D01*
X3604380Y-14450476D01*
X3604380Y-13069523D02*
X3604380Y-13640952D01*
X3604380Y-13355238D02*
X2604380Y-13355238D01*
X2747238Y-13450476D01*
X2842476Y-13545714D01*
X2890095Y-13640952D01*
X3604380Y-12117142D02*
X3604380Y-12688571D01*
X3604380Y-12402857D02*
X2604380Y-12402857D01*
X2747238Y-12498095D01*
X2842476Y-12593333D01*
X2890095Y-12688571D01*
%TO.C,J6*%
X5334380Y-9873333D02*
X6048666Y-9873333D01*
X6191523Y-9920952D01*
X6286761Y-10016190D01*
X6334380Y-10159047D01*
X6334380Y-10254285D01*
X5334380Y-8968571D02*
X5334380Y-9159047D01*
X5382000Y-9254285D01*
X5429619Y-9301904D01*
X5572476Y-9397142D01*
X5762952Y-9444761D01*
X6143904Y-9444761D01*
X6239142Y-9397142D01*
X6286761Y-9349523D01*
X6334380Y-9254285D01*
X6334380Y-9063809D01*
X6286761Y-8968571D01*
X6239142Y-8920952D01*
X6143904Y-8873333D01*
X5905809Y-8873333D01*
X5810571Y-8920952D01*
X5762952Y-8968571D01*
X5715333Y-9063809D01*
X5715333Y-9254285D01*
X5762952Y-9349523D01*
X5810571Y-9397142D01*
X5905809Y-9444761D01*
%TO.C,J17*%
X24002380Y-35029523D02*
X24716666Y-35029523D01*
X24859523Y-35077142D01*
X24954761Y-35172380D01*
X25002380Y-35315238D01*
X25002380Y-35410476D01*
X25002380Y-34029523D02*
X25002380Y-34600952D01*
X25002380Y-34315238D02*
X24002380Y-34315238D01*
X24145238Y-34410476D01*
X24240476Y-34505714D01*
X24288095Y-34600952D01*
X24002380Y-33696190D02*
X24002380Y-33029523D01*
X25002380Y-33458095D01*
%TO.C,J18*%
X39566476Y-89562380D02*
X39566476Y-90276666D01*
X39518857Y-90419523D01*
X39423619Y-90514761D01*
X39280761Y-90562380D01*
X39185523Y-90562380D01*
X40566476Y-90562380D02*
X39995047Y-90562380D01*
X40280761Y-90562380D02*
X40280761Y-89562380D01*
X40185523Y-89705238D01*
X40090285Y-89800476D01*
X39995047Y-89848095D01*
X41137904Y-89990952D02*
X41042666Y-89943333D01*
X40995047Y-89895714D01*
X40947428Y-89800476D01*
X40947428Y-89752857D01*
X40995047Y-89657619D01*
X41042666Y-89610000D01*
X41137904Y-89562380D01*
X41328380Y-89562380D01*
X41423619Y-89610000D01*
X41471238Y-89657619D01*
X41518857Y-89752857D01*
X41518857Y-89800476D01*
X41471238Y-89895714D01*
X41423619Y-89943333D01*
X41328380Y-89990952D01*
X41137904Y-89990952D01*
X41042666Y-90038571D01*
X40995047Y-90086190D01*
X40947428Y-90181428D01*
X40947428Y-90371904D01*
X40995047Y-90467142D01*
X41042666Y-90514761D01*
X41137904Y-90562380D01*
X41328380Y-90562380D01*
X41423619Y-90514761D01*
X41471238Y-90467142D01*
X41518857Y-90371904D01*
X41518857Y-90181428D01*
X41471238Y-90086190D01*
X41423619Y-90038571D01*
X41328380Y-89990952D01*
%TO.C,J5*%
X3776666Y-78112380D02*
X3776666Y-78826666D01*
X3729047Y-78969523D01*
X3633809Y-79064761D01*
X3490952Y-79112380D01*
X3395714Y-79112380D01*
X4729047Y-78112380D02*
X4252857Y-78112380D01*
X4205238Y-78588571D01*
X4252857Y-78540952D01*
X4348095Y-78493333D01*
X4586190Y-78493333D01*
X4681428Y-78540952D01*
X4729047Y-78588571D01*
X4776666Y-78683809D01*
X4776666Y-78921904D01*
X4729047Y-79017142D01*
X4681428Y-79064761D01*
X4586190Y-79112380D01*
X4348095Y-79112380D01*
X4252857Y-79064761D01*
X4205238Y-79017142D01*
%TO.C,SW2*%
X40862761Y-72533333D02*
X40910380Y-72390476D01*
X40910380Y-72152380D01*
X40862761Y-72057142D01*
X40815142Y-72009523D01*
X40719904Y-71961904D01*
X40624666Y-71961904D01*
X40529428Y-72009523D01*
X40481809Y-72057142D01*
X40434190Y-72152380D01*
X40386571Y-72342857D01*
X40338952Y-72438095D01*
X40291333Y-72485714D01*
X40196095Y-72533333D01*
X40100857Y-72533333D01*
X40005619Y-72485714D01*
X39958000Y-72438095D01*
X39910380Y-72342857D01*
X39910380Y-72104761D01*
X39958000Y-71961904D01*
X39910380Y-71628571D02*
X40910380Y-71390476D01*
X40196095Y-71200000D01*
X40910380Y-71009523D01*
X39910380Y-70771428D01*
X40005619Y-70438095D02*
X39958000Y-70390476D01*
X39910380Y-70295238D01*
X39910380Y-70057142D01*
X39958000Y-69961904D01*
X40005619Y-69914285D01*
X40100857Y-69866666D01*
X40196095Y-69866666D01*
X40338952Y-69914285D01*
X40910380Y-70485714D01*
X40910380Y-69866666D01*
%TO.C,SW1*%
X40608761Y-50907333D02*
X40656380Y-50764476D01*
X40656380Y-50526380D01*
X40608761Y-50431142D01*
X40561142Y-50383523D01*
X40465904Y-50335904D01*
X40370666Y-50335904D01*
X40275428Y-50383523D01*
X40227809Y-50431142D01*
X40180190Y-50526380D01*
X40132571Y-50716857D01*
X40084952Y-50812095D01*
X40037333Y-50859714D01*
X39942095Y-50907333D01*
X39846857Y-50907333D01*
X39751619Y-50859714D01*
X39704000Y-50812095D01*
X39656380Y-50716857D01*
X39656380Y-50478761D01*
X39704000Y-50335904D01*
X39656380Y-50002571D02*
X40656380Y-49764476D01*
X39942095Y-49574000D01*
X40656380Y-49383523D01*
X39656380Y-49145428D01*
X40656380Y-48240666D02*
X40656380Y-48812095D01*
X40656380Y-48526380D02*
X39656380Y-48526380D01*
X39799238Y-48621619D01*
X39894476Y-48716857D01*
X39942095Y-48812095D01*
%TO.C,J10*%
X46962476Y-38372380D02*
X46962476Y-39086666D01*
X46914857Y-39229523D01*
X46819619Y-39324761D01*
X46676761Y-39372380D01*
X46581523Y-39372380D01*
X47962476Y-39372380D02*
X47391047Y-39372380D01*
X47676761Y-39372380D02*
X47676761Y-38372380D01*
X47581523Y-38515238D01*
X47486285Y-38610476D01*
X47391047Y-38658095D01*
X48581523Y-38372380D02*
X48676761Y-38372380D01*
X48772000Y-38420000D01*
X48819619Y-38467619D01*
X48867238Y-38562857D01*
X48914857Y-38753333D01*
X48914857Y-38991428D01*
X48867238Y-39181904D01*
X48819619Y-39277142D01*
X48772000Y-39324761D01*
X48676761Y-39372380D01*
X48581523Y-39372380D01*
X48486285Y-39324761D01*
X48438666Y-39277142D01*
X48391047Y-39181904D01*
X48343428Y-38991428D01*
X48343428Y-38753333D01*
X48391047Y-38562857D01*
X48438666Y-38467619D01*
X48486285Y-38420000D01*
X48581523Y-38372380D01*
%TO.C,J2*%
X4284380Y-83603333D02*
X4998666Y-83603333D01*
X5141523Y-83650952D01*
X5236761Y-83746190D01*
X5284380Y-83889047D01*
X5284380Y-83984285D01*
X4379619Y-83174761D02*
X4332000Y-83127142D01*
X4284380Y-83031904D01*
X4284380Y-82793809D01*
X4332000Y-82698571D01*
X4379619Y-82650952D01*
X4474857Y-82603333D01*
X4570095Y-82603333D01*
X4712952Y-82650952D01*
X5284380Y-83222380D01*
X5284380Y-82603333D01*
%TO.C,J3*%
X47388666Y-62522380D02*
X47388666Y-63236666D01*
X47341047Y-63379523D01*
X47245809Y-63474761D01*
X47102952Y-63522380D01*
X47007714Y-63522380D01*
X47769619Y-62522380D02*
X48388666Y-62522380D01*
X48055333Y-62903333D01*
X48198190Y-62903333D01*
X48293428Y-62950952D01*
X48341047Y-62998571D01*
X48388666Y-63093809D01*
X48388666Y-63331904D01*
X48341047Y-63427142D01*
X48293428Y-63474761D01*
X48198190Y-63522380D01*
X47912476Y-63522380D01*
X47817238Y-63474761D01*
X47769619Y-63427142D01*
%TO.C,D1*%
X15351904Y-72262380D02*
X15351904Y-71262380D01*
X15590000Y-71262380D01*
X15732857Y-71310000D01*
X15828095Y-71405238D01*
X15875714Y-71500476D01*
X15923333Y-71690952D01*
X15923333Y-71833809D01*
X15875714Y-72024285D01*
X15828095Y-72119523D01*
X15732857Y-72214761D01*
X15590000Y-72262380D01*
X15351904Y-72262380D01*
X16875714Y-72262380D02*
X16304285Y-72262380D01*
X16590000Y-72262380D02*
X16590000Y-71262380D01*
X16494761Y-71405238D01*
X16399523Y-71500476D01*
X16304285Y-71548095D01*
X16744380Y-75801904D02*
X15744380Y-75801904D01*
X16744380Y-75230476D02*
X16172952Y-75659047D01*
X15744380Y-75230476D02*
X16315809Y-75801904D01*
%TO.C,C2*%
X49683333Y-77337142D02*
X49635714Y-77384761D01*
X49492857Y-77432380D01*
X49397619Y-77432380D01*
X49254761Y-77384761D01*
X49159523Y-77289523D01*
X49111904Y-77194285D01*
X49064285Y-77003809D01*
X49064285Y-76860952D01*
X49111904Y-76670476D01*
X49159523Y-76575238D01*
X49254761Y-76480000D01*
X49397619Y-76432380D01*
X49492857Y-76432380D01*
X49635714Y-76480000D01*
X49683333Y-76527619D01*
X50064285Y-76527619D02*
X50111904Y-76480000D01*
X50207142Y-76432380D01*
X50445238Y-76432380D01*
X50540476Y-76480000D01*
X50588095Y-76527619D01*
X50635714Y-76622857D01*
X50635714Y-76718095D01*
X50588095Y-76860952D01*
X50016666Y-77432380D01*
X50635714Y-77432380D01*
%TO.C,C1*%
X43513333Y-77277142D02*
X43465714Y-77324761D01*
X43322857Y-77372380D01*
X43227619Y-77372380D01*
X43084761Y-77324761D01*
X42989523Y-77229523D01*
X42941904Y-77134285D01*
X42894285Y-76943809D01*
X42894285Y-76800952D01*
X42941904Y-76610476D01*
X42989523Y-76515238D01*
X43084761Y-76420000D01*
X43227619Y-76372380D01*
X43322857Y-76372380D01*
X43465714Y-76420000D01*
X43513333Y-76467619D01*
X44465714Y-77372380D02*
X43894285Y-77372380D01*
X44180000Y-77372380D02*
X44180000Y-76372380D01*
X44084761Y-76515238D01*
X43989523Y-76610476D01*
X43894285Y-76658095D01*
%TO.C,J4*%
X34536666Y-77510380D02*
X34536666Y-78224666D01*
X34489047Y-78367523D01*
X34393809Y-78462761D01*
X34250952Y-78510380D01*
X34155714Y-78510380D01*
X35441428Y-77843714D02*
X35441428Y-78510380D01*
X35203333Y-77462761D02*
X34965238Y-78177047D01*
X35584285Y-78177047D01*
%TO.C,R4*%
X33035333Y-57072380D02*
X32702000Y-56596190D01*
X32463904Y-57072380D02*
X32463904Y-56072380D01*
X32844857Y-56072380D01*
X32940095Y-56120000D01*
X32987714Y-56167619D01*
X33035333Y-56262857D01*
X33035333Y-56405714D01*
X32987714Y-56500952D01*
X32940095Y-56548571D01*
X32844857Y-56596190D01*
X32463904Y-56596190D01*
X33892476Y-56405714D02*
X33892476Y-57072380D01*
X33654380Y-56024761D02*
X33416285Y-56739047D01*
X34035333Y-56739047D01*
%TO.C,J12*%
X38166476Y-3332380D02*
X38166476Y-4046666D01*
X38118857Y-4189523D01*
X38023619Y-4284761D01*
X37880761Y-4332380D01*
X37785523Y-4332380D01*
X39166476Y-4332380D02*
X38595047Y-4332380D01*
X38880761Y-4332380D02*
X38880761Y-3332380D01*
X38785523Y-3475238D01*
X38690285Y-3570476D01*
X38595047Y-3618095D01*
X39547428Y-3427619D02*
X39595047Y-3380000D01*
X39690285Y-3332380D01*
X39928380Y-3332380D01*
X40023619Y-3380000D01*
X40071238Y-3427619D01*
X40118857Y-3522857D01*
X40118857Y-3618095D01*
X40071238Y-3760952D01*
X39499809Y-4332380D01*
X40118857Y-4332380D01*
%TO.C,J8*%
X12508666Y-42212380D02*
X12508666Y-42926666D01*
X12461047Y-43069523D01*
X12365809Y-43164761D01*
X12222952Y-43212380D01*
X12127714Y-43212380D01*
X13127714Y-42640952D02*
X13032476Y-42593333D01*
X12984857Y-42545714D01*
X12937238Y-42450476D01*
X12937238Y-42402857D01*
X12984857Y-42307619D01*
X13032476Y-42260000D01*
X13127714Y-42212380D01*
X13318190Y-42212380D01*
X13413428Y-42260000D01*
X13461047Y-42307619D01*
X13508666Y-42402857D01*
X13508666Y-42450476D01*
X13461047Y-42545714D01*
X13413428Y-42593333D01*
X13318190Y-42640952D01*
X13127714Y-42640952D01*
X13032476Y-42688571D01*
X12984857Y-42736190D01*
X12937238Y-42831428D01*
X12937238Y-43021904D01*
X12984857Y-43117142D01*
X13032476Y-43164761D01*
X13127714Y-43212380D01*
X13318190Y-43212380D01*
X13413428Y-43164761D01*
X13461047Y-43117142D01*
X13508666Y-43021904D01*
X13508666Y-42831428D01*
X13461047Y-42736190D01*
X13413428Y-42688571D01*
X13318190Y-42640952D01*
%TO.C,R2*%
X22707333Y-57072380D02*
X22374000Y-56596190D01*
X22135904Y-57072380D02*
X22135904Y-56072380D01*
X22516857Y-56072380D01*
X22612095Y-56120000D01*
X22659714Y-56167619D01*
X22707333Y-56262857D01*
X22707333Y-56405714D01*
X22659714Y-56500952D01*
X22612095Y-56548571D01*
X22516857Y-56596190D01*
X22135904Y-56596190D01*
X23088285Y-56167619D02*
X23135904Y-56120000D01*
X23231142Y-56072380D01*
X23469238Y-56072380D01*
X23564476Y-56120000D01*
X23612095Y-56167619D01*
X23659714Y-56262857D01*
X23659714Y-56358095D01*
X23612095Y-56500952D01*
X23040666Y-57072380D01*
X23659714Y-57072380D01*
%TO.C,R1*%
X17527333Y-57072380D02*
X17194000Y-56596190D01*
X16955904Y-57072380D02*
X16955904Y-56072380D01*
X17336857Y-56072380D01*
X17432095Y-56120000D01*
X17479714Y-56167619D01*
X17527333Y-56262857D01*
X17527333Y-56405714D01*
X17479714Y-56500952D01*
X17432095Y-56548571D01*
X17336857Y-56596190D01*
X16955904Y-56596190D01*
X18479714Y-57072380D02*
X17908285Y-57072380D01*
X18194000Y-57072380D02*
X18194000Y-56072380D01*
X18098761Y-56215238D01*
X18003523Y-56310476D01*
X17908285Y-56358095D01*
%TO.C,R3*%
X28095333Y-57072380D02*
X27762000Y-56596190D01*
X27523904Y-57072380D02*
X27523904Y-56072380D01*
X27904857Y-56072380D01*
X28000095Y-56120000D01*
X28047714Y-56167619D01*
X28095333Y-56262857D01*
X28095333Y-56405714D01*
X28047714Y-56500952D01*
X28000095Y-56548571D01*
X27904857Y-56596190D01*
X27523904Y-56596190D01*
X28428666Y-56072380D02*
X29047714Y-56072380D01*
X28714380Y-56453333D01*
X28857238Y-56453333D01*
X28952476Y-56500952D01*
X29000095Y-56548571D01*
X29047714Y-56643809D01*
X29047714Y-56881904D01*
X29000095Y-56977142D01*
X28952476Y-57024761D01*
X28857238Y-57072380D01*
X28571523Y-57072380D01*
X28476285Y-57024761D01*
X28428666Y-56977142D01*
%TD*%
M02*
