%TF.GenerationSoftware,KiCad,Pcbnew,5.1.9-73d0e3b20d~88~ubuntu18.04.1*%
%TF.CreationDate,2021-05-13T18:16:41-04:00*%
%TF.ProjectId,remote,72656d6f-7465-42e6-9b69-6361645f7063,rev?*%
%TF.SameCoordinates,Original*%
%TF.FileFunction,Soldermask,Top*%
%TF.FilePolarity,Negative*%
%FSLAX46Y46*%
G04 Gerber Fmt 4.6, Leading zero omitted, Abs format (unit mm)*
G04 Created by KiCad (PCBNEW 5.1.9-73d0e3b20d~88~ubuntu18.04.1) date 2021-05-13 18:16:41*
%MOMM*%
%LPD*%
G01*
G04 APERTURE LIST*
%ADD10C,3.600000*%
%ADD11O,1.800000X1.800000*%
%ADD12O,1.700000X1.700000*%
%ADD13C,1.700000*%
%ADD14C,1.800000*%
%ADD15C,2.700000*%
%ADD16C,2.300000*%
%ADD17C,3.800000*%
G04 APERTURE END LIST*
D10*
%TO.C,H6*%
X239852200Y38557200D03*
%TD*%
%TO.C,H5*%
X239877600Y63982600D03*
%TD*%
D11*
%TO.C,J2*%
X240893600Y-6248400D03*
X240893600Y-3708400D03*
X240893600Y-1168400D03*
X240893600Y1371600D03*
X240893600Y3911600D03*
X240893600Y6451600D03*
G36*
G01*
X239993600Y8141600D02*
X239993600Y9841600D01*
G75*
G02*
X240043600Y9891600I50000J0D01*
G01*
X241743600Y9891600D01*
G75*
G02*
X241793600Y9841600I0J-50000D01*
G01*
X241793600Y8141600D01*
G75*
G02*
X241743600Y8091600I-50000J0D01*
G01*
X240043600Y8091600D01*
G75*
G02*
X239993600Y8141600I0J50000D01*
G01*
G37*
%TD*%
D12*
%TO.C,SW2*%
X229666800Y20370800D03*
X237286800Y15290800D03*
X229666800Y17830800D03*
X237286800Y17830800D03*
X229666800Y15290800D03*
G36*
G01*
X238136800Y21170800D02*
X238136800Y19570800D01*
G75*
G02*
X238086800Y19520800I-50000J0D01*
G01*
X236486800Y19520800D01*
G75*
G02*
X236436800Y19570800I0J50000D01*
G01*
X236436800Y21170800D01*
G75*
G02*
X236486800Y21220800I50000J0D01*
G01*
X238086800Y21220800D01*
G75*
G02*
X238136800Y21170800I0J-50000D01*
G01*
G37*
%TD*%
%TO.C,R22*%
X222148400Y27787600D03*
D13*
X209448400Y27787600D03*
%TD*%
%TO.C,R20*%
X222554800Y3302000D03*
D12*
X209854800Y3302000D03*
%TD*%
%TO.C,R18*%
X222148400Y23114000D03*
D13*
X209448400Y23114000D03*
%TD*%
D12*
%TO.C,R16*%
X209854800Y7975600D03*
D13*
X222554800Y7975600D03*
%TD*%
%TO.C,J4*%
G36*
G01*
X210931600Y-10489600D02*
X209131600Y-10489600D01*
G75*
G02*
X208231600Y-9589600I0J900000D01*
G01*
X208231600Y-7789600D01*
G75*
G02*
X209131600Y-6889600I900000J0D01*
G01*
X210931600Y-6889600D01*
G75*
G02*
X211831600Y-7789600I0J-900000D01*
G01*
X211831600Y-9589600D01*
G75*
G02*
X210931600Y-10489600I-900000J0D01*
G01*
G37*
G36*
G01*
X215756600Y-13239600D02*
X213706600Y-13239600D01*
G75*
G02*
X212931600Y-12464600I0J775000D01*
G01*
X212931600Y-10914600D01*
G75*
G02*
X213706600Y-10139600I775000J0D01*
G01*
X215756600Y-10139600D01*
G75*
G02*
X216531600Y-10914600I0J-775000D01*
G01*
X216531600Y-12464600D01*
G75*
G02*
X215756600Y-13239600I-775000J0D01*
G01*
G37*
G36*
G01*
X216481600Y-7489600D02*
X212981600Y-7489600D01*
G75*
G02*
X212931600Y-7439600I0J50000D01*
G01*
X212931600Y-3939600D01*
G75*
G02*
X212981600Y-3889600I50000J0D01*
G01*
X216481600Y-3889600D01*
G75*
G02*
X216531600Y-3939600I0J-50000D01*
G01*
X216531600Y-7439600D01*
G75*
G02*
X216481600Y-7489600I-50000J0D01*
G01*
G37*
%TD*%
D12*
%TO.C,R14*%
X219100400Y56032400D03*
D13*
X219100400Y43332400D03*
%TD*%
D14*
%TO.C,SW3*%
X235762800Y-1879600D03*
X235762800Y4620400D03*
X231262800Y-1879600D03*
X231262800Y4620400D03*
%TD*%
D15*
%TO.C,J7*%
X199774800Y-12700000D03*
G36*
G01*
X206124800Y-11400000D02*
X206124800Y-14000000D01*
G75*
G02*
X206074800Y-14050000I-50000J0D01*
G01*
X203474800Y-14050000D01*
G75*
G02*
X203424800Y-14000000I0J50000D01*
G01*
X203424800Y-11400000D01*
G75*
G02*
X203474800Y-11350000I50000J0D01*
G01*
X206074800Y-11350000D01*
G75*
G02*
X206124800Y-11400000I0J-50000D01*
G01*
G37*
%TD*%
D16*
%TO.C,H10*%
X227177600Y-11023600D03*
%TD*%
%TO.C,H9*%
X222148400Y-11023600D03*
%TD*%
%TO.C,H8*%
X227126800Y-6096000D03*
%TD*%
%TO.C,H7*%
X222097600Y-6045200D03*
%TD*%
D12*
%TO.C,R4*%
X219659200Y65026777D03*
D13*
X206959200Y65026777D03*
%TD*%
D12*
%TO.C,R2*%
X219659200Y69218240D03*
D13*
X206959200Y69218240D03*
%TD*%
D12*
%TO.C,R6*%
X223773538Y56083200D03*
D13*
X223773538Y43383200D03*
%TD*%
%TO.C,J1*%
G36*
G01*
X233844200Y74436400D02*
X232144200Y74436400D01*
G75*
G02*
X232094200Y74486400I0J50000D01*
G01*
X232094200Y76186400D01*
G75*
G02*
X232144200Y76236400I50000J0D01*
G01*
X233844200Y76236400D01*
G75*
G02*
X233894200Y76186400I0J-50000D01*
G01*
X233894200Y74486400D01*
G75*
G02*
X233844200Y74436400I-50000J0D01*
G01*
G37*
D11*
X235534200Y75336400D03*
X238074200Y75336400D03*
X240614200Y75336400D03*
%TD*%
%TO.C,TP4*%
G36*
G01*
X240046420Y73665460D02*
X240046420Y74665460D01*
G75*
G02*
X240096420Y74715460I50000J0D01*
G01*
X241096420Y74715460D01*
G75*
G02*
X241146420Y74665460I0J-50000D01*
G01*
X241146420Y73665460D01*
G75*
G02*
X241096420Y73615460I-50000J0D01*
G01*
X240096420Y73615460D01*
G75*
G02*
X240046420Y73665460I0J50000D01*
G01*
G37*
%TD*%
%TO.C,TP3*%
G36*
G01*
X237496260Y73673080D02*
X237496260Y74673080D01*
G75*
G02*
X237546260Y74723080I50000J0D01*
G01*
X238546260Y74723080D01*
G75*
G02*
X238596260Y74673080I0J-50000D01*
G01*
X238596260Y73673080D01*
G75*
G02*
X238546260Y73623080I-50000J0D01*
G01*
X237546260Y73623080D01*
G75*
G02*
X237496260Y73673080I0J50000D01*
G01*
G37*
%TD*%
%TO.C,TP2*%
G36*
G01*
X235007060Y73612120D02*
X235007060Y74612120D01*
G75*
G02*
X235057060Y74662120I50000J0D01*
G01*
X236057060Y74662120D01*
G75*
G02*
X236107060Y74612120I0J-50000D01*
G01*
X236107060Y73612120D01*
G75*
G02*
X236057060Y73562120I-50000J0D01*
G01*
X235057060Y73562120D01*
G75*
G02*
X235007060Y73612120I0J50000D01*
G01*
G37*
%TD*%
%TO.C,TP1*%
G36*
G01*
X232439120Y73637520D02*
X232439120Y74637520D01*
G75*
G02*
X232489120Y74687520I50000J0D01*
G01*
X233489120Y74687520D01*
G75*
G02*
X233539120Y74637520I0J-50000D01*
G01*
X233539120Y73637520D01*
G75*
G02*
X233489120Y73587520I-50000J0D01*
G01*
X232489120Y73587520D01*
G75*
G02*
X232439120Y73637520I0J50000D01*
G01*
G37*
%TD*%
%TO.C,J17*%
G36*
G01*
X226375800Y21449400D02*
X226375800Y19749400D01*
G75*
G02*
X226325800Y19699400I-50000J0D01*
G01*
X224625800Y19699400D01*
G75*
G02*
X224575800Y19749400I0J50000D01*
G01*
X224575800Y21449400D01*
G75*
G02*
X224625800Y21499400I50000J0D01*
G01*
X226325800Y21499400D01*
G75*
G02*
X226375800Y21449400I0J-50000D01*
G01*
G37*
X225475800Y23139400D03*
X225475800Y25679400D03*
X225475800Y28219400D03*
X225475800Y30759400D03*
%TD*%
%TO.C,J14*%
G36*
G01*
X224625800Y18959400D02*
X226325800Y18959400D01*
G75*
G02*
X226375800Y18909400I0J-50000D01*
G01*
X226375800Y17209400D01*
G75*
G02*
X226325800Y17159400I-50000J0D01*
G01*
X224625800Y17159400D01*
G75*
G02*
X224575800Y17209400I0J50000D01*
G01*
X224575800Y18909400D01*
G75*
G02*
X224625800Y18959400I50000J0D01*
G01*
G37*
X222935800Y18059400D03*
X220395800Y18059400D03*
X217855800Y18059400D03*
X215315800Y18059400D03*
X212775800Y18059400D03*
X210235800Y18059400D03*
X207695800Y18059400D03*
X205155800Y18059400D03*
X202615800Y18059400D03*
X200075800Y18059400D03*
X197535800Y18059400D03*
X194995800Y18059400D03*
X192455800Y18059400D03*
%TD*%
%TO.C,J13*%
G36*
G01*
X224549600Y-827200D02*
X226249600Y-827200D01*
G75*
G02*
X226299600Y-877200I0J-50000D01*
G01*
X226299600Y-2577200D01*
G75*
G02*
X226249600Y-2627200I-50000J0D01*
G01*
X224549600Y-2627200D01*
G75*
G02*
X224499600Y-2577200I0J50000D01*
G01*
X224499600Y-877200D01*
G75*
G02*
X224549600Y-827200I50000J0D01*
G01*
G37*
X222859600Y-1727200D03*
X220319600Y-1727200D03*
X217779600Y-1727200D03*
X215239600Y-1727200D03*
X212699600Y-1727200D03*
X210159600Y-1727200D03*
X207619600Y-1727200D03*
X205079600Y-1727200D03*
X202539600Y-1727200D03*
X199999600Y-1727200D03*
X197459600Y-1727200D03*
X194919600Y-1727200D03*
X192379600Y-1727200D03*
%TD*%
%TO.C,J12*%
G36*
G01*
X193229600Y12612800D02*
X191529600Y12612800D01*
G75*
G02*
X191479600Y12662800I0J50000D01*
G01*
X191479600Y14362800D01*
G75*
G02*
X191529600Y14412800I50000J0D01*
G01*
X193229600Y14412800D01*
G75*
G02*
X193279600Y14362800I0J-50000D01*
G01*
X193279600Y12662800D01*
G75*
G02*
X193229600Y12612800I-50000J0D01*
G01*
G37*
X194919600Y13512800D03*
X197459600Y13512800D03*
X199999600Y13512800D03*
X202539600Y13512800D03*
X205079600Y13512800D03*
X207619600Y13512800D03*
X210159600Y13512800D03*
X212699600Y13512800D03*
X215239600Y13512800D03*
X217779600Y13512800D03*
X220319600Y13512800D03*
X222859600Y13512800D03*
X225399600Y13512800D03*
%TD*%
%TO.C,J3*%
G36*
G01*
X193305800Y32399400D02*
X191605800Y32399400D01*
G75*
G02*
X191555800Y32449400I0J50000D01*
G01*
X191555800Y34149400D01*
G75*
G02*
X191605800Y34199400I50000J0D01*
G01*
X193305800Y34199400D01*
G75*
G02*
X193355800Y34149400I0J-50000D01*
G01*
X193355800Y32449400D01*
G75*
G02*
X193305800Y32399400I-50000J0D01*
G01*
G37*
X194995800Y33299400D03*
X197535800Y33299400D03*
X200075800Y33299400D03*
X202615800Y33299400D03*
X205155800Y33299400D03*
X207695800Y33299400D03*
X210235800Y33299400D03*
X212775800Y33299400D03*
X215315800Y33299400D03*
X217855800Y33299400D03*
X220395800Y33299400D03*
X222935800Y33299400D03*
X225475800Y33299400D03*
%TD*%
%TO.C,J5*%
G36*
G01*
X233440400Y94958800D02*
X233440400Y96658800D01*
G75*
G02*
X233490400Y96708800I50000J0D01*
G01*
X235190400Y96708800D01*
G75*
G02*
X235240400Y96658800I0J-50000D01*
G01*
X235240400Y94958800D01*
G75*
G02*
X235190400Y94908800I-50000J0D01*
G01*
X233490400Y94908800D01*
G75*
G02*
X233440400Y94958800I0J50000D01*
G01*
G37*
%TD*%
D17*
%TO.C,H1*%
X191871600Y84912200D03*
%TD*%
D10*
%TO.C,H4*%
X240271600Y-13387800D03*
%TD*%
%TO.C,H3*%
X191871600Y-13387800D03*
%TD*%
%TO.C,H2*%
X240271600Y84912200D03*
%TD*%
D14*
%TO.C,SW1*%
X195580000Y66954400D03*
X195580000Y73454400D03*
X191080000Y66954400D03*
X191080000Y73454400D03*
%TD*%
%TO.C,J10*%
G36*
G01*
X207047200Y84774200D02*
X205347200Y84774200D01*
G75*
G02*
X205297200Y84824200I0J50000D01*
G01*
X205297200Y86524200D01*
G75*
G02*
X205347200Y86574200I50000J0D01*
G01*
X207047200Y86574200D01*
G75*
G02*
X207097200Y86524200I0J-50000D01*
G01*
X207097200Y84824200D01*
G75*
G02*
X207047200Y84774200I-50000J0D01*
G01*
G37*
D11*
X208737200Y85674200D03*
X211277200Y85674200D03*
X213817200Y85674200D03*
%TD*%
%TO.C,J8*%
G36*
G01*
X224397200Y38898400D02*
X226097200Y38898400D01*
G75*
G02*
X226147200Y38848400I0J-50000D01*
G01*
X226147200Y37148400D01*
G75*
G02*
X226097200Y37098400I-50000J0D01*
G01*
X224397200Y37098400D01*
G75*
G02*
X224347200Y37148400I0J50000D01*
G01*
X224347200Y38848400D01*
G75*
G02*
X224397200Y38898400I50000J0D01*
G01*
G37*
X222707200Y37998400D03*
X220167200Y37998400D03*
X217627200Y37998400D03*
X215087200Y37998400D03*
X212547200Y37998400D03*
X210007200Y37998400D03*
%TD*%
M02*
