%TF.GenerationSoftware,KiCad,Pcbnew,5.1.6-c6e7f7d~87~ubuntu18.04.1*%
%TF.CreationDate,2021-08-30T08:39:13-04:00*%
%TF.ProjectId,remote,72656d6f-7465-42e6-9b69-6361645f7063,rev?*%
%TF.SameCoordinates,Original*%
%TF.FileFunction,Copper,L1,Top*%
%TF.FilePolarity,Positive*%
%FSLAX46Y46*%
G04 Gerber Fmt 4.6, Leading zero omitted, Abs format (unit mm)*
G04 Created by KiCad (PCBNEW 5.1.6-c6e7f7d~87~ubuntu18.04.1) date 2021-08-30 08:39:13*
%MOMM*%
%LPD*%
G01*
G04 APERTURE LIST*
%TA.AperFunction,ComponentPad*%
%ADD10O,1.700000X1.700000*%
%TD*%
%TA.AperFunction,ComponentPad*%
%ADD11R,1.700000X1.700000*%
%TD*%
%TA.AperFunction,ComponentPad*%
%ADD12C,2.100000*%
%TD*%
%TA.AperFunction,ComponentPad*%
%ADD13C,1.750000*%
%TD*%
%TA.AperFunction,ComponentPad*%
%ADD14O,1.200000X1.750000*%
%TD*%
%TA.AperFunction,ComponentPad*%
%ADD15O,2.800000X2.800000*%
%TD*%
%TA.AperFunction,ComponentPad*%
%ADD16R,2.800000X2.800000*%
%TD*%
%TA.AperFunction,ComponentPad*%
%ADD17R,1.600000X1.600000*%
%TD*%
%TA.AperFunction,ComponentPad*%
%ADD18C,1.600000*%
%TD*%
%TA.AperFunction,ComponentPad*%
%ADD19O,1.600000X1.600000*%
%TD*%
%TA.AperFunction,ComponentPad*%
%ADD20R,3.500000X3.500000*%
%TD*%
%TA.AperFunction,ComponentPad*%
%ADD21C,2.600000*%
%TD*%
%TA.AperFunction,ComponentPad*%
%ADD22R,2.600000X2.600000*%
%TD*%
%TA.AperFunction,ViaPad*%
%ADD23C,0.800000*%
%TD*%
%TA.AperFunction,Conductor*%
%ADD24C,0.700000*%
%TD*%
%TA.AperFunction,Conductor*%
%ADD25C,0.250000*%
%TD*%
G04 APERTURE END LIST*
D10*
%TO.P,J18,4*%
%TO.N,SDA*%
X193750000Y72120000D03*
%TO.P,J18,3*%
%TO.N,SCL*%
X193750000Y69580000D03*
%TO.P,J18,2*%
%TO.N,+3V3*%
X193750000Y67040000D03*
D11*
%TO.P,J18,1*%
%TO.N,GND*%
X193750000Y64500000D03*
%TD*%
D10*
%TO.P,J2,4*%
%TO.N,SDA*%
X193750000Y46870000D03*
%TO.P,J2,3*%
%TO.N,SCL*%
X193750000Y44330000D03*
%TO.P,J2,2*%
%TO.N,+3V3*%
X193750000Y41790000D03*
D11*
%TO.P,J2,1*%
%TO.N,GND*%
X193750000Y39250000D03*
%TD*%
D12*
%TO.P,SW2,*%
%TO.N,*%
X237390000Y39810000D03*
D13*
%TO.P,SW2,1*%
%TO.N,A5*%
X239880000Y41060000D03*
%TO.P,SW2,2*%
%TO.N,GND*%
X239880000Y45560000D03*
D12*
%TO.P,SW2,*%
%TO.N,*%
X237390000Y46820000D03*
%TD*%
%TO.P,SW1,*%
%TO.N,*%
X237390000Y63780000D03*
D13*
%TO.P,SW1,1*%
%TO.N,A4*%
X239880000Y65030000D03*
%TO.P,SW1,2*%
%TO.N,GND*%
X239880000Y69530000D03*
D12*
%TO.P,SW1,*%
%TO.N,*%
X237390000Y70790000D03*
%TD*%
%TO.P,SW4,*%
%TO.N,*%
X237390000Y9000000D03*
D13*
%TO.P,SW4,1*%
%TO.N,~RESET*%
X239880000Y10250000D03*
%TO.P,SW4,2*%
%TO.N,GND*%
X239880000Y14750000D03*
D12*
%TO.P,SW4,*%
%TO.N,*%
X237390000Y16010000D03*
%TD*%
D14*
%TO.P,J15,2*%
%TO.N,VBAT*%
X192550000Y6550000D03*
%TO.P,J15,1*%
%TO.N,GND*%
%TA.AperFunction,ComponentPad*%
G36*
G01*
X189950000Y5924999D02*
X189950000Y7175001D01*
G75*
G02*
X190199999Y7425000I249999J0D01*
G01*
X190900001Y7425000D01*
G75*
G02*
X191150000Y7175001I0J-249999D01*
G01*
X191150000Y5924999D01*
G75*
G02*
X190900001Y5675000I-249999J0D01*
G01*
X190199999Y5675000D01*
G75*
G02*
X189950000Y5924999I0J249999D01*
G01*
G37*
%TD.AperFunction*%
%TD*%
D11*
%TO.P,J5,1*%
%TO.N,VBAT*%
X207100000Y53300000D03*
D10*
%TO.P,J5,2*%
%TO.N,EN*%
X209640000Y53300000D03*
%TO.P,J5,3*%
%TO.N,VBUS*%
X212180000Y53300000D03*
%TO.P,J5,4*%
%TO.N,D13*%
X214720000Y53300000D03*
%TO.P,J5,5*%
%TO.N,D12*%
X217260000Y53300000D03*
%TO.P,J5,6*%
%TO.N,D11*%
X219800000Y53300000D03*
%TO.P,J5,7*%
%TO.N,D10*%
X222340000Y53300000D03*
%TO.P,J5,8*%
%TO.N,D9*%
X224880000Y53300000D03*
%TO.P,J5,9*%
%TO.N,D6*%
X227420000Y53300000D03*
%TO.P,J5,10*%
%TO.N,D5*%
X229960000Y53300000D03*
%TO.P,J5,11*%
%TO.N,SCL*%
X232500000Y53300000D03*
%TO.P,J5,12*%
%TO.N,SDA*%
X235040000Y53300000D03*
%TD*%
D11*
%TO.P,J1,1*%
%TO.N,D4*%
X235050000Y33016000D03*
D10*
%TO.P,J1,2*%
%TO.N,TX_D1*%
X232510000Y33016000D03*
%TO.P,J1,3*%
%TO.N,RX_D0*%
X229970000Y33016000D03*
%TO.P,J1,4*%
%TO.N,MISO*%
X227430000Y33016000D03*
%TO.P,J1,5*%
%TO.N,MOSI*%
X224890000Y33016000D03*
%TO.P,J1,6*%
%TO.N,SCK*%
X222350000Y33016000D03*
%TO.P,J1,7*%
%TO.N,A5*%
X219810000Y33016000D03*
%TO.P,J1,8*%
%TO.N,A4*%
X217270000Y33016000D03*
%TO.P,J1,9*%
%TO.N,A3*%
X214730000Y33016000D03*
%TO.P,J1,10*%
%TO.N,A2*%
X212190000Y33016000D03*
%TO.P,J1,11*%
%TO.N,A1*%
X209650000Y33016000D03*
%TO.P,J1,12*%
%TO.N,A0*%
X207110000Y33016000D03*
%TO.P,J1,13*%
%TO.N,GND*%
X204570000Y33016000D03*
%TO.P,J1,14*%
%TO.N,AREF*%
X202030000Y33016000D03*
%TO.P,J1,15*%
%TO.N,+3V3*%
X199490000Y33016000D03*
%TO.P,J1,16*%
%TO.N,~RESET*%
X196950000Y33016000D03*
%TD*%
%TO.P,J13,4*%
%TO.N,SCL*%
X198530000Y-13400000D03*
%TO.P,J13,3*%
%TO.N,SDA*%
X201070000Y-13400000D03*
%TO.P,J13,2*%
%TO.N,+3V3*%
X203610000Y-13400000D03*
D11*
%TO.P,J13,1*%
%TO.N,GND*%
X206150000Y-13400000D03*
%TD*%
D10*
%TO.P,J12,12*%
%TO.N,SDA*%
X235040000Y22700000D03*
%TO.P,J12,11*%
%TO.N,SCL*%
X232500000Y22700000D03*
%TO.P,J12,10*%
%TO.N,D5*%
X229960000Y22700000D03*
%TO.P,J12,9*%
%TO.N,D6*%
X227420000Y22700000D03*
%TO.P,J12,8*%
%TO.N,D9*%
X224880000Y22700000D03*
%TO.P,J12,7*%
%TO.N,D10*%
X222340000Y22700000D03*
%TO.P,J12,6*%
%TO.N,D11*%
X219800000Y22700000D03*
%TO.P,J12,5*%
%TO.N,D12*%
X217260000Y22700000D03*
%TO.P,J12,4*%
%TO.N,D13*%
X214720000Y22700000D03*
%TO.P,J12,3*%
%TO.N,VBUS*%
X212180000Y22700000D03*
%TO.P,J12,2*%
%TO.N,EN*%
X209640000Y22700000D03*
D11*
%TO.P,J12,1*%
%TO.N,VBAT*%
X207100000Y22700000D03*
%TD*%
D10*
%TO.P,J11,16*%
%TO.N,~RESET*%
X196860000Y57762000D03*
%TO.P,J11,15*%
%TO.N,+3V3*%
X199400000Y57762000D03*
%TO.P,J11,14*%
%TO.N,AREF*%
X201940000Y57762000D03*
%TO.P,J11,13*%
%TO.N,GND*%
X204480000Y57762000D03*
%TO.P,J11,12*%
%TO.N,A0*%
X207020000Y57762000D03*
%TO.P,J11,11*%
%TO.N,A1*%
X209560000Y57762000D03*
%TO.P,J11,10*%
%TO.N,A2*%
X212100000Y57762000D03*
%TO.P,J11,9*%
%TO.N,A3*%
X214640000Y57762000D03*
%TO.P,J11,8*%
%TO.N,A4*%
X217180000Y57762000D03*
%TO.P,J11,7*%
%TO.N,A5*%
X219720000Y57762000D03*
%TO.P,J11,6*%
%TO.N,SCK*%
X222260000Y57762000D03*
%TO.P,J11,5*%
%TO.N,MOSI*%
X224800000Y57762000D03*
%TO.P,J11,4*%
%TO.N,MISO*%
X227340000Y57762000D03*
%TO.P,J11,3*%
%TO.N,RX_D0*%
X229880000Y57762000D03*
%TO.P,J11,2*%
%TO.N,TX_D1*%
X232420000Y57762000D03*
D11*
%TO.P,J11,1*%
%TO.N,D4*%
X234960000Y57762000D03*
%TD*%
%TO.P,J8,1*%
%TO.N,VBAT*%
X207100000Y78100000D03*
D10*
%TO.P,J8,2*%
%TO.N,EN*%
X209640000Y78100000D03*
%TO.P,J8,3*%
%TO.N,VBUS*%
X212180000Y78100000D03*
%TO.P,J8,4*%
%TO.N,D13*%
X214720000Y78100000D03*
%TO.P,J8,5*%
%TO.N,D12*%
X217260000Y78100000D03*
%TO.P,J8,6*%
%TO.N,D11*%
X219800000Y78100000D03*
%TO.P,J8,7*%
%TO.N,D10*%
X222340000Y78100000D03*
%TO.P,J8,8*%
%TO.N,D9*%
X224880000Y78100000D03*
%TO.P,J8,9*%
%TO.N,D6*%
X227420000Y78100000D03*
%TO.P,J8,10*%
%TO.N,D5*%
X229960000Y78100000D03*
%TO.P,J8,11*%
%TO.N,SCL*%
X232500000Y78100000D03*
%TO.P,J8,12*%
%TO.N,SDA*%
X235040000Y78100000D03*
%TD*%
%TO.P,J3,16*%
%TO.N,~RESET*%
X196980000Y2410000D03*
%TO.P,J3,15*%
%TO.N,+3V3*%
X199520000Y2410000D03*
%TO.P,J3,14*%
%TO.N,AREF*%
X202060000Y2410000D03*
%TO.P,J3,13*%
%TO.N,GND*%
X204600000Y2410000D03*
%TO.P,J3,12*%
%TO.N,A0*%
X207140000Y2410000D03*
%TO.P,J3,11*%
%TO.N,A1*%
X209680000Y2410000D03*
%TO.P,J3,10*%
%TO.N,A2*%
X212220000Y2410000D03*
%TO.P,J3,9*%
%TO.N,A3*%
X214760000Y2410000D03*
%TO.P,J3,8*%
%TO.N,A4*%
X217300000Y2410000D03*
%TO.P,J3,7*%
%TO.N,A5*%
X219840000Y2410000D03*
%TO.P,J3,6*%
%TO.N,SCK*%
X222380000Y2410000D03*
%TO.P,J3,5*%
%TO.N,MOSI*%
X224920000Y2410000D03*
%TO.P,J3,4*%
%TO.N,MISO*%
X227460000Y2410000D03*
%TO.P,J3,3*%
%TO.N,RX_D0*%
X230000000Y2410000D03*
%TO.P,J3,2*%
%TO.N,TX_D1*%
X232540000Y2410000D03*
D11*
%TO.P,J3,1*%
%TO.N,D4*%
X235080000Y2410000D03*
%TD*%
D15*
%TO.P,D1,2*%
%TO.N,VOUT_DCDC*%
X199950000Y-2100000D03*
D16*
%TO.P,D1,1*%
%TO.N,VBUS*%
X212650000Y-2100000D03*
%TD*%
D17*
%TO.P,C2,1*%
%TO.N,GND*%
X224400000Y-4400000D03*
D18*
%TO.P,C2,2*%
%TO.N,VOUT_DCDC*%
X224400000Y-1900000D03*
%TD*%
D17*
%TO.P,C1,1*%
%TO.N,GND*%
X233000000Y-4400000D03*
D18*
%TO.P,C1,2*%
%TO.N,VIN_DCDC*%
X233000000Y-1900000D03*
%TD*%
D11*
%TO.P,J9,1*%
%TO.N,VIN_DCDC*%
X225085000Y-9850000D03*
D10*
%TO.P,J9,2*%
%TO.N,GND*%
X227625000Y-9850000D03*
%TO.P,J9,3*%
%TO.N,VOUT_DCDC*%
X230165000Y-9850000D03*
%TD*%
D19*
%TO.P,R3,2*%
%TO.N,A5*%
X219000000Y7100000D03*
D18*
%TO.P,R3,1*%
%TO.N,+3V3*%
X219000000Y19800000D03*
%TD*%
%TO.P,J4,3*%
%TO.N,N/C*%
%TA.AperFunction,ComponentPad*%
G36*
G01*
X211313000Y-11750000D02*
X209563000Y-11750000D01*
G75*
G02*
X208688000Y-10875000I0J875000D01*
G01*
X208688000Y-9125000D01*
G75*
G02*
X209563000Y-8250000I875000J0D01*
G01*
X211313000Y-8250000D01*
G75*
G02*
X212188000Y-9125000I0J-875000D01*
G01*
X212188000Y-10875000D01*
G75*
G02*
X211313000Y-11750000I-875000J0D01*
G01*
G37*
%TD.AperFunction*%
%TO.P,J4,2*%
%TO.N,GND*%
%TA.AperFunction,ComponentPad*%
G36*
G01*
X216138000Y-14500000D02*
X214138000Y-14500000D01*
G75*
G02*
X213388000Y-13750000I0J750000D01*
G01*
X213388000Y-12250000D01*
G75*
G02*
X214138000Y-11500000I750000J0D01*
G01*
X216138000Y-11500000D01*
G75*
G02*
X216888000Y-12250000I0J-750000D01*
G01*
X216888000Y-13750000D01*
G75*
G02*
X216138000Y-14500000I-750000J0D01*
G01*
G37*
%TD.AperFunction*%
D20*
%TO.P,J4,1*%
%TO.N,VIN_DCDC*%
X215138000Y-7000000D03*
%TD*%
D21*
%TO.P,J7,2*%
%TO.N,VBAT*%
X192850000Y-1650000D03*
D22*
%TO.P,J7,1*%
%TO.N,GND*%
X192850000Y-6650000D03*
%TD*%
D18*
%TO.P,R2,1*%
%TO.N,+3V3*%
X226600000Y7000000D03*
D19*
%TO.P,R2,2*%
%TO.N,SCL*%
X226600000Y19700000D03*
%TD*%
D18*
%TO.P,R1,1*%
%TO.N,+3V3*%
X231200000Y7000000D03*
D19*
%TO.P,R1,2*%
%TO.N,SDA*%
X231200000Y19700000D03*
%TD*%
D18*
%TO.P,R4,1*%
%TO.N,+3V3*%
X214600000Y19800000D03*
D19*
%TO.P,R4,2*%
%TO.N,A4*%
X214600000Y7100000D03*
%TD*%
D10*
%TO.P,J10,4*%
%TO.N,SDA*%
X219660200Y84952200D03*
%TO.P,J10,3*%
%TO.N,SCL*%
X217120200Y84952200D03*
%TO.P,J10,2*%
%TO.N,+3V3*%
X214580200Y84952200D03*
D11*
%TO.P,J10,1*%
%TO.N,GND*%
X212040200Y84952200D03*
%TD*%
D23*
%TO.N,+3V3*%
X202800000Y-400000D03*
X199600000Y400000D03*
X214000000Y89200000D03*
X195200000Y89400000D03*
X194800000Y79800000D03*
X190400000Y78200000D03*
X190800000Y67000000D03*
X199200000Y41600000D03*
X199400000Y19600000D03*
X203800000Y-19000000D03*
X229400000Y-20400000D03*
X242400000Y-19000000D03*
X199400000Y19600000D03*
X196000000Y19800000D03*
X223600000Y18600000D03*
X224000000Y6800000D03*
X199400000Y66400000D03*
%TO.N,GND*%
X221400000Y-5800000D03*
X220400000Y-12600000D03*
X237400000Y-2800000D03*
X236600000Y-5800000D03*
X227600000Y-12600000D03*
X230400000Y-14000000D03*
X204600000Y-7000000D03*
X189600000Y-5200000D03*
X211400000Y88000000D03*
X196800000Y88000000D03*
X195400000Y64600000D03*
X204600000Y38800000D03*
X190600000Y8400000D03*
X205250000Y9000000D03*
X204400000Y63600000D03*
X227400000Y-4800000D03*
%TO.N,SDA*%
X237800000Y79200000D03*
X236800000Y88600000D03*
X219600000Y88000000D03*
X243000000Y77000000D03*
X243000000Y53500000D03*
X243000000Y23750000D03*
X234750000Y19750000D03*
X244500000Y-4500000D03*
X239500000Y-4500000D03*
X228500000Y-16250000D03*
X244500000Y-15500000D03*
X204000000Y72500000D03*
X204750000Y80250000D03*
X219500000Y81250000D03*
X201000000Y-16000000D03*
X194400000Y60800000D03*
X202000000Y61200000D03*
%TO.N,SCL*%
X218400000Y89200000D03*
X235600000Y89600000D03*
X235400000Y81400000D03*
X244250000Y52250000D03*
X243750000Y81500000D03*
X244000000Y21500000D03*
X233500000Y20500000D03*
X233500000Y18250000D03*
X239500000Y-5750000D03*
X245750000Y-5250000D03*
X239250000Y-10750000D03*
X226250000Y-12000000D03*
X216750000Y82750000D03*
X203000000Y81000000D03*
X203000000Y70000000D03*
X199500000Y-17750000D03*
X225250000Y-17750000D03*
%TO.N,VIN_DCDC*%
X222800000Y-7400000D03*
X231200000Y-7600000D03*
%TO.N,VOUT_DCDC*%
X229400000Y-3600000D03*
%TO.N,D4*%
X235000000Y30750000D03*
X237750000Y27500000D03*
X237750000Y19500000D03*
X235000000Y17750000D03*
%TO.N,TX_D1*%
X236750000Y18250000D03*
X232750000Y14250000D03*
%TO.N,A5*%
X220000000Y43000000D03*
%TO.N,A4*%
X217600000Y65200000D03*
%TO.N,A0*%
X206200000Y55200000D03*
X203200000Y55000000D03*
X203400000Y36000000D03*
X207000000Y35200000D03*
%TO.N,~RESET*%
X197000000Y10500000D03*
%TO.N,VBAT*%
X207000000Y75800000D03*
X188600000Y75600000D03*
X189600000Y52800000D03*
X190800000Y22000000D03*
%TO.N,EN*%
X208285001Y55214999D03*
%TO.N,VBUS*%
X187200000Y23800000D03*
X187600000Y-3200000D03*
X211400000Y-5800000D03*
X188400000Y49800000D03*
X212200000Y50200000D03*
X211800000Y74800000D03*
X186800000Y72400000D03*
X210800000Y30600000D03*
X192600000Y30200000D03*
X192200000Y25200000D03*
%TO.N,D5*%
X239000000Y26000000D03*
X238000000Y35600000D03*
X228600000Y37600000D03*
%TD*%
D24*
%TO.N,+3V3*%
X202800000Y-400000D02*
X202200000Y200000D01*
X202200000Y200000D02*
X199800000Y200000D01*
X199800000Y200000D02*
X199600000Y400000D01*
X214000000Y89200000D02*
X213200000Y90000000D01*
X213200000Y90000000D02*
X197000000Y90000000D01*
X197000000Y90000000D02*
X195800000Y90000000D01*
X195800000Y90000000D02*
X195200000Y89400000D01*
X194800000Y79800000D02*
X192000000Y79800000D01*
X192000000Y79800000D02*
X190400000Y78200000D01*
X193710000Y67000000D02*
X193750000Y67040000D01*
X190800000Y67000000D02*
X193710000Y67000000D01*
X193940000Y41600000D02*
X193750000Y41790000D01*
X199200000Y41600000D02*
X193940000Y41600000D01*
X219000000Y19800000D02*
X214600000Y19800000D01*
X214600000Y19800000D02*
X199600000Y19800000D01*
X199600000Y19800000D02*
X199400000Y19600000D01*
X203800000Y-19000000D02*
X204600000Y-19800000D01*
X204600000Y-19800000D02*
X228800000Y-19800000D01*
X228800000Y-19800000D02*
X229400000Y-20400000D01*
X229400000Y-20400000D02*
X230400000Y-20400000D01*
X230400000Y-20400000D02*
X231800000Y-19000000D01*
X231800000Y-19000000D02*
X241600000Y-19000000D01*
X241600000Y-19000000D02*
X242400000Y-19000000D01*
X199400000Y19600000D02*
X196200000Y19600000D01*
X196200000Y19600000D02*
X196000000Y19800000D01*
X219000000Y19800000D02*
X222400000Y19800000D01*
X222400000Y19800000D02*
X223600000Y18600000D01*
X226400000Y6800000D02*
X226600000Y7000000D01*
X224000000Y6800000D02*
X226400000Y6800000D01*
X226600000Y7000000D02*
X231200000Y7000000D01*
X193750000Y67040000D02*
X198760000Y67040000D01*
X198760000Y67040000D02*
X199400000Y66400000D01*
%TO.N,GND*%
X206550000Y-13000000D02*
X206150000Y-13400000D01*
X215138000Y-13000000D02*
X206550000Y-13000000D01*
X221650000Y-5550000D02*
X221400000Y-5800000D01*
X215538000Y-12600000D02*
X215138000Y-13000000D01*
X220400000Y-12600000D02*
X215538000Y-12600000D01*
X237400000Y-2800000D02*
X237400000Y-5000000D01*
X237400000Y-5000000D02*
X236600000Y-5800000D01*
X227600000Y-12600000D02*
X228800000Y-13800000D01*
X228800000Y-13800000D02*
X230200000Y-13800000D01*
X230200000Y-13800000D02*
X230400000Y-14000000D01*
X193200000Y-7000000D02*
X192850000Y-6650000D01*
X204600000Y-7000000D02*
X193200000Y-7000000D01*
X192850000Y-6650000D02*
X190850000Y-6650000D01*
X190850000Y-6650000D02*
X189600000Y-5400000D01*
X189600000Y-5400000D02*
X189600000Y-5200000D01*
X211992400Y85000000D02*
X212040200Y84952200D01*
X211400000Y88000000D02*
X198000000Y88000000D01*
X198000000Y88000000D02*
X196800000Y88000000D01*
X193850000Y64600000D02*
X193750000Y64500000D01*
X195400000Y64600000D02*
X193850000Y64600000D01*
X193750000Y39250000D02*
X204150000Y39250000D01*
X204150000Y39250000D02*
X204600000Y38800000D01*
X205050000Y8800000D02*
X205250000Y9000000D01*
X191000000Y8800000D02*
X205050000Y8800000D01*
X190600000Y8400000D02*
X191000000Y8800000D01*
X195400000Y64600000D02*
X203400000Y64600000D01*
X203400000Y64600000D02*
X204400000Y63600000D01*
X224800000Y-4800000D02*
X224400000Y-4400000D01*
X227400000Y-4800000D02*
X224800000Y-4800000D01*
X222800000Y-4400000D02*
X221650000Y-5550000D01*
X224400000Y-4400000D02*
X222800000Y-4400000D01*
X233000000Y-4400000D02*
X232600000Y-4400000D01*
X232600000Y-4400000D02*
X231600000Y-5400000D01*
X228000000Y-5400000D02*
X227400000Y-4800000D01*
X231600000Y-5400000D02*
X228000000Y-5400000D01*
D25*
%TO.N,SDA*%
X235040000Y78100000D02*
X236700000Y78100000D01*
X236700000Y78100000D02*
X237800000Y79200000D01*
X236800000Y88600000D02*
X224400000Y88600000D01*
X224400000Y88600000D02*
X220200000Y88600000D01*
X220200000Y88600000D02*
X219600000Y88000000D01*
X235040000Y78100000D02*
X241900000Y78100000D01*
X241900000Y78100000D02*
X243000000Y77000000D01*
X235590000Y52750000D02*
X235040000Y53300000D01*
X243000000Y53500000D02*
X242250000Y52750000D01*
X242250000Y52750000D02*
X235590000Y52750000D01*
X235040000Y22700000D02*
X241950000Y22700000D01*
X241950000Y22700000D02*
X243000000Y23750000D01*
X231200000Y19700000D02*
X234700000Y19700000D01*
X234700000Y19700000D02*
X234750000Y19750000D01*
X244500000Y-4500000D02*
X239500000Y-4500000D01*
X228500000Y-16250000D02*
X229000000Y-15750000D01*
X229000000Y-15750000D02*
X238750000Y-15750000D01*
X238750000Y-15750000D02*
X239250000Y-16250000D01*
X239250000Y-16250000D02*
X243750000Y-16250000D01*
X243750000Y-16250000D02*
X244500000Y-15500000D01*
X193750000Y72120000D02*
X203620000Y72120000D01*
X203620000Y72120000D02*
X204000000Y72500000D01*
X204750000Y80250000D02*
X219000000Y80250000D01*
X219000000Y80250000D02*
X219500000Y80750000D01*
X219500000Y80750000D02*
X219500000Y81250000D01*
X228500000Y-16250000D02*
X201250000Y-16250000D01*
X201250000Y-16250000D02*
X201000000Y-16000000D01*
X194400000Y60800000D02*
X194800000Y61200000D01*
X194800000Y61200000D02*
X202000000Y61200000D01*
%TO.N,SCL*%
X218400000Y89200000D02*
X219000000Y89800000D01*
X219000000Y89800000D02*
X235400000Y89800000D01*
X235400000Y89800000D02*
X235600000Y89600000D01*
X232500000Y78500000D02*
X232500000Y78100000D01*
X235400000Y81400000D02*
X232500000Y78500000D01*
X232500000Y53300000D02*
X232500000Y52000000D01*
X232500000Y52000000D02*
X233000000Y51500000D01*
X233000000Y51500000D02*
X243500000Y51500000D01*
X243500000Y51500000D02*
X244250000Y52250000D01*
X235500000Y81500000D02*
X235400000Y81400000D01*
X243750000Y81500000D02*
X235500000Y81500000D01*
X244000000Y21500000D02*
X243000000Y20500000D01*
X243000000Y20500000D02*
X234000000Y20500000D01*
X234000000Y20500000D02*
X233500000Y20500000D01*
X226600000Y19700000D02*
X227800000Y19700000D01*
X227800000Y19700000D02*
X229750000Y17750000D01*
X229750000Y17750000D02*
X233000000Y17750000D01*
X233000000Y17750000D02*
X233500000Y18250000D01*
X239500000Y-5750000D02*
X245250000Y-5750000D01*
X245250000Y-5750000D02*
X245750000Y-5250000D01*
X239250000Y-10750000D02*
X238500000Y-11500000D01*
X238500000Y-11500000D02*
X226750000Y-11500000D01*
X226750000Y-11500000D02*
X226250000Y-12000000D01*
X216750000Y82750000D02*
X215500000Y81500000D01*
X215500000Y81500000D02*
X203500000Y81500000D01*
X203500000Y81500000D02*
X203000000Y81000000D01*
X203000000Y70000000D02*
X202250000Y69250000D01*
X194080000Y69250000D02*
X193750000Y69580000D01*
X202250000Y69250000D02*
X194080000Y69250000D01*
X199500000Y-17750000D02*
X218250000Y-17750000D01*
X218250000Y-17750000D02*
X225250000Y-17750000D01*
D24*
%TO.N,VIN_DCDC*%
X215138000Y-7000000D02*
X222400000Y-7000000D01*
X222400000Y-7000000D02*
X222800000Y-7400000D01*
X231200000Y-7600000D02*
X226400000Y-7600000D01*
X225085000Y-8915000D02*
X225085000Y-9850000D01*
X226400000Y-7600000D02*
X225085000Y-8915000D01*
%TO.N,VOUT_DCDC*%
X228850000Y-3050000D02*
X229400000Y-3600000D01*
X228850000Y-3050000D02*
X228050000Y-3050000D01*
X226900000Y-1900000D02*
X224400000Y-1900000D01*
X228050000Y-3050000D02*
X226900000Y-1900000D01*
X200800000Y-4400000D02*
X200000000Y-3600000D01*
X215200000Y-4400000D02*
X200800000Y-4400000D01*
X224400000Y-1900000D02*
X217700000Y-1900000D01*
X200000000Y-2150000D02*
X199950000Y-2100000D01*
X200000000Y-3600000D02*
X200000000Y-2150000D01*
X217700000Y-1900000D02*
X215200000Y-4400000D01*
D25*
%TO.N,D4*%
X235000000Y30750000D02*
X237750000Y28000000D01*
X237750000Y28000000D02*
X237750000Y27500000D01*
X237750000Y19500000D02*
X236750000Y19500000D01*
X236750000Y19500000D02*
X235000000Y17750000D01*
%TO.N,TX_D1*%
X236750000Y18250000D02*
X232750000Y14250000D01*
%TO.N,A5*%
X239880000Y41060000D02*
X238540000Y42400000D01*
X238540000Y42400000D02*
X220600000Y42400000D01*
X220600000Y42400000D02*
X220000000Y43000000D01*
%TO.N,A4*%
X239880000Y65030000D02*
X238310000Y66600000D01*
X238310000Y66600000D02*
X219000000Y66600000D01*
X219000000Y66600000D02*
X217600000Y65200000D01*
%TO.N,A0*%
X206200000Y55200000D02*
X203400000Y55200000D01*
X203400000Y55200000D02*
X203200000Y55000000D01*
X203400000Y36000000D02*
X203800000Y35600000D01*
X203800000Y35600000D02*
X206600000Y35600000D01*
X206600000Y35600000D02*
X207000000Y35200000D01*
%TO.N,~RESET*%
X239880000Y10250000D02*
X238880000Y11250000D01*
X238880000Y11250000D02*
X197750000Y11250000D01*
X197750000Y11250000D02*
X197000000Y10500000D01*
D24*
%TO.N,VBAT*%
X207000000Y75800000D02*
X188800000Y75800000D01*
X188800000Y75800000D02*
X188600000Y75600000D01*
X190100000Y53300000D02*
X207100000Y53300000D01*
X189600000Y52800000D02*
X190100000Y53300000D01*
X190800000Y22000000D02*
X203400000Y22000000D01*
X204100000Y22700000D02*
X207100000Y22700000D01*
X203400000Y22000000D02*
X204100000Y22700000D01*
D25*
%TO.N,EN*%
X209640000Y53860000D02*
X208285001Y55214999D01*
X209640000Y53300000D02*
X209640000Y53860000D01*
D24*
%TO.N,VBUS*%
X187600000Y-3200000D02*
X188400000Y-4000000D01*
X188400000Y-4000000D02*
X196400000Y-4000000D01*
X196400000Y-4000000D02*
X198200000Y-5800000D01*
X198200000Y-5800000D02*
X211400000Y-5800000D01*
X188400000Y49800000D02*
X204200000Y49800000D01*
X204200000Y49800000D02*
X211600000Y49800000D01*
X211600000Y49800000D02*
X211800000Y49800000D01*
X211800000Y49800000D02*
X212200000Y50200000D01*
X211800000Y74800000D02*
X211200000Y74200000D01*
X211200000Y74200000D02*
X188600000Y74200000D01*
X188600000Y74200000D02*
X186800000Y72400000D01*
X188600000Y25200000D02*
X187200000Y23800000D01*
X210800000Y30600000D02*
X210120242Y31279758D01*
X210120242Y31279758D02*
X193679758Y31279758D01*
X193679758Y31279758D02*
X192600000Y30200000D01*
X192200000Y25200000D02*
X188600000Y25200000D01*
D25*
%TO.N,D5*%
X230809999Y23549999D02*
X230949999Y23549999D01*
X229960000Y22700000D02*
X230809999Y23549999D01*
X230949999Y23549999D02*
X231400000Y24000000D01*
X231400000Y24000000D02*
X233000000Y24000000D01*
X233000000Y24000000D02*
X233600000Y24600000D01*
X233600000Y24600000D02*
X237600000Y24600000D01*
X237600000Y24600000D02*
X239000000Y26000000D01*
X228600000Y37600000D02*
X228600000Y36800000D01*
X229800000Y35600000D02*
X238000000Y35600000D01*
X228600000Y36800000D02*
X229800000Y35600000D01*
%TD*%
M02*
