%TF.GenerationSoftware,KiCad,Pcbnew,5.1.12-84ad8e8a86~92~ubuntu18.04.1*%
%TF.CreationDate,2022-01-16T19:32:40-05:00*%
%TF.ProjectId,remote,72656d6f-7465-42e6-9b69-6361645f7063,rev?*%
%TF.SameCoordinates,Original*%
%TF.FileFunction,Legend,Bot*%
%TF.FilePolarity,Positive*%
%FSLAX46Y46*%
G04 Gerber Fmt 4.6, Leading zero omitted, Abs format (unit mm)*
G04 Created by KiCad (PCBNEW 5.1.12-84ad8e8a86~92~ubuntu18.04.1) date 2022-01-16 19:32:40*
%MOMM*%
%LPD*%
G01*
G04 APERTURE LIST*
%ADD10C,0.120000*%
%ADD11C,0.150000*%
G04 APERTURE END LIST*
D10*
X49000000Y-41800000D02*
X51400000Y-41800000D01*
X51400000Y-38600000D02*
X49000000Y-38600000D01*
X49000000Y-38600000D02*
X49000000Y-41800000D01*
X49000000Y-32000000D02*
X51400000Y-32000000D01*
X49000000Y-28800000D02*
X49000000Y-32000000D01*
X51400000Y-28800000D02*
X49000000Y-28800000D01*
X51800000Y-20000000D02*
X48000000Y-20000000D01*
D11*
X40476666Y-106141428D02*
X40476666Y-108141428D01*
X40476666Y-106236666D02*
X40286190Y-106141428D01*
X39905238Y-106141428D01*
X39714761Y-106236666D01*
X39619523Y-106331904D01*
X39524285Y-106522380D01*
X39524285Y-107093809D01*
X39619523Y-107284285D01*
X39714761Y-107379523D01*
X39905238Y-107474761D01*
X40286190Y-107474761D01*
X40476666Y-107379523D01*
X38857619Y-106141428D02*
X38381428Y-107474761D01*
X37905238Y-106141428D01*
X36857619Y-107474761D02*
X37048095Y-107379523D01*
X37143333Y-107284285D01*
X37238571Y-107093809D01*
X37238571Y-106522380D01*
X37143333Y-106331904D01*
X37048095Y-106236666D01*
X36857619Y-106141428D01*
X36571904Y-106141428D01*
X36381428Y-106236666D01*
X36286190Y-106331904D01*
X36190952Y-106522380D01*
X36190952Y-107093809D01*
X36286190Y-107284285D01*
X36381428Y-107379523D01*
X36571904Y-107474761D01*
X36857619Y-107474761D01*
X35429047Y-107379523D02*
X35238571Y-107474761D01*
X34857619Y-107474761D01*
X34667142Y-107379523D01*
X34571904Y-107189047D01*
X34571904Y-107093809D01*
X34667142Y-106903333D01*
X34857619Y-106808095D01*
X35143333Y-106808095D01*
X35333809Y-106712857D01*
X35429047Y-106522380D01*
X35429047Y-106427142D01*
X35333809Y-106236666D01*
X35143333Y-106141428D01*
X34857619Y-106141428D01*
X34667142Y-106236666D01*
X33714761Y-107284285D02*
X33619523Y-107379523D01*
X33714761Y-107474761D01*
X33810000Y-107379523D01*
X33714761Y-107284285D01*
X33714761Y-107474761D01*
X32476666Y-107474761D02*
X32667142Y-107379523D01*
X32762380Y-107284285D01*
X32857619Y-107093809D01*
X32857619Y-106522380D01*
X32762380Y-106331904D01*
X32667142Y-106236666D01*
X32476666Y-106141428D01*
X32190952Y-106141428D01*
X32000476Y-106236666D01*
X31905238Y-106331904D01*
X31810000Y-106522380D01*
X31810000Y-107093809D01*
X31905238Y-107284285D01*
X32000476Y-107379523D01*
X32190952Y-107474761D01*
X32476666Y-107474761D01*
X30952857Y-107474761D02*
X30952857Y-106141428D01*
X30952857Y-106522380D02*
X30857619Y-106331904D01*
X30762380Y-106236666D01*
X30571904Y-106141428D01*
X30381428Y-106141428D01*
X28857619Y-106141428D02*
X28857619Y-107760476D01*
X28952857Y-107950952D01*
X29048095Y-108046190D01*
X29238571Y-108141428D01*
X29524285Y-108141428D01*
X29714761Y-108046190D01*
X28857619Y-107379523D02*
X29048095Y-107474761D01*
X29429047Y-107474761D01*
X29619523Y-107379523D01*
X29714761Y-107284285D01*
X29810000Y-107093809D01*
X29810000Y-106522380D01*
X29714761Y-106331904D01*
X29619523Y-106236666D01*
X29429047Y-106141428D01*
X29048095Y-106141428D01*
X28857619Y-106236666D01*
X26476666Y-105379523D02*
X28190952Y-107950952D01*
X24952857Y-107379523D02*
X25143333Y-107474761D01*
X25524285Y-107474761D01*
X25714761Y-107379523D01*
X25810000Y-107284285D01*
X25905238Y-107093809D01*
X25905238Y-106522380D01*
X25810000Y-106331904D01*
X25714761Y-106236666D01*
X25524285Y-106141428D01*
X25143333Y-106141428D01*
X24952857Y-106236666D01*
X23810000Y-107474761D02*
X24000476Y-107379523D01*
X24095714Y-107284285D01*
X24190952Y-107093809D01*
X24190952Y-106522380D01*
X24095714Y-106331904D01*
X24000476Y-106236666D01*
X23810000Y-106141428D01*
X23524285Y-106141428D01*
X23333809Y-106236666D01*
X23238571Y-106331904D01*
X23143333Y-106522380D01*
X23143333Y-107093809D01*
X23238571Y-107284285D01*
X23333809Y-107379523D01*
X23524285Y-107474761D01*
X23810000Y-107474761D01*
X22381428Y-105665238D02*
X22286190Y-105570000D01*
X22095714Y-105474761D01*
X21619523Y-105474761D01*
X21429047Y-105570000D01*
X21333809Y-105665238D01*
X21238571Y-105855714D01*
X21238571Y-106046190D01*
X21333809Y-106331904D01*
X22476666Y-107474761D01*
X21238571Y-107474761D01*
X18952857Y-105379523D02*
X20667142Y-107950952D01*
X18286190Y-107474761D02*
X18286190Y-106141428D01*
X18286190Y-106522380D02*
X18190952Y-106331904D01*
X18095714Y-106236666D01*
X17905238Y-106141428D01*
X17714761Y-106141428D01*
X16286190Y-107379523D02*
X16476666Y-107474761D01*
X16857619Y-107474761D01*
X17048095Y-107379523D01*
X17143333Y-107189047D01*
X17143333Y-106427142D01*
X17048095Y-106236666D01*
X16857619Y-106141428D01*
X16476666Y-106141428D01*
X16286190Y-106236666D01*
X16190952Y-106427142D01*
X16190952Y-106617619D01*
X17143333Y-106808095D01*
X15524285Y-106141428D02*
X15048095Y-107474761D01*
X14571904Y-106141428D01*
X14286190Y-107665238D02*
X12762380Y-107665238D01*
X12476666Y-106141428D02*
X12095714Y-107474761D01*
X11714761Y-106522380D01*
X11333809Y-107474761D01*
X10952857Y-106141428D01*
X51128571Y-17778571D02*
X50842857Y-17778571D01*
X50700000Y-17850000D01*
X50557142Y-17992857D01*
X50485714Y-18278571D01*
X50485714Y-18778571D01*
X50557142Y-19064285D01*
X50700000Y-19207142D01*
X50842857Y-19278571D01*
X51128571Y-19278571D01*
X51271428Y-19207142D01*
X51414285Y-19064285D01*
X51485714Y-18778571D01*
X51485714Y-18278571D01*
X51414285Y-17992857D01*
X51271428Y-17850000D01*
X51128571Y-17778571D01*
X49842857Y-19278571D02*
X49842857Y-17778571D01*
X48985714Y-19278571D01*
X48985714Y-17778571D01*
X51028571Y-20778571D02*
X50742857Y-20778571D01*
X50600000Y-20850000D01*
X50457142Y-20992857D01*
X50385714Y-21278571D01*
X50385714Y-21778571D01*
X50457142Y-22064285D01*
X50600000Y-22207142D01*
X50742857Y-22278571D01*
X51028571Y-22278571D01*
X51171428Y-22207142D01*
X51314285Y-22064285D01*
X51385714Y-21778571D01*
X51385714Y-21278571D01*
X51314285Y-20992857D01*
X51171428Y-20850000D01*
X51028571Y-20778571D01*
X49242857Y-21492857D02*
X49742857Y-21492857D01*
X49742857Y-22278571D02*
X49742857Y-20778571D01*
X49028571Y-20778571D01*
X47957142Y-21492857D02*
X48457142Y-21492857D01*
X48457142Y-22278571D02*
X48457142Y-20778571D01*
X47742857Y-20778571D01*
X50257142Y-40057142D02*
X49971428Y-40152380D01*
X49876190Y-40247619D01*
X49780952Y-40438095D01*
X49780952Y-40723809D01*
X49876190Y-40914285D01*
X49971428Y-41009523D01*
X50161904Y-41104761D01*
X50923809Y-41104761D01*
X50923809Y-39104761D01*
X50257142Y-39104761D01*
X50066666Y-39200000D01*
X49971428Y-39295238D01*
X49876190Y-39485714D01*
X49876190Y-39676190D01*
X49971428Y-39866666D01*
X50066666Y-39961904D01*
X50257142Y-40057142D01*
X50923809Y-40057142D01*
X50876190Y-30733333D02*
X49923809Y-30733333D01*
X51066666Y-31304761D02*
X50400000Y-29304761D01*
X49733333Y-31304761D01*
M02*
