%TF.GenerationSoftware,KiCad,Pcbnew,5.1.9-73d0e3b20d~88~ubuntu18.04.1*%
%TF.CreationDate,2021-05-13T18:16:41-04:00*%
%TF.ProjectId,remote,72656d6f-7465-42e6-9b69-6361645f7063,rev?*%
%TF.SameCoordinates,Original*%
%TF.FileFunction,Copper,L2,Bot*%
%TF.FilePolarity,Positive*%
%FSLAX46Y46*%
G04 Gerber Fmt 4.6, Leading zero omitted, Abs format (unit mm)*
G04 Created by KiCad (PCBNEW 5.1.9-73d0e3b20d~88~ubuntu18.04.1) date 2021-05-13 18:16:41*
%MOMM*%
%LPD*%
G01*
G04 APERTURE LIST*
%TA.AperFunction,ComponentPad*%
%ADD10O,1.700000X1.700000*%
%TD*%
%TA.AperFunction,ComponentPad*%
%ADD11R,1.700000X1.700000*%
%TD*%
%TA.AperFunction,ComponentPad*%
%ADD12O,1.600000X1.600000*%
%TD*%
%TA.AperFunction,ComponentPad*%
%ADD13R,1.600000X1.600000*%
%TD*%
%TA.AperFunction,ComponentPad*%
%ADD14C,1.600000*%
%TD*%
%TA.AperFunction,SMDPad,CuDef*%
%ADD15R,0.550000X1.200000*%
%TD*%
%TA.AperFunction,ComponentPad*%
%ADD16R,3.500000X3.500000*%
%TD*%
%TA.AperFunction,ComponentPad*%
%ADD17C,1.700000*%
%TD*%
%TA.AperFunction,ComponentPad*%
%ADD18C,2.600000*%
%TD*%
%TA.AperFunction,ComponentPad*%
%ADD19R,2.600000X2.600000*%
%TD*%
%TA.AperFunction,SMDPad,CuDef*%
%ADD20R,1.750000X0.700000*%
%TD*%
%TA.AperFunction,SMDPad,CuDef*%
%ADD21R,1.500000X1.300000*%
%TD*%
%TA.AperFunction,SMDPad,CuDef*%
%ADD22R,1.500000X0.800000*%
%TD*%
%TA.AperFunction,SMDPad,CuDef*%
%ADD23R,1.000000X1.450000*%
%TD*%
%TA.AperFunction,SMDPad,CuDef*%
%ADD24R,1.400000X0.800000*%
%TD*%
%TA.AperFunction,SMDPad,CuDef*%
%ADD25R,1.500000X1.500000*%
%TD*%
%TA.AperFunction,SMDPad,CuDef*%
%ADD26R,1.550000X1.000000*%
%TD*%
%TA.AperFunction,SMDPad,CuDef*%
%ADD27R,0.900000X1.200000*%
%TD*%
%TA.AperFunction,SMDPad,CuDef*%
%ADD28O,0.900000X2.500000*%
%TD*%
%TA.AperFunction,SMDPad,CuDef*%
%ADD29O,2.500000X0.900000*%
%TD*%
%TA.AperFunction,SMDPad,CuDef*%
%ADD30R,6.000000X6.000000*%
%TD*%
%TA.AperFunction,SMDPad,CuDef*%
%ADD31R,2.209800X0.609600*%
%TD*%
%TA.AperFunction,SMDPad,CuDef*%
%ADD32C,0.100000*%
%TD*%
%TA.AperFunction,SMDPad,CuDef*%
%ADD33O,2.000000X1.000000*%
%TD*%
%TA.AperFunction,ViaPad*%
%ADD34C,0.800000*%
%TD*%
%TA.AperFunction,Conductor*%
%ADD35C,0.700000*%
%TD*%
%TA.AperFunction,Conductor*%
%ADD36C,0.400000*%
%TD*%
G04 APERTURE END LIST*
%TO.P,J6,MP*%
%TO.N,N/C*%
%TA.AperFunction,SMDPad,CuDef*%
G36*
G01*
X244556999Y16494400D02*
X245857001Y16494400D01*
G75*
G02*
X246107000Y16244401I0J-249999D01*
G01*
X246107000Y15544399D01*
G75*
G02*
X245857001Y15294400I-249999J0D01*
G01*
X244556999Y15294400D01*
G75*
G02*
X244307000Y15544399I0J249999D01*
G01*
X244307000Y16244401D01*
G75*
G02*
X244556999Y16494400I249999J0D01*
G01*
G37*
%TD.AperFunction*%
%TA.AperFunction,SMDPad,CuDef*%
G36*
G01*
X244556999Y22094400D02*
X245857001Y22094400D01*
G75*
G02*
X246107000Y21844401I0J-249999D01*
G01*
X246107000Y21144399D01*
G75*
G02*
X245857001Y20894400I-249999J0D01*
G01*
X244556999Y20894400D01*
G75*
G02*
X244307000Y21144399I0J249999D01*
G01*
X244307000Y21844401D01*
G75*
G02*
X244556999Y22094400I249999J0D01*
G01*
G37*
%TD.AperFunction*%
%TO.P,J6,4*%
%TO.N,SCL*%
%TA.AperFunction,SMDPad,CuDef*%
G36*
G01*
X240707000Y17494400D02*
X241957000Y17494400D01*
G75*
G02*
X242107000Y17344400I0J-150000D01*
G01*
X242107000Y17044400D01*
G75*
G02*
X241957000Y16894400I-150000J0D01*
G01*
X240707000Y16894400D01*
G75*
G02*
X240557000Y17044400I0J150000D01*
G01*
X240557000Y17344400D01*
G75*
G02*
X240707000Y17494400I150000J0D01*
G01*
G37*
%TD.AperFunction*%
%TO.P,J6,3*%
%TO.N,SDA*%
%TA.AperFunction,SMDPad,CuDef*%
G36*
G01*
X240707000Y18494400D02*
X241957000Y18494400D01*
G75*
G02*
X242107000Y18344400I0J-150000D01*
G01*
X242107000Y18044400D01*
G75*
G02*
X241957000Y17894400I-150000J0D01*
G01*
X240707000Y17894400D01*
G75*
G02*
X240557000Y18044400I0J150000D01*
G01*
X240557000Y18344400D01*
G75*
G02*
X240707000Y18494400I150000J0D01*
G01*
G37*
%TD.AperFunction*%
%TO.P,J6,2*%
%TO.N,+3V3*%
%TA.AperFunction,SMDPad,CuDef*%
G36*
G01*
X240707000Y19494400D02*
X241957000Y19494400D01*
G75*
G02*
X242107000Y19344400I0J-150000D01*
G01*
X242107000Y19044400D01*
G75*
G02*
X241957000Y18894400I-150000J0D01*
G01*
X240707000Y18894400D01*
G75*
G02*
X240557000Y19044400I0J150000D01*
G01*
X240557000Y19344400D01*
G75*
G02*
X240707000Y19494400I150000J0D01*
G01*
G37*
%TD.AperFunction*%
%TO.P,J6,1*%
%TO.N,GND*%
%TA.AperFunction,SMDPad,CuDef*%
G36*
G01*
X240707000Y20494400D02*
X241957000Y20494400D01*
G75*
G02*
X242107000Y20344400I0J-150000D01*
G01*
X242107000Y20044400D01*
G75*
G02*
X241957000Y19894400I-150000J0D01*
G01*
X240707000Y19894400D01*
G75*
G02*
X240557000Y20044400I0J150000D01*
G01*
X240557000Y20344400D01*
G75*
G02*
X240707000Y20494400I150000J0D01*
G01*
G37*
%TD.AperFunction*%
%TD*%
D10*
%TO.P,J2,7*%
%TO.N,GND*%
X240893600Y-6248400D03*
%TO.P,J2,6*%
%TO.N,+3V3*%
X240893600Y-3708400D03*
%TO.P,J2,5*%
%TO.N,VHI*%
X240893600Y-1168400D03*
%TO.P,J2,4*%
%TO.N,ESP_RX*%
X240893600Y1371600D03*
%TO.P,J2,3*%
%TO.N,EXP_TX*%
X240893600Y3911600D03*
%TO.P,J2,2*%
%TO.N,SCL*%
X240893600Y6451600D03*
D11*
%TO.P,J2,1*%
%TO.N,SDA*%
X240893600Y8991600D03*
%TD*%
D12*
%TO.P,SW2,8*%
%TO.N,A0_LORAWAN*%
X229666800Y20370800D03*
%TO.P,SW2,4*%
%TO.N,3_LDO_ENABLE*%
X237286800Y15290800D03*
%TO.P,SW2,C*%
%TO.N,+3V3*%
X229666800Y17830800D03*
X237286800Y17830800D03*
%TO.P,SW2,2*%
%TO.N,4_SERDAT*%
X229666800Y15290800D03*
D13*
%TO.P,SW2,1*%
%TO.N,A5_BUTTON_B*%
X237286800Y20370800D03*
%TD*%
%TO.P,R23,2*%
%TO.N,GND*%
%TA.AperFunction,SMDPad,CuDef*%
G36*
G01*
X216046800Y27550100D02*
X216046800Y28025100D01*
G75*
G02*
X216284300Y28262600I237500J0D01*
G01*
X216859300Y28262600D01*
G75*
G02*
X217096800Y28025100I0J-237500D01*
G01*
X217096800Y27550100D01*
G75*
G02*
X216859300Y27312600I-237500J0D01*
G01*
X216284300Y27312600D01*
G75*
G02*
X216046800Y27550100I0J237500D01*
G01*
G37*
%TD.AperFunction*%
%TO.P,R23,1*%
%TO.N,A5_BUTTON_B*%
%TA.AperFunction,SMDPad,CuDef*%
G36*
G01*
X214296800Y27550100D02*
X214296800Y28025100D01*
G75*
G02*
X214534300Y28262600I237500J0D01*
G01*
X215109300Y28262600D01*
G75*
G02*
X215346800Y28025100I0J-237500D01*
G01*
X215346800Y27550100D01*
G75*
G02*
X215109300Y27312600I-237500J0D01*
G01*
X214534300Y27312600D01*
G75*
G02*
X214296800Y27550100I0J237500D01*
G01*
G37*
%TD.AperFunction*%
%TD*%
D12*
%TO.P,R22,2*%
%TO.N,GND*%
X222148400Y27787600D03*
D14*
%TO.P,R22,1*%
%TO.N,A5_BUTTON_B*%
X209448400Y27787600D03*
%TD*%
%TO.P,R21,2*%
%TO.N,GND*%
%TA.AperFunction,SMDPad,CuDef*%
G36*
G01*
X216007200Y3437900D02*
X216007200Y2962900D01*
G75*
G02*
X215769700Y2725400I-237500J0D01*
G01*
X215194700Y2725400D01*
G75*
G02*
X214957200Y2962900I0J237500D01*
G01*
X214957200Y3437900D01*
G75*
G02*
X215194700Y3675400I237500J0D01*
G01*
X215769700Y3675400D01*
G75*
G02*
X216007200Y3437900I0J-237500D01*
G01*
G37*
%TD.AperFunction*%
%TO.P,R21,1*%
%TO.N,4_SERDAT*%
%TA.AperFunction,SMDPad,CuDef*%
G36*
G01*
X217757200Y3437900D02*
X217757200Y2962900D01*
G75*
G02*
X217519700Y2725400I-237500J0D01*
G01*
X216944700Y2725400D01*
G75*
G02*
X216707200Y2962900I0J237500D01*
G01*
X216707200Y3437900D01*
G75*
G02*
X216944700Y3675400I237500J0D01*
G01*
X217519700Y3675400D01*
G75*
G02*
X217757200Y3437900I0J-237500D01*
G01*
G37*
%TD.AperFunction*%
%TD*%
%TO.P,R20,1*%
%TO.N,4_SERDAT*%
X222554800Y3302000D03*
D12*
%TO.P,R20,2*%
%TO.N,GND*%
X209854800Y3302000D03*
%TD*%
%TO.P,R19,2*%
%TO.N,GND*%
%TA.AperFunction,SMDPad,CuDef*%
G36*
G01*
X216250000Y22825700D02*
X216250000Y23300700D01*
G75*
G02*
X216487500Y23538200I237500J0D01*
G01*
X217062500Y23538200D01*
G75*
G02*
X217300000Y23300700I0J-237500D01*
G01*
X217300000Y22825700D01*
G75*
G02*
X217062500Y22588200I-237500J0D01*
G01*
X216487500Y22588200D01*
G75*
G02*
X216250000Y22825700I0J237500D01*
G01*
G37*
%TD.AperFunction*%
%TO.P,R19,1*%
%TO.N,3_LDO_ENABLE*%
%TA.AperFunction,SMDPad,CuDef*%
G36*
G01*
X214500000Y22825700D02*
X214500000Y23300700D01*
G75*
G02*
X214737500Y23538200I237500J0D01*
G01*
X215312500Y23538200D01*
G75*
G02*
X215550000Y23300700I0J-237500D01*
G01*
X215550000Y22825700D01*
G75*
G02*
X215312500Y22588200I-237500J0D01*
G01*
X214737500Y22588200D01*
G75*
G02*
X214500000Y22825700I0J237500D01*
G01*
G37*
%TD.AperFunction*%
%TD*%
%TO.P,R18,2*%
%TO.N,GND*%
X222148400Y23114000D03*
D14*
%TO.P,R18,1*%
%TO.N,3_LDO_ENABLE*%
X209448400Y23114000D03*
%TD*%
%TO.P,R17,2*%
%TO.N,GND*%
%TA.AperFunction,SMDPad,CuDef*%
G36*
G01*
X215956400Y8213100D02*
X215956400Y7738100D01*
G75*
G02*
X215718900Y7500600I-237500J0D01*
G01*
X215143900Y7500600D01*
G75*
G02*
X214906400Y7738100I0J237500D01*
G01*
X214906400Y8213100D01*
G75*
G02*
X215143900Y8450600I237500J0D01*
G01*
X215718900Y8450600D01*
G75*
G02*
X215956400Y8213100I0J-237500D01*
G01*
G37*
%TD.AperFunction*%
%TO.P,R17,1*%
%TO.N,A0_LORAWAN*%
%TA.AperFunction,SMDPad,CuDef*%
G36*
G01*
X217706400Y8213100D02*
X217706400Y7738100D01*
G75*
G02*
X217468900Y7500600I-237500J0D01*
G01*
X216893900Y7500600D01*
G75*
G02*
X216656400Y7738100I0J237500D01*
G01*
X216656400Y8213100D01*
G75*
G02*
X216893900Y8450600I237500J0D01*
G01*
X217468900Y8450600D01*
G75*
G02*
X217706400Y8213100I0J-237500D01*
G01*
G37*
%TD.AperFunction*%
%TD*%
D12*
%TO.P,R16,2*%
%TO.N,GND*%
X209854800Y7975600D03*
D14*
%TO.P,R16,1*%
%TO.N,A0_LORAWAN*%
X222554800Y7975600D03*
%TD*%
%TO.P,C7,1*%
%TO.N,3VESP*%
%TA.AperFunction,SMDPad,CuDef*%
G36*
G01*
X186661600Y36795700D02*
X186661600Y37270700D01*
G75*
G02*
X186899100Y37508200I237500J0D01*
G01*
X187474100Y37508200D01*
G75*
G02*
X187711600Y37270700I0J-237500D01*
G01*
X187711600Y36795700D01*
G75*
G02*
X187474100Y36558200I-237500J0D01*
G01*
X186899100Y36558200D01*
G75*
G02*
X186661600Y36795700I0J237500D01*
G01*
G37*
%TD.AperFunction*%
%TO.P,C7,2*%
%TO.N,GND*%
%TA.AperFunction,SMDPad,CuDef*%
G36*
G01*
X188411600Y36795700D02*
X188411600Y37270700D01*
G75*
G02*
X188649100Y37508200I237500J0D01*
G01*
X189224100Y37508200D01*
G75*
G02*
X189461600Y37270700I0J-237500D01*
G01*
X189461600Y36795700D01*
G75*
G02*
X189224100Y36558200I-237500J0D01*
G01*
X188649100Y36558200D01*
G75*
G02*
X188411600Y36795700I0J237500D01*
G01*
G37*
%TD.AperFunction*%
%TD*%
%TO.P,C6,1*%
%TO.N,3VESP*%
%TA.AperFunction,SMDPad,CuDef*%
G36*
G01*
X186407600Y62094100D02*
X186407600Y62569100D01*
G75*
G02*
X186645100Y62806600I237500J0D01*
G01*
X187220100Y62806600D01*
G75*
G02*
X187457600Y62569100I0J-237500D01*
G01*
X187457600Y62094100D01*
G75*
G02*
X187220100Y61856600I-237500J0D01*
G01*
X186645100Y61856600D01*
G75*
G02*
X186407600Y62094100I0J237500D01*
G01*
G37*
%TD.AperFunction*%
%TO.P,C6,2*%
%TO.N,GND*%
%TA.AperFunction,SMDPad,CuDef*%
G36*
G01*
X188157600Y62094100D02*
X188157600Y62569100D01*
G75*
G02*
X188395100Y62806600I237500J0D01*
G01*
X188970100Y62806600D01*
G75*
G02*
X189207600Y62569100I0J-237500D01*
G01*
X189207600Y62094100D01*
G75*
G02*
X188970100Y61856600I-237500J0D01*
G01*
X188395100Y61856600D01*
G75*
G02*
X188157600Y62094100I0J237500D01*
G01*
G37*
%TD.AperFunction*%
%TD*%
D15*
%TO.P,U2,5*%
%TO.N,3VESP*%
X189550000Y-8767700D03*
%TO.P,U2,4*%
%TO.N,N/C*%
X191450000Y-8767700D03*
%TO.P,U2,3*%
%TO.N,Net-(R10-Pad2)*%
X191450000Y-6167500D03*
%TO.P,U2,2*%
%TO.N,GND*%
X190500000Y-6167500D03*
%TO.P,U2,1*%
%TO.N,Net-(C1-Pad1)*%
X189550000Y-6167500D03*
%TD*%
%TO.P,J4,3*%
%TO.N,N/C*%
%TA.AperFunction,ComponentPad*%
G36*
G01*
X210906600Y-10439600D02*
X209156600Y-10439600D01*
G75*
G02*
X208281600Y-9564600I0J875000D01*
G01*
X208281600Y-7814600D01*
G75*
G02*
X209156600Y-6939600I875000J0D01*
G01*
X210906600Y-6939600D01*
G75*
G02*
X211781600Y-7814600I0J-875000D01*
G01*
X211781600Y-9564600D01*
G75*
G02*
X210906600Y-10439600I-875000J0D01*
G01*
G37*
%TD.AperFunction*%
%TO.P,J4,2*%
%TO.N,GND*%
%TA.AperFunction,ComponentPad*%
G36*
G01*
X215731600Y-13189600D02*
X213731600Y-13189600D01*
G75*
G02*
X212981600Y-12439600I0J750000D01*
G01*
X212981600Y-10939600D01*
G75*
G02*
X213731600Y-10189600I750000J0D01*
G01*
X215731600Y-10189600D01*
G75*
G02*
X216481600Y-10939600I0J-750000D01*
G01*
X216481600Y-12439600D01*
G75*
G02*
X215731600Y-13189600I-750000J0D01*
G01*
G37*
%TD.AperFunction*%
D16*
%TO.P,J4,1*%
%TO.N,VBAT*%
X214731600Y-5689600D03*
%TD*%
D12*
%TO.P,R14,2*%
%TO.N,5_NEOPIXEL*%
X219100400Y56032400D03*
D14*
%TO.P,R14,1*%
%TO.N,Net-(J1-Pad3)*%
X219100400Y43332400D03*
%TD*%
D17*
%TO.P,SW3,1*%
%TO.N,~RESET*%
X235762800Y-1879600D03*
%TO.P,SW3,2*%
X235762800Y4620400D03*
%TO.P,SW3,3*%
%TO.N,GND*%
X231262800Y-1879600D03*
%TO.P,SW3,4*%
X231262800Y4620400D03*
%TD*%
D18*
%TO.P,J7,2*%
%TO.N,VBAT*%
X199774800Y-12700000D03*
D19*
%TO.P,J7,1*%
%TO.N,GND*%
X204774800Y-12700000D03*
%TD*%
D20*
%TO.P,J15,8*%
%TO.N,N/C*%
X243191000Y55884200D03*
D21*
%TO.P,J15,9*%
X243066000Y57084200D03*
D22*
%TO.P,J15,10*%
X235466000Y57334200D03*
D23*
%TO.P,J15,B*%
X233966000Y57009200D03*
D24*
%TO.P,J15,11*%
X234816000Y45384200D03*
D20*
%TO.P,J15,7*%
%TO.N,MISO*%
X243191000Y54784200D03*
%TO.P,J15,6*%
%TO.N,GND*%
X243191000Y53684200D03*
%TO.P,J15,5*%
%TO.N,SCK*%
X243191000Y52584200D03*
%TO.P,J15,4*%
%TO.N,+3V3*%
X243191000Y51484200D03*
%TO.P,J15,3*%
%TO.N,MOSI*%
X243191000Y50384200D03*
%TO.P,J15,2*%
%TO.N,A1_SD_CS*%
X243191000Y49284200D03*
%TO.P,J15,1*%
%TO.N,N/C*%
X243191000Y48184200D03*
D25*
%TO.P,J15,12*%
X243066000Y45734200D03*
D26*
%TO.P,J15,A*%
X232391000Y45784200D03*
%TD*%
D12*
%TO.P,R4,2*%
%TO.N,SCL*%
X219659200Y65026777D03*
D14*
%TO.P,R4,1*%
%TO.N,+3V3*%
X206959200Y65026777D03*
%TD*%
D12*
%TO.P,R2,2*%
%TO.N,SDA*%
X219659200Y69218240D03*
D14*
%TO.P,R2,1*%
%TO.N,+3V3*%
X206959200Y69218240D03*
%TD*%
D12*
%TO.P,R6,2*%
%TO.N,A3_BUTTON_A*%
X223773538Y56083200D03*
D14*
%TO.P,R6,1*%
%TO.N,+3V3*%
X223773538Y43383200D03*
%TD*%
%TO.P,R15,2*%
%TO.N,5_NEOPIXEL*%
%TA.AperFunction,SMDPad,CuDef*%
G36*
G01*
X219439500Y49778400D02*
X218964500Y49778400D01*
G75*
G02*
X218727000Y50015900I0J237500D01*
G01*
X218727000Y50590900D01*
G75*
G02*
X218964500Y50828400I237500J0D01*
G01*
X219439500Y50828400D01*
G75*
G02*
X219677000Y50590900I0J-237500D01*
G01*
X219677000Y50015900D01*
G75*
G02*
X219439500Y49778400I-237500J0D01*
G01*
G37*
%TD.AperFunction*%
%TO.P,R15,1*%
%TO.N,Net-(J1-Pad3)*%
%TA.AperFunction,SMDPad,CuDef*%
G36*
G01*
X219439500Y48028400D02*
X218964500Y48028400D01*
G75*
G02*
X218727000Y48265900I0J237500D01*
G01*
X218727000Y48840900D01*
G75*
G02*
X218964500Y49078400I237500J0D01*
G01*
X219439500Y49078400D01*
G75*
G02*
X219677000Y48840900I0J-237500D01*
G01*
X219677000Y48265900D01*
G75*
G02*
X219439500Y48028400I-237500J0D01*
G01*
G37*
%TD.AperFunction*%
%TD*%
D27*
%TO.P,D1,2*%
%TO.N,Net-(C1-Pad1)*%
X196520800Y-6451600D03*
%TO.P,D1,1*%
%TO.N,VHI*%
X199820800Y-6451600D03*
%TD*%
D11*
%TO.P,J1,1*%
%TO.N,GND*%
X232994200Y75336400D03*
D10*
%TO.P,J1,2*%
%TO.N,VHI*%
X235534200Y75336400D03*
%TO.P,J1,3*%
%TO.N,Net-(J1-Pad3)*%
X238074200Y75336400D03*
%TO.P,J1,4*%
%TO.N,GND*%
X240614200Y75336400D03*
%TD*%
%TO.P,C5,2*%
%TO.N,GND*%
%TA.AperFunction,SMDPad,CuDef*%
G36*
G01*
X229508800Y59401700D02*
X229508800Y59876700D01*
G75*
G02*
X229746300Y60114200I237500J0D01*
G01*
X230321300Y60114200D01*
G75*
G02*
X230558800Y59876700I0J-237500D01*
G01*
X230558800Y59401700D01*
G75*
G02*
X230321300Y59164200I-237500J0D01*
G01*
X229746300Y59164200D01*
G75*
G02*
X229508800Y59401700I0J237500D01*
G01*
G37*
%TD.AperFunction*%
%TO.P,C5,1*%
%TO.N,+3V3*%
%TA.AperFunction,SMDPad,CuDef*%
G36*
G01*
X227758800Y59401700D02*
X227758800Y59876700D01*
G75*
G02*
X227996300Y60114200I237500J0D01*
G01*
X228571300Y60114200D01*
G75*
G02*
X228808800Y59876700I0J-237500D01*
G01*
X228808800Y59401700D01*
G75*
G02*
X228571300Y59164200I-237500J0D01*
G01*
X227996300Y59164200D01*
G75*
G02*
X227758800Y59401700I0J237500D01*
G01*
G37*
%TD.AperFunction*%
%TD*%
D11*
%TO.P,J17,1*%
%TO.N,N/C*%
X225475800Y20599400D03*
D10*
%TO.P,J17,2*%
X225475800Y23139400D03*
%TO.P,J17,3*%
X225475800Y25679400D03*
%TO.P,J17,4*%
%TO.N,3_LDO_ENABLE*%
X225475800Y28219400D03*
%TO.P,J17,5*%
%TO.N,4_SERDAT*%
X225475800Y30759400D03*
%TD*%
D11*
%TO.P,J14,1*%
%TO.N,2_ESP_GPIO0*%
X225475800Y18059400D03*
D10*
%TO.P,J14,2*%
%TO.N,MISO*%
X222935800Y18059400D03*
%TO.P,J14,3*%
%TO.N,MOSI*%
X220395800Y18059400D03*
%TO.P,J14,4*%
%TO.N,SCK*%
X217855800Y18059400D03*
%TO.P,J14,5*%
%TO.N,A5_BUTTON_B*%
X215315800Y18059400D03*
%TO.P,J14,6*%
%TO.N,A4_LORA_CS*%
X212775800Y18059400D03*
%TO.P,J14,7*%
%TO.N,A3_BUTTON_A*%
X210235800Y18059400D03*
%TO.P,J14,8*%
%TO.N,A2_LORA_IRQ*%
X207695800Y18059400D03*
%TO.P,J14,9*%
%TO.N,A1_SD_CS*%
X205155800Y18059400D03*
%TO.P,J14,10*%
%TO.N,A0_LORAWAN*%
X202615800Y18059400D03*
%TO.P,J14,11*%
%TO.N,VHI*%
X200075800Y18059400D03*
%TO.P,J14,12*%
%TO.N,N/C*%
X197535800Y18059400D03*
%TO.P,J14,13*%
%TO.N,+3V3*%
X194995800Y18059400D03*
%TO.P,J14,14*%
%TO.N,~RESET*%
X192455800Y18059400D03*
%TD*%
D11*
%TO.P,J13,1*%
%TO.N,N/C*%
X225399600Y-1727200D03*
D10*
%TO.P,J13,2*%
%TO.N,MISO*%
X222859600Y-1727200D03*
%TO.P,J13,3*%
%TO.N,MOSI*%
X220319600Y-1727200D03*
%TO.P,J13,4*%
%TO.N,SCK*%
X217779600Y-1727200D03*
%TO.P,J13,5*%
%TO.N,N/C*%
X215239600Y-1727200D03*
%TO.P,J13,6*%
X212699600Y-1727200D03*
%TO.P,J13,7*%
X210159600Y-1727200D03*
%TO.P,J13,8*%
X207619600Y-1727200D03*
%TO.P,J13,9*%
X205079600Y-1727200D03*
%TO.P,J13,10*%
X202539600Y-1727200D03*
%TO.P,J13,11*%
X199999600Y-1727200D03*
%TO.P,J13,12*%
X197459600Y-1727200D03*
%TO.P,J13,13*%
%TO.N,3VESP*%
X194919600Y-1727200D03*
%TO.P,J13,14*%
%TO.N,N/C*%
X192379600Y-1727200D03*
%TD*%
D11*
%TO.P,J12,1*%
%TO.N,N/C*%
X192379600Y13512800D03*
D10*
%TO.P,J12,2*%
%TO.N,GND*%
X194919600Y13512800D03*
%TO.P,J12,3*%
%TO.N,N/C*%
X197459600Y13512800D03*
%TO.P,J12,4*%
%TO.N,10_ESP_CS*%
X199999600Y13512800D03*
%TO.P,J12,5*%
%TO.N,7_ESP_RESET*%
X202539600Y13512800D03*
%TO.P,J12,6*%
%TO.N,9_ESP_BUSY*%
X205079600Y13512800D03*
%TO.P,J12,7*%
%TO.N,2_ESP_GPIO0*%
X207619600Y13512800D03*
%TO.P,J12,8*%
%TO.N,N/C*%
X210159600Y13512800D03*
%TO.P,J12,9*%
X212699600Y13512800D03*
%TO.P,J12,10*%
X215239600Y13512800D03*
%TO.P,J12,11*%
X217779600Y13512800D03*
%TO.P,J12,12*%
X220319600Y13512800D03*
%TO.P,J12,13*%
%TO.N,ESP_RX*%
X222859600Y13512800D03*
%TO.P,J12,14*%
%TO.N,EXP_TX*%
X225399600Y13512800D03*
%TD*%
D11*
%TO.P,J3,1*%
%TO.N,VBAT*%
X192455800Y33299400D03*
D10*
%TO.P,J3,2*%
%TO.N,GND*%
X194995800Y33299400D03*
%TO.P,J3,3*%
%TO.N,N/C*%
X197535800Y33299400D03*
%TO.P,J3,4*%
%TO.N,13_LORA_SCK*%
X200075800Y33299400D03*
%TO.P,J3,5*%
%TO.N,12_LORA_MISO*%
X202615800Y33299400D03*
%TO.P,J3,6*%
%TO.N,11_LORA_MOSI*%
X205155800Y33299400D03*
%TO.P,J3,7*%
%TO.N,10_ESP_CS*%
X207695800Y33299400D03*
%TO.P,J3,8*%
%TO.N,9_ESP_BUSY*%
X210235800Y33299400D03*
%TO.P,J3,9*%
%TO.N,7_ESP_RESET*%
X212775800Y33299400D03*
%TO.P,J3,10*%
%TO.N,5_NEOPIXEL*%
X215315800Y33299400D03*
%TO.P,J3,11*%
%TO.N,SCL*%
X217855800Y33299400D03*
%TO.P,J3,12*%
%TO.N,SDA*%
X220395800Y33299400D03*
%TO.P,J3,13*%
%TO.N,ESP_RX*%
X222935800Y33299400D03*
%TO.P,J3,14*%
%TO.N,EXP_TX*%
X225475800Y33299400D03*
%TD*%
%TO.P,R5,2*%
%TO.N,A3_BUTTON_A*%
%TA.AperFunction,SMDPad,CuDef*%
G36*
G01*
X223935300Y49921200D02*
X223460300Y49921200D01*
G75*
G02*
X223222800Y50158700I0J237500D01*
G01*
X223222800Y50733700D01*
G75*
G02*
X223460300Y50971200I237500J0D01*
G01*
X223935300Y50971200D01*
G75*
G02*
X224172800Y50733700I0J-237500D01*
G01*
X224172800Y50158700D01*
G75*
G02*
X223935300Y49921200I-237500J0D01*
G01*
G37*
%TD.AperFunction*%
%TO.P,R5,1*%
%TO.N,+3V3*%
%TA.AperFunction,SMDPad,CuDef*%
G36*
G01*
X223935300Y48171200D02*
X223460300Y48171200D01*
G75*
G02*
X223222800Y48408700I0J237500D01*
G01*
X223222800Y48983700D01*
G75*
G02*
X223460300Y49221200I237500J0D01*
G01*
X223935300Y49221200D01*
G75*
G02*
X224172800Y48983700I0J-237500D01*
G01*
X224172800Y48408700D01*
G75*
G02*
X223935300Y48171200I-237500J0D01*
G01*
G37*
%TD.AperFunction*%
%TD*%
%TO.P,R3,2*%
%TO.N,SCL*%
%TA.AperFunction,SMDPad,CuDef*%
G36*
G01*
X213344800Y64684900D02*
X213344800Y65159900D01*
G75*
G02*
X213582300Y65397400I237500J0D01*
G01*
X214157300Y65397400D01*
G75*
G02*
X214394800Y65159900I0J-237500D01*
G01*
X214394800Y64684900D01*
G75*
G02*
X214157300Y64447400I-237500J0D01*
G01*
X213582300Y64447400D01*
G75*
G02*
X213344800Y64684900I0J237500D01*
G01*
G37*
%TD.AperFunction*%
%TO.P,R3,1*%
%TO.N,+3V3*%
%TA.AperFunction,SMDPad,CuDef*%
G36*
G01*
X211594800Y64684900D02*
X211594800Y65159900D01*
G75*
G02*
X211832300Y65397400I237500J0D01*
G01*
X212407300Y65397400D01*
G75*
G02*
X212644800Y65159900I0J-237500D01*
G01*
X212644800Y64684900D01*
G75*
G02*
X212407300Y64447400I-237500J0D01*
G01*
X211832300Y64447400D01*
G75*
G02*
X211594800Y64684900I0J237500D01*
G01*
G37*
%TD.AperFunction*%
%TD*%
%TO.P,R1,2*%
%TO.N,SDA*%
%TA.AperFunction,SMDPad,CuDef*%
G36*
G01*
X213344800Y68825100D02*
X213344800Y69300100D01*
G75*
G02*
X213582300Y69537600I237500J0D01*
G01*
X214157300Y69537600D01*
G75*
G02*
X214394800Y69300100I0J-237500D01*
G01*
X214394800Y68825100D01*
G75*
G02*
X214157300Y68587600I-237500J0D01*
G01*
X213582300Y68587600D01*
G75*
G02*
X213344800Y68825100I0J237500D01*
G01*
G37*
%TD.AperFunction*%
%TO.P,R1,1*%
%TO.N,+3V3*%
%TA.AperFunction,SMDPad,CuDef*%
G36*
G01*
X211594800Y68825100D02*
X211594800Y69300100D01*
G75*
G02*
X211832300Y69537600I237500J0D01*
G01*
X212407300Y69537600D01*
G75*
G02*
X212644800Y69300100I0J-237500D01*
G01*
X212644800Y68825100D01*
G75*
G02*
X212407300Y68587600I-237500J0D01*
G01*
X211832300Y68587600D01*
G75*
G02*
X211594800Y68825100I0J237500D01*
G01*
G37*
%TD.AperFunction*%
%TD*%
%TO.P,C1,1*%
%TO.N,Net-(C1-Pad1)*%
%TA.AperFunction,SMDPad,CuDef*%
G36*
G01*
X201444400Y-6739900D02*
X201444400Y-6264900D01*
G75*
G02*
X201681900Y-6027400I237500J0D01*
G01*
X202256900Y-6027400D01*
G75*
G02*
X202494400Y-6264900I0J-237500D01*
G01*
X202494400Y-6739900D01*
G75*
G02*
X202256900Y-6977400I-237500J0D01*
G01*
X201681900Y-6977400D01*
G75*
G02*
X201444400Y-6739900I0J237500D01*
G01*
G37*
%TD.AperFunction*%
%TO.P,C1,2*%
%TO.N,GND*%
%TA.AperFunction,SMDPad,CuDef*%
G36*
G01*
X203194400Y-6739900D02*
X203194400Y-6264900D01*
G75*
G02*
X203431900Y-6027400I237500J0D01*
G01*
X204006900Y-6027400D01*
G75*
G02*
X204244400Y-6264900I0J-237500D01*
G01*
X204244400Y-6739900D01*
G75*
G02*
X204006900Y-6977400I-237500J0D01*
G01*
X203431900Y-6977400D01*
G75*
G02*
X203194400Y-6739900I0J237500D01*
G01*
G37*
%TD.AperFunction*%
%TD*%
%TO.P,R11,2*%
%TO.N,10_ESP_CS*%
%TA.AperFunction,SMDPad,CuDef*%
G36*
G01*
X201314800Y70933300D02*
X201314800Y71408300D01*
G75*
G02*
X201552300Y71645800I237500J0D01*
G01*
X202127300Y71645800D01*
G75*
G02*
X202364800Y71408300I0J-237500D01*
G01*
X202364800Y70933300D01*
G75*
G02*
X202127300Y70695800I-237500J0D01*
G01*
X201552300Y70695800D01*
G75*
G02*
X201314800Y70933300I0J237500D01*
G01*
G37*
%TD.AperFunction*%
%TO.P,R11,1*%
%TO.N,3VESP*%
%TA.AperFunction,SMDPad,CuDef*%
G36*
G01*
X199564800Y70933300D02*
X199564800Y71408300D01*
G75*
G02*
X199802300Y71645800I237500J0D01*
G01*
X200377300Y71645800D01*
G75*
G02*
X200614800Y71408300I0J-237500D01*
G01*
X200614800Y70933300D01*
G75*
G02*
X200377300Y70695800I-237500J0D01*
G01*
X199802300Y70695800D01*
G75*
G02*
X199564800Y70933300I0J237500D01*
G01*
G37*
%TD.AperFunction*%
%TD*%
%TO.P,R10,2*%
%TO.N,Net-(R10-Pad2)*%
%TA.AperFunction,SMDPad,CuDef*%
G36*
G01*
X193869300Y-8274800D02*
X194344300Y-8274800D01*
G75*
G02*
X194581800Y-8512300I0J-237500D01*
G01*
X194581800Y-9087300D01*
G75*
G02*
X194344300Y-9324800I-237500J0D01*
G01*
X193869300Y-9324800D01*
G75*
G02*
X193631800Y-9087300I0J237500D01*
G01*
X193631800Y-8512300D01*
G75*
G02*
X193869300Y-8274800I237500J0D01*
G01*
G37*
%TD.AperFunction*%
%TO.P,R10,1*%
%TO.N,Net-(C1-Pad1)*%
%TA.AperFunction,SMDPad,CuDef*%
G36*
G01*
X193869300Y-6524800D02*
X194344300Y-6524800D01*
G75*
G02*
X194581800Y-6762300I0J-237500D01*
G01*
X194581800Y-7337300D01*
G75*
G02*
X194344300Y-7574800I-237500J0D01*
G01*
X193869300Y-7574800D01*
G75*
G02*
X193631800Y-7337300I0J237500D01*
G01*
X193631800Y-6762300D01*
G75*
G02*
X193869300Y-6524800I237500J0D01*
G01*
G37*
%TD.AperFunction*%
%TD*%
%TO.P,R9,1*%
%TO.N,VHI*%
%TA.AperFunction,SMDPad,CuDef*%
G36*
G01*
X208105200Y-5452100D02*
X208105200Y-5927100D01*
G75*
G02*
X207867700Y-6164600I-237500J0D01*
G01*
X207292700Y-6164600D01*
G75*
G02*
X207055200Y-5927100I0J237500D01*
G01*
X207055200Y-5452100D01*
G75*
G02*
X207292700Y-5214600I237500J0D01*
G01*
X207867700Y-5214600D01*
G75*
G02*
X208105200Y-5452100I0J-237500D01*
G01*
G37*
%TD.AperFunction*%
%TO.P,R9,2*%
%TO.N,GND*%
%TA.AperFunction,SMDPad,CuDef*%
G36*
G01*
X206355200Y-5452100D02*
X206355200Y-5927100D01*
G75*
G02*
X206117700Y-6164600I-237500J0D01*
G01*
X205542700Y-6164600D01*
G75*
G02*
X205305200Y-5927100I0J237500D01*
G01*
X205305200Y-5452100D01*
G75*
G02*
X205542700Y-5214600I237500J0D01*
G01*
X206117700Y-5214600D01*
G75*
G02*
X206355200Y-5452100I0J-237500D01*
G01*
G37*
%TD.AperFunction*%
%TD*%
%TO.P,C4,1*%
%TO.N,3VESP*%
%TA.AperFunction,SMDPad,CuDef*%
G36*
G01*
X187689500Y-8766000D02*
X187214500Y-8766000D01*
G75*
G02*
X186977000Y-8528500I0J237500D01*
G01*
X186977000Y-7953500D01*
G75*
G02*
X187214500Y-7716000I237500J0D01*
G01*
X187689500Y-7716000D01*
G75*
G02*
X187927000Y-7953500I0J-237500D01*
G01*
X187927000Y-8528500D01*
G75*
G02*
X187689500Y-8766000I-237500J0D01*
G01*
G37*
%TD.AperFunction*%
%TO.P,C4,2*%
%TO.N,GND*%
%TA.AperFunction,SMDPad,CuDef*%
G36*
G01*
X187689500Y-7016000D02*
X187214500Y-7016000D01*
G75*
G02*
X186977000Y-6778500I0J237500D01*
G01*
X186977000Y-6203500D01*
G75*
G02*
X187214500Y-5966000I237500J0D01*
G01*
X187689500Y-5966000D01*
G75*
G02*
X187927000Y-6203500I0J-237500D01*
G01*
X187927000Y-6778500D01*
G75*
G02*
X187689500Y-7016000I-237500J0D01*
G01*
G37*
%TD.AperFunction*%
%TD*%
%TO.P,C3,1*%
%TO.N,3VESP*%
%TA.AperFunction,SMDPad,CuDef*%
G36*
G01*
X189817200Y1609100D02*
X189817200Y1134100D01*
G75*
G02*
X189579700Y896600I-237500J0D01*
G01*
X189004700Y896600D01*
G75*
G02*
X188767200Y1134100I0J237500D01*
G01*
X188767200Y1609100D01*
G75*
G02*
X189004700Y1846600I237500J0D01*
G01*
X189579700Y1846600D01*
G75*
G02*
X189817200Y1609100I0J-237500D01*
G01*
G37*
%TD.AperFunction*%
%TO.P,C3,2*%
%TO.N,GND*%
%TA.AperFunction,SMDPad,CuDef*%
G36*
G01*
X188067200Y1609100D02*
X188067200Y1134100D01*
G75*
G02*
X187829700Y896600I-237500J0D01*
G01*
X187254700Y896600D01*
G75*
G02*
X187017200Y1134100I0J237500D01*
G01*
X187017200Y1609100D01*
G75*
G02*
X187254700Y1846600I237500J0D01*
G01*
X187829700Y1846600D01*
G75*
G02*
X188067200Y1609100I0J-237500D01*
G01*
G37*
%TD.AperFunction*%
%TD*%
%TO.P,C2,1*%
%TO.N,3VESP*%
%TA.AperFunction,SMDPad,CuDef*%
G36*
G01*
X189715600Y5774700D02*
X189715600Y5299700D01*
G75*
G02*
X189478100Y5062200I-237500J0D01*
G01*
X188903100Y5062200D01*
G75*
G02*
X188665600Y5299700I0J237500D01*
G01*
X188665600Y5774700D01*
G75*
G02*
X188903100Y6012200I237500J0D01*
G01*
X189478100Y6012200D01*
G75*
G02*
X189715600Y5774700I0J-237500D01*
G01*
G37*
%TD.AperFunction*%
%TO.P,C2,2*%
%TO.N,GND*%
%TA.AperFunction,SMDPad,CuDef*%
G36*
G01*
X187965600Y5774700D02*
X187965600Y5299700D01*
G75*
G02*
X187728100Y5062200I-237500J0D01*
G01*
X187153100Y5062200D01*
G75*
G02*
X186915600Y5299700I0J237500D01*
G01*
X186915600Y5774700D01*
G75*
G02*
X187153100Y6012200I237500J0D01*
G01*
X187728100Y6012200D01*
G75*
G02*
X187965600Y5774700I0J-237500D01*
G01*
G37*
%TD.AperFunction*%
%TD*%
D28*
%TO.P,X1,38*%
%TO.N,GND*%
X192717600Y41241200D03*
%TO.P,X1,37*%
%TO.N,ESP_MISO*%
X193987600Y41241200D03*
%TO.P,X1,36*%
%TO.N,N/C*%
X195257600Y41241200D03*
%TO.P,X1,35*%
X196527600Y41241200D03*
%TO.P,X1,34*%
%TO.N,ESP_RX*%
X197797600Y41241200D03*
%TO.P,X1,33*%
%TO.N,N/C*%
X199067600Y41241200D03*
%TO.P,X1,32*%
X200337600Y41241200D03*
%TO.P,X1,31*%
X201607600Y41241200D03*
%TO.P,X1,30*%
%TO.N,SCK*%
X202877600Y41241200D03*
%TO.P,X1,29*%
%TO.N,10_ESP_CS*%
X204147600Y41241200D03*
%TO.P,X1,28*%
%TO.N,N/C*%
X205417600Y41241200D03*
%TO.P,X1,27*%
X206687600Y41241200D03*
%TO.P,X1,26*%
X207957600Y41241200D03*
%TO.P,X1,25*%
%TO.N,2_ESP_GPIO0*%
X209227600Y41241200D03*
D29*
%TO.P,X1,24*%
%TO.N,N/C*%
X210717600Y44526200D03*
%TO.P,X1,23*%
X210717600Y45796200D03*
%TO.P,X1,22*%
X210717600Y47066200D03*
%TO.P,X1,21*%
X210717600Y48336200D03*
%TO.P,X1,20*%
X210717600Y49606200D03*
%TO.P,X1,19*%
X210717600Y50876200D03*
%TO.P,X1,18*%
X210717600Y52146200D03*
%TO.P,X1,17*%
X210717600Y53416200D03*
%TO.P,X1,16*%
X210717600Y54686200D03*
%TO.P,X1,15*%
%TO.N,GND*%
X210717600Y55956200D03*
D28*
%TO.P,X1,14*%
%TO.N,N/C*%
X209227600Y59241200D03*
%TO.P,X1,13*%
%TO.N,MOSI*%
X207957600Y59241200D03*
%TO.P,X1,12*%
%TO.N,N/C*%
X206687600Y59241200D03*
%TO.P,X1,11*%
X205417600Y59241200D03*
%TO.P,X1,10*%
X204147600Y59241200D03*
%TO.P,X1,9*%
%TO.N,9_ESP_BUSY*%
X202877600Y59241200D03*
%TO.P,X1,8*%
%TO.N,N/C*%
X201607600Y59241200D03*
%TO.P,X1,7*%
X200337600Y59241200D03*
%TO.P,X1,6*%
X199067600Y59241200D03*
%TO.P,X1,5*%
X197797600Y59241200D03*
%TO.P,X1,4*%
X196527600Y59241200D03*
%TO.P,X1,3*%
%TO.N,7_ESP_RESET*%
X195257600Y59241200D03*
%TO.P,X1,2*%
%TO.N,3VESP*%
X193987600Y59241200D03*
%TO.P,X1,1*%
%TO.N,GND*%
X192717600Y59241200D03*
D30*
%TO.P,X1,39*%
%TO.N,N/C*%
X200417600Y50541200D03*
%TD*%
D15*
%TO.P,IC1,1*%
%TO.N,10_ESP_CS*%
X201711600Y63774800D03*
%TO.P,IC1,2*%
%TO.N,ESP_MISO*%
X200761600Y63774800D03*
%TO.P,IC1,3*%
%TO.N,GND*%
X199811600Y63774800D03*
%TO.P,IC1,4*%
%TO.N,MISO*%
X199811600Y66374800D03*
%TO.P,IC1,5*%
%TO.N,3VESP*%
X201711600Y66374800D03*
%TD*%
D31*
%TO.P,EC1,1*%
%TO.N,N/C*%
X196418200Y88214200D03*
%TO.P,EC1,2*%
X196418200Y89484200D03*
%TO.P,EC1,3*%
X196418200Y90754200D03*
%TO.P,EC1,4*%
%TO.N,GND*%
X196418200Y92024200D03*
%TO.P,EC1,5*%
%TO.N,SDA*%
X201650600Y92024200D03*
%TO.P,EC1,6*%
%TO.N,SCL*%
X201650600Y90754200D03*
%TO.P,EC1,7*%
%TO.N,N/C*%
X201650600Y89484200D03*
%TO.P,EC1,8*%
%TO.N,+3V3*%
X201650600Y88214200D03*
%TD*%
D11*
%TO.P,J5,1*%
%TO.N,Net-(J5-Pad1)*%
X234340400Y95808800D03*
%TD*%
%TA.AperFunction,SMDPad,CuDef*%
D32*
%TO.P,JP1,1*%
%TO.N,LORA_DIO1*%
G36*
X226242200Y66751200D02*
G01*
X226742200Y67501200D01*
X227742200Y67501200D01*
X227742200Y66001200D01*
X226742200Y66001200D01*
X226242200Y66751200D01*
G37*
%TD.AperFunction*%
%TA.AperFunction,SMDPad,CuDef*%
%TO.P,JP1,2*%
%TO.N,A0_LORAWAN*%
G36*
X225292200Y67501200D02*
G01*
X226442200Y67501200D01*
X225942200Y66751200D01*
X226442200Y66001200D01*
X225292200Y66001200D01*
X225292200Y67501200D01*
G37*
%TD.AperFunction*%
%TD*%
D33*
%TO.P,U1,16*%
%TO.N,N/C*%
X235049600Y79248000D03*
%TO.P,U1,15*%
%TO.N,LORA_DIO1*%
X235049600Y81248000D03*
%TO.P,U1,14*%
%TO.N,A2_LORA_IRQ*%
X235049600Y83248000D03*
%TO.P,U1,13*%
%TO.N,+3V3*%
X235049600Y85248000D03*
%TO.P,U1,12*%
%TO.N,N/C*%
X235049600Y87248000D03*
%TO.P,U1,11*%
X235049600Y89248000D03*
%TO.P,U1,10*%
%TO.N,GND*%
X235049600Y91248000D03*
%TO.P,U1,9*%
%TO.N,Net-(J5-Pad1)*%
X235049600Y93248000D03*
%TO.P,U1,8*%
%TO.N,GND*%
X219049600Y93248000D03*
%TO.P,U1,7*%
%TO.N,N/C*%
X219049600Y91248000D03*
%TO.P,U1,6*%
X219049600Y89248000D03*
%TO.P,U1,5*%
%TO.N,A4_LORA_CS*%
X219049600Y87248000D03*
%TO.P,U1,4*%
%TO.N,13_LORA_SCK*%
X219049600Y85248000D03*
%TO.P,U1,3*%
%TO.N,11_LORA_MOSI*%
X219049600Y83248000D03*
%TO.P,U1,2*%
%TO.N,12_LORA_MISO*%
X219049600Y81248000D03*
%TO.P,U1,1*%
%TO.N,GND*%
X219049600Y79248000D03*
%TD*%
%TO.P,J11,MP*%
%TO.N,N/C*%
%TA.AperFunction,SMDPad,CuDef*%
G36*
G01*
X228381200Y-17379399D02*
X228381200Y-18679401D01*
G75*
G02*
X228131201Y-18929400I-249999J0D01*
G01*
X227431199Y-18929400D01*
G75*
G02*
X227181200Y-18679401I0J249999D01*
G01*
X227181200Y-17379399D01*
G75*
G02*
X227431199Y-17129400I249999J0D01*
G01*
X228131201Y-17129400D01*
G75*
G02*
X228381200Y-17379399I0J-249999D01*
G01*
G37*
%TD.AperFunction*%
%TA.AperFunction,SMDPad,CuDef*%
G36*
G01*
X233981200Y-17379399D02*
X233981200Y-18679401D01*
G75*
G02*
X233731201Y-18929400I-249999J0D01*
G01*
X233031199Y-18929400D01*
G75*
G02*
X232781200Y-18679401I0J249999D01*
G01*
X232781200Y-17379399D01*
G75*
G02*
X233031199Y-17129400I249999J0D01*
G01*
X233731201Y-17129400D01*
G75*
G02*
X233981200Y-17379399I0J-249999D01*
G01*
G37*
%TD.AperFunction*%
%TO.P,J11,4*%
%TO.N,SCL*%
%TA.AperFunction,SMDPad,CuDef*%
G36*
G01*
X229381200Y-13529400D02*
X229381200Y-14779400D01*
G75*
G02*
X229231200Y-14929400I-150000J0D01*
G01*
X228931200Y-14929400D01*
G75*
G02*
X228781200Y-14779400I0J150000D01*
G01*
X228781200Y-13529400D01*
G75*
G02*
X228931200Y-13379400I150000J0D01*
G01*
X229231200Y-13379400D01*
G75*
G02*
X229381200Y-13529400I0J-150000D01*
G01*
G37*
%TD.AperFunction*%
%TO.P,J11,3*%
%TO.N,SDA*%
%TA.AperFunction,SMDPad,CuDef*%
G36*
G01*
X230381200Y-13529400D02*
X230381200Y-14779400D01*
G75*
G02*
X230231200Y-14929400I-150000J0D01*
G01*
X229931200Y-14929400D01*
G75*
G02*
X229781200Y-14779400I0J150000D01*
G01*
X229781200Y-13529400D01*
G75*
G02*
X229931200Y-13379400I150000J0D01*
G01*
X230231200Y-13379400D01*
G75*
G02*
X230381200Y-13529400I0J-150000D01*
G01*
G37*
%TD.AperFunction*%
%TO.P,J11,2*%
%TO.N,+3V3*%
%TA.AperFunction,SMDPad,CuDef*%
G36*
G01*
X231381200Y-13529400D02*
X231381200Y-14779400D01*
G75*
G02*
X231231200Y-14929400I-150000J0D01*
G01*
X230931200Y-14929400D01*
G75*
G02*
X230781200Y-14779400I0J150000D01*
G01*
X230781200Y-13529400D01*
G75*
G02*
X230931200Y-13379400I150000J0D01*
G01*
X231231200Y-13379400D01*
G75*
G02*
X231381200Y-13529400I0J-150000D01*
G01*
G37*
%TD.AperFunction*%
%TO.P,J11,1*%
%TO.N,GND*%
%TA.AperFunction,SMDPad,CuDef*%
G36*
G01*
X232381200Y-13529400D02*
X232381200Y-14779400D01*
G75*
G02*
X232231200Y-14929400I-150000J0D01*
G01*
X231931200Y-14929400D01*
G75*
G02*
X231781200Y-14779400I0J150000D01*
G01*
X231781200Y-13529400D01*
G75*
G02*
X231931200Y-13379400I150000J0D01*
G01*
X232231200Y-13379400D01*
G75*
G02*
X232381200Y-13529400I0J-150000D01*
G01*
G37*
%TD.AperFunction*%
%TD*%
D17*
%TO.P,SW1,1*%
%TO.N,A3_BUTTON_A*%
X195580000Y66954400D03*
%TO.P,SW1,2*%
X195580000Y73454400D03*
%TO.P,SW1,3*%
%TO.N,GND*%
X191080000Y66954400D03*
%TO.P,SW1,4*%
X191080000Y73454400D03*
%TD*%
D11*
%TO.P,J10,1*%
%TO.N,GND*%
X206197200Y85674200D03*
D10*
%TO.P,J10,2*%
%TO.N,+3V3*%
X208737200Y85674200D03*
%TO.P,J10,3*%
%TO.N,SCL*%
X211277200Y85674200D03*
%TO.P,J10,4*%
%TO.N,SDA*%
X213817200Y85674200D03*
%TD*%
D11*
%TO.P,J8,1*%
%TO.N,+3V3*%
X225247200Y37998400D03*
D10*
%TO.P,J8,2*%
%TO.N,GND*%
X222707200Y37998400D03*
%TO.P,J8,3*%
%TO.N,SCL*%
X220167200Y37998400D03*
%TO.P,J8,4*%
%TO.N,SDA*%
X217627200Y37998400D03*
%TO.P,J8,5*%
%TO.N,N/C*%
X215087200Y37998400D03*
%TO.P,J8,6*%
X212547200Y37998400D03*
%TO.P,J8,7*%
X210007200Y37998400D03*
%TD*%
D34*
%TO.N,+3V3*%
X231089200Y-11684000D03*
X231495600Y-4216400D03*
X194411600Y22148800D03*
X189636400Y22758400D03*
X190601600Y38201600D03*
X206197200Y38658800D03*
X206806800Y43332400D03*
X223824800Y47193200D03*
X222859600Y85648800D03*
X222402400Y77470000D03*
X217170000Y77470000D03*
X215900000Y88188800D03*
X228244400Y52120800D03*
X228295200Y58318400D03*
X228092000Y48971200D03*
X210769200Y68884800D03*
X210870800Y65074800D03*
X211074000Y60248800D03*
X239420400Y16205200D03*
X239826800Y11125200D03*
X243738400Y10363200D03*
X207670400Y89560400D03*
X237947200Y36372800D03*
X238785400Y18262600D03*
X210261200Y76098400D03*
%TO.N,GND*%
X203758800Y-8331200D03*
X201828400Y-8331200D03*
X201066400Y-3911600D03*
X187299600Y152400D03*
X232359200Y-7112000D03*
X232359200Y-12446000D03*
X242925600Y19761200D03*
X242214400Y12395200D03*
X230886000Y11633200D03*
X187807600Y11125200D03*
X194868800Y36576000D03*
X195986400Y3606800D03*
X199237600Y86055200D03*
X198424800Y91744800D03*
X207568800Y93319600D03*
X221335600Y79654400D03*
X220929200Y93268800D03*
X232562400Y79095600D03*
X234035600Y77266800D03*
X240690400Y76352400D03*
X230276400Y54864000D03*
X230124000Y58420000D03*
X192735200Y43738800D03*
X192735200Y56794400D03*
X192176400Y62382400D03*
X232765600Y59944000D03*
X223418400Y40487600D03*
X230276400Y40640000D03*
X195021200Y30226000D03*
X191109600Y77317600D03*
X217271600Y61518800D03*
X240690400Y21844000D03*
X239826800Y34696400D03*
X230428800Y35102800D03*
X188925200Y38252400D03*
X189585600Y39573200D03*
X216458800Y56184800D03*
X186436000Y7467600D03*
X187299600Y-2844800D03*
%TO.N,SDA*%
X236575600Y-14884400D03*
X237947200Y8686800D03*
X239674400Y17627600D03*
X213715600Y91287600D03*
X220421200Y35356800D03*
X235305600Y35814000D03*
X235661200Y32918400D03*
X239420400Y31851600D03*
X219252800Y74472800D03*
X214172800Y75336400D03*
X217779600Y35509200D03*
%TO.N,SCL*%
X229057200Y-12700000D03*
X238150400Y5994400D03*
X241350800Y15748000D03*
X243941600Y17729200D03*
X220421200Y46482000D03*
X243840000Y43332400D03*
X210362800Y90932000D03*
X225247200Y45770800D03*
X224942400Y64770000D03*
X214884000Y66243200D03*
X229971600Y-9652000D03*
X238086800Y-9458390D03*
%TO.N,LORA_DIO1*%
X227584000Y81076800D03*
X227076000Y68478400D03*
%TO.N,MISO*%
X242062000Y69850000D03*
X203708000Y70256400D03*
X223469200Y26314400D03*
X236778800Y27635200D03*
X203301600Y65024000D03*
X241249200Y55118000D03*
X235762800Y54711600D03*
%TO.N,MOSI*%
X226974400Y51206400D03*
X226618800Y58216800D03*
X210515200Y59080400D03*
X210007200Y61468000D03*
X219303600Y20878800D03*
X228346000Y22555200D03*
%TO.N,SCK*%
X214172800Y54356000D03*
X202336400Y55778400D03*
X202641200Y43738800D03*
X219151200Y26466800D03*
X205028800Y26720800D03*
X203149200Y39166800D03*
X214071200Y57048400D03*
%TO.N,3VESP*%
X188518800Y-7467600D03*
X189179200Y-50800D03*
X193649600Y63500000D03*
X194005200Y61214000D03*
X201422000Y67970400D03*
X200050400Y69799200D03*
X187248800Y33680400D03*
X186334400Y8839200D03*
X191008000Y40640000D03*
X191785200Y54914800D03*
X198018400Y67767200D03*
X197205600Y63703200D03*
%TO.N,ESP_RX*%
X238963200Y9601200D03*
X239014000Y2032000D03*
X223621600Y34798000D03*
X232968800Y33324800D03*
X231902000Y9753600D03*
X223113600Y9906000D03*
X222605600Y31496000D03*
X199186800Y30886400D03*
X197967600Y39166800D03*
%TO.N,EXP_TX*%
X234325200Y3708400D03*
X234340400Y13563600D03*
X234797600Y31546800D03*
%TO.N,~RESET*%
X193446400Y6451600D03*
%TO.N,Net-(J1-Pad3)*%
X220675200Y57251600D03*
X220421200Y48463200D03*
X219202000Y47396400D03*
X235762800Y55829200D03*
X235762800Y55829200D03*
%TO.N,10_ESP_CS*%
X196545200Y15341600D03*
X196285799Y23108599D03*
X204571600Y39166800D03*
X202438000Y69545200D03*
X202844400Y64008000D03*
X204419200Y43789600D03*
X205892400Y63195200D03*
X207518000Y25349200D03*
%TO.N,9_ESP_BUSY*%
X206451200Y31496000D03*
X208432400Y55067200D03*
X203809600Y55676800D03*
X202234800Y57099200D03*
%TO.N,7_ESP_RESET*%
X212445600Y21234400D03*
X203809600Y20320000D03*
X211480400Y42214800D03*
X215442800Y42316400D03*
X215646000Y61671200D03*
%TO.N,5_NEOPIXEL*%
X218897200Y36830000D03*
X215239600Y36118800D03*
X217779600Y48717200D03*
X221691200Y51714400D03*
X221589600Y55575200D03*
%TO.N,2_ESP_GPIO0*%
X225247200Y15697200D03*
X207619600Y15138400D03*
X216306400Y40233600D03*
X216916000Y30581600D03*
X227228400Y29311600D03*
%TO.N,ESP_MISO*%
X200609200Y62230000D03*
X199288400Y46177200D03*
X194005200Y45567600D03*
X193954400Y43281600D03*
%TO.N,VBAT*%
X217525600Y-13817600D03*
X188010800Y31445200D03*
X195478400Y-11328400D03*
%TO.N,13_LORA_SCK*%
X189687200Y80365600D03*
X191160400Y31343600D03*
%TO.N,11_LORA_MOSI*%
X204470000Y46482000D03*
X200456800Y46177200D03*
X200863200Y36271200D03*
X205028800Y36169600D03*
X203962000Y82600800D03*
%TO.N,12_LORA_MISO*%
X208584800Y80873600D03*
X207111600Y37236400D03*
X203047600Y37134800D03*
%TO.N,A5_BUTTON_B*%
X227177600Y18338800D03*
X226771200Y16510000D03*
X215341200Y15849600D03*
X213817200Y28803600D03*
%TO.N,A4_LORA_CS*%
X209346800Y89814400D03*
X207873600Y94640400D03*
X199745600Y93827600D03*
X199644000Y76454000D03*
X188417200Y75742800D03*
X188264800Y34747200D03*
X211429600Y34798000D03*
%TO.N,A3_BUTTON_A*%
X221843600Y49834800D03*
X223672400Y72694800D03*
X221645801Y16820201D03*
%TO.N,A2_LORA_IRQ*%
X243738400Y79197200D03*
X243382800Y60045600D03*
X240030000Y59639200D03*
X207518000Y23926800D03*
X242366800Y25298400D03*
%TO.N,VHI*%
X243789200Y-14732000D03*
X243382800Y-1270000D03*
X199999600Y1168400D03*
X198323200Y7620000D03*
X190347600Y8432800D03*
X190703200Y20675600D03*
X199440800Y20675600D03*
X236067600Y71678800D03*
X244805200Y69799200D03*
%TO.N,3_LDO_ENABLE*%
X235864400Y16256000D03*
X235712000Y28651200D03*
X217982800Y29006800D03*
X217170000Y25654000D03*
X215025000Y22109400D03*
X213817200Y25298400D03*
%TO.N,A0_LORAWAN*%
X234289600Y63957200D03*
X233680000Y20574000D03*
X201168000Y9956800D03*
X228041200Y19862800D03*
X227838000Y8229600D03*
%TO.N,4_SERDAT*%
X233375200Y14732000D03*
X233019600Y2641600D03*
X232054400Y30276800D03*
X231800400Y16357600D03*
%TO.N,A1_SD_CS*%
X226314000Y49784000D03*
X213918800Y53035200D03*
X213817200Y20015200D03*
X205079600Y19812000D03*
X225856800Y52882800D03*
%TD*%
D35*
%TO.N,+3V3*%
X231081200Y-14154400D02*
X231081200Y-11692000D01*
X231081200Y-11692000D02*
X231089200Y-11684000D01*
X232003600Y-3708400D02*
X240893600Y-3708400D01*
X231495600Y-4216400D02*
X232003600Y-3708400D01*
X241332000Y19194400D02*
X239717200Y19194400D01*
X238353600Y17830800D02*
X237286800Y17830800D01*
X239717200Y19194400D02*
X238785400Y18262600D01*
X194411600Y22148800D02*
X190246000Y22148800D01*
X190246000Y22148800D02*
X189636400Y22758400D01*
X190601600Y38201600D02*
X205841600Y38201600D01*
X205841600Y38201600D02*
X206197200Y38557200D01*
X206197200Y38557200D02*
X206197200Y38658800D01*
X206806800Y43332400D02*
X216509600Y43332400D01*
X216509600Y43332400D02*
X218440000Y45262800D01*
X221893938Y45262800D02*
X223773538Y43383200D01*
X218440000Y45262800D02*
X221893938Y45262800D01*
X223824800Y48569200D02*
X223697800Y48696200D01*
X223824800Y47193200D02*
X223824800Y48569200D01*
X201676000Y88239600D02*
X201650600Y88214200D01*
X207975200Y88239600D02*
X201676000Y88239600D01*
X235049600Y85248000D02*
X230536000Y85248000D01*
X230536000Y85248000D02*
X230490800Y85293200D01*
X230490800Y85293200D02*
X223215200Y85293200D01*
X223215200Y85293200D02*
X222859600Y85648800D01*
X222402400Y77470000D02*
X217170000Y77470000D01*
X208026000Y88188800D02*
X207975200Y88239600D01*
X215900000Y88188800D02*
X208026000Y88188800D01*
X243191000Y51484200D02*
X228881000Y51484200D01*
X228881000Y51484200D02*
X228244400Y52120800D01*
X228295200Y59627800D02*
X228283800Y59639200D01*
X228295200Y58318400D02*
X228295200Y59627800D01*
X223697800Y48696200D02*
X227817000Y48696200D01*
X227817000Y48696200D02*
X228092000Y48971200D01*
X237286800Y17830800D02*
X229666800Y17830800D01*
X212119800Y69062600D02*
X210947000Y69062600D01*
X210947000Y69062600D02*
X210769200Y68884800D01*
X211967400Y65074800D02*
X212119800Y64922400D01*
X210870800Y65074800D02*
X211967400Y65074800D01*
X228283800Y59639200D02*
X211683600Y59639200D01*
X211683600Y59639200D02*
X211074000Y60248800D01*
X207007223Y65074800D02*
X206959200Y65026777D01*
X210870800Y65074800D02*
X207007223Y65074800D01*
X237286800Y17830800D02*
X237794800Y17830800D01*
X237794800Y17830800D02*
X239420400Y16205200D01*
X239826800Y11125200D02*
X243128800Y11125200D01*
X243128800Y11125200D02*
X243738400Y10515600D01*
X243738400Y10515600D02*
X243738400Y10363200D01*
X207670400Y88544400D02*
X207975200Y88239600D01*
X207670400Y89560400D02*
X207670400Y88544400D01*
X225247200Y37998400D02*
X236321600Y37998400D01*
X236321600Y37998400D02*
X237947200Y36372800D01*
X238785400Y18262600D02*
X238353600Y17830800D01*
X217170000Y77470000D02*
X211734400Y77470000D01*
X211734400Y77470000D02*
X211632800Y77470000D01*
X211632800Y77470000D02*
X210261200Y76098400D01*
%TO.N,GND*%
X203758800Y-6541800D02*
X203719400Y-6502400D01*
X203758800Y-8331200D02*
X203758800Y-6541800D01*
X205017400Y-6502400D02*
X205830200Y-5689600D01*
X203719400Y-6502400D02*
X205017400Y-6502400D01*
X190500000Y-6167500D02*
X190500000Y-5080000D01*
X190500000Y-5080000D02*
X190093600Y-4673600D01*
X190093600Y-4673600D02*
X188620400Y-4673600D01*
X187452000Y-5842000D02*
X187452000Y-6491000D01*
X188620400Y-4673600D02*
X187452000Y-5842000D01*
X203758800Y-8331200D02*
X201828400Y-8331200D01*
X191668400Y-3911600D02*
X190500000Y-5080000D01*
X201066400Y-3911600D02*
X191668400Y-3911600D01*
X187542200Y1371600D02*
X187542200Y395000D01*
X187542200Y395000D02*
X187299600Y152400D01*
X205785200Y-11689600D02*
X204774800Y-12700000D01*
X214731600Y-11689600D02*
X205785200Y-11689600D01*
X240893600Y-6248400D02*
X233222800Y-6248400D01*
X233222800Y-6248400D02*
X232359200Y-7112000D01*
X232359200Y-13876400D02*
X232081200Y-14154400D01*
X232359200Y-12446000D02*
X232359200Y-13876400D01*
X241332000Y20194400D02*
X242492400Y20194400D01*
X242492400Y20194400D02*
X242925600Y19761200D01*
X242214400Y12395200D02*
X231648000Y12395200D01*
X231648000Y12395200D02*
X230886000Y11633200D01*
X187807600Y11125200D02*
X194462400Y11125200D01*
X194919600Y11582400D02*
X194919600Y13512800D01*
X194462400Y11125200D02*
X194919600Y11582400D01*
X188936600Y37033200D02*
X194411600Y37033200D01*
X194411600Y37033200D02*
X194868800Y36576000D01*
X209854800Y3302000D02*
X196291200Y3302000D01*
X196291200Y3302000D02*
X195986400Y3606800D01*
X206197200Y85674200D02*
X199618600Y85674200D01*
X199618600Y85674200D02*
X199237600Y86055200D01*
X198424800Y91744800D02*
X198221600Y91744800D01*
X197942200Y92024200D02*
X196418200Y92024200D01*
X198221600Y91744800D02*
X197942200Y92024200D01*
X218978000Y93319600D02*
X219049600Y93248000D01*
X207568800Y93319600D02*
X218978000Y93319600D01*
X219049600Y79248000D02*
X220929200Y79248000D01*
X220929200Y79248000D02*
X221335600Y79654400D01*
X219070400Y93268800D02*
X219049600Y93248000D01*
X220929200Y93268800D02*
X219070400Y93268800D01*
X222950000Y91248000D02*
X220929200Y93268800D01*
X235049600Y91248000D02*
X222950000Y91248000D01*
X221335600Y79654400D02*
X232003600Y79654400D01*
X232003600Y79654400D02*
X232562400Y79095600D01*
X234035600Y77266800D02*
X240284000Y77266800D01*
X240284000Y77266800D02*
X240690400Y76860400D01*
X240690400Y76860400D02*
X240690400Y76352400D01*
X243191000Y53684200D02*
X231456200Y53684200D01*
X231456200Y53684200D02*
X230276400Y54864000D01*
X230124000Y59549000D02*
X230033800Y59639200D01*
X230124000Y58420000D02*
X230124000Y59549000D01*
X192717600Y41241200D02*
X192717600Y43721200D01*
X192717600Y43721200D02*
X192735200Y43738800D01*
X192735200Y59223600D02*
X192717600Y59241200D01*
X192735200Y56794400D02*
X192735200Y59223600D01*
X188722000Y62292200D02*
X188682600Y62331600D01*
X192717600Y59241200D02*
X192717600Y61755200D01*
X192717600Y61755200D02*
X193344800Y62382400D01*
X198419200Y62382400D02*
X199811600Y63774800D01*
X193344800Y62382400D02*
X198419200Y62382400D01*
X192717600Y61755200D02*
X192717600Y61841200D01*
X192717600Y61841200D02*
X192176400Y62382400D01*
X230338600Y59944000D02*
X230033800Y59639200D01*
X232765600Y59944000D02*
X230338600Y59944000D01*
X215431400Y7975600D02*
X209854800Y7975600D01*
X209956400Y3200400D02*
X209854800Y3302000D01*
X215482200Y3200400D02*
X209956400Y3200400D01*
X222148400Y27787600D02*
X216571800Y27787600D01*
X222097600Y23063200D02*
X222148400Y23114000D01*
X216775000Y23063200D02*
X222097600Y23063200D01*
X223418400Y40487600D02*
X230124000Y40487600D01*
X230124000Y40487600D02*
X230276400Y40640000D01*
X188976000Y37072600D02*
X188936600Y37033200D01*
X188976000Y38201600D02*
X188976000Y37072600D01*
X219049600Y79248000D02*
X193040000Y79248000D01*
X193040000Y79248000D02*
X191109600Y77317600D01*
X210717600Y55956200D02*
X215569800Y55956200D01*
X228763800Y61518800D02*
X230338600Y59944000D01*
X217271600Y61518800D02*
X228763800Y61518800D01*
X241332000Y20194400D02*
X241332000Y20796000D01*
X241332000Y20796000D02*
X240690400Y21437600D01*
X240690400Y21437600D02*
X240690400Y21844000D01*
X239826800Y34696400D02*
X230835200Y34696400D01*
X230835200Y34696400D02*
X230428800Y35102800D01*
X192717600Y41241200D02*
X192717600Y40724000D01*
X192717600Y40724000D02*
X191566800Y39573200D01*
X188976000Y38201600D02*
X188925200Y38252400D01*
X191566800Y39573200D02*
X189585600Y39573200D01*
X188733400Y62382400D02*
X188682600Y62331600D01*
X192176400Y62382400D02*
X188733400Y62382400D01*
X215569800Y55956200D02*
X216230200Y55956200D01*
X216230200Y55956200D02*
X216458800Y56184800D01*
X216571800Y27787600D02*
X216571800Y29198600D01*
X215711999Y30058401D02*
X211871601Y30058401D01*
X216571800Y29198600D02*
X215711999Y30058401D01*
X195798399Y29448801D02*
X195529200Y29718000D01*
X211262001Y29448801D02*
X195798399Y29448801D01*
X211871601Y30058401D02*
X211262001Y29448801D01*
X187807600Y11125200D02*
X187807600Y25552400D01*
X192201800Y29946600D02*
X195300600Y29946600D01*
X187807600Y25552400D02*
X192201800Y29946600D01*
X195529200Y29718000D02*
X195300600Y29946600D01*
X195300600Y29946600D02*
X195021200Y30226000D01*
X187542200Y1371600D02*
X187542200Y5435600D01*
X187542200Y5435600D02*
X187440600Y5537200D01*
X187440600Y5537200D02*
X187440600Y6463000D01*
X187440600Y6463000D02*
X186436000Y7467600D01*
X187299600Y-5689600D02*
X187452000Y-5842000D01*
X187299600Y-2844800D02*
X187299600Y-5689600D01*
%TO.N,SDA*%
X214025440Y69218240D02*
X213869800Y69062600D01*
X219659200Y69218240D02*
X214025440Y69218240D01*
D36*
X230081200Y-14154400D02*
X230081200Y-15095600D01*
X230081200Y-15095600D02*
X230428800Y-15443200D01*
X233070400Y-15443200D02*
X233273600Y-15240000D01*
X230428800Y-15443200D02*
X233070400Y-15443200D01*
X233273600Y-15240000D02*
X236220000Y-15240000D01*
X236220000Y-15240000D02*
X236575600Y-14884400D01*
X240588800Y8686800D02*
X240893600Y8991600D01*
X237947200Y8686800D02*
X240588800Y8686800D01*
X239674400Y17627600D02*
X239674400Y17780000D01*
X240088800Y18194400D02*
X241332000Y18194400D01*
X239674400Y17780000D02*
X240088800Y18194400D01*
X201650600Y92024200D02*
X212979000Y92024200D01*
X212979000Y92024200D02*
X213715600Y91287600D01*
X220421200Y35356800D02*
X222453200Y35356800D01*
X222453200Y35356800D02*
X222910400Y35814000D01*
X222910400Y35814000D02*
X223266000Y36169600D01*
X223266000Y36169600D02*
X234950000Y36169600D01*
X234950000Y36169600D02*
X235305600Y35814000D01*
X235661200Y32918400D02*
X236118400Y32461200D01*
X236118400Y32461200D02*
X238810800Y32461200D01*
X238810800Y32461200D02*
X239420400Y31851600D01*
X219252800Y74472800D02*
X218795600Y74930000D01*
X218795600Y74930000D02*
X214579200Y74930000D01*
X214579200Y74930000D02*
X214172800Y75336400D01*
X220268800Y35509200D02*
X220421200Y35356800D01*
X217779600Y35509200D02*
X220268800Y35509200D01*
D35*
%TO.N,SCL*%
X219554823Y64922400D02*
X219659200Y65026777D01*
X213869800Y64922400D02*
X219554823Y64922400D01*
D36*
X240893600Y6451600D02*
X238607600Y6451600D01*
X238607600Y6451600D02*
X238150400Y5994400D01*
X229057200Y-14130400D02*
X229081200Y-14154400D01*
X229057200Y-12700000D02*
X229057200Y-14130400D01*
X241332000Y17194400D02*
X241332000Y15766800D01*
X241332000Y15766800D02*
X241350800Y15748000D01*
X241332000Y17194400D02*
X243406800Y17194400D01*
X243406800Y17194400D02*
X243941600Y17729200D01*
X220421200Y46482000D02*
X220726000Y46482000D01*
X220726000Y46482000D02*
X220776800Y46532800D01*
X220776800Y46532800D02*
X222250000Y46532800D01*
X222250000Y46532800D02*
X223926400Y44856400D01*
X230530400Y44856400D02*
X231292400Y44094400D01*
X231292400Y44094400D02*
X243078000Y44094400D01*
X243078000Y44094400D02*
X243840000Y43332400D01*
X201828400Y90932000D02*
X201650600Y90754200D01*
X210362800Y90932000D02*
X201828400Y90932000D01*
X226161600Y44856400D02*
X225247200Y45770800D01*
X227025200Y44856400D02*
X226161600Y44856400D01*
X227025200Y44856400D02*
X230530400Y44856400D01*
X223926400Y44856400D02*
X227025200Y44856400D01*
X219915977Y64770000D02*
X219659200Y65026777D01*
X224942400Y64770000D02*
X219915977Y64770000D01*
X214884000Y65936600D02*
X213869800Y64922400D01*
X214884000Y66243200D02*
X214884000Y65936600D01*
X229971600Y-9652000D02*
X237893190Y-9652000D01*
X237893190Y-9652000D02*
X238086800Y-9458390D01*
%TO.N,LORA_DIO1*%
X235049600Y81248000D02*
X227755200Y81248000D01*
X227755200Y81248000D02*
X227584000Y81076800D01*
X227076000Y66917400D02*
X227242200Y66751200D01*
X227076000Y68478400D02*
X227076000Y66917400D01*
D35*
%TO.N,Net-(J5-Pad1)*%
X235049600Y95099600D02*
X234340400Y95808800D01*
X235049600Y93248000D02*
X235049600Y95099600D01*
D36*
%TO.N,MISO*%
X243191000Y54784200D02*
X241583000Y54784200D01*
X241583000Y54784200D02*
X241249200Y55118000D01*
X242062000Y69850000D02*
X223977200Y69850000D01*
X223977200Y69850000D02*
X221742000Y69850000D01*
X221742000Y69850000D02*
X221538800Y69850000D01*
X221538800Y69850000D02*
X220726000Y70662800D01*
X220726000Y70662800D02*
X204114400Y70662800D01*
X204114400Y70662800D02*
X203708000Y70256400D01*
X199811600Y65212000D02*
X199811600Y66374800D01*
X199999600Y65024000D02*
X199811600Y65212000D01*
X237315800Y54784200D02*
X237286800Y54813200D01*
X224124199Y26969399D02*
X223469200Y26314400D01*
X236011399Y26969399D02*
X224124199Y26969399D01*
X236270800Y27228800D02*
X236011399Y26969399D01*
X236778800Y27635200D02*
X236372400Y27228800D01*
X236372400Y27228800D02*
X236270800Y27228800D01*
X199999600Y65024000D02*
X203301600Y65024000D01*
X241249200Y54864000D02*
X241329000Y54784200D01*
X241249200Y55118000D02*
X241249200Y54864000D01*
X241583000Y54784200D02*
X241329000Y54784200D01*
X241329000Y54784200D02*
X237315800Y54784200D01*
X237315800Y54784200D02*
X235835400Y54784200D01*
X235835400Y54784200D02*
X235762800Y54711600D01*
%TO.N,MOSI*%
X243191000Y50384200D02*
X227796600Y50384200D01*
X227796600Y50384200D02*
X226974400Y51206400D01*
X226618800Y58216800D02*
X226212400Y58623200D01*
X226212400Y58623200D02*
X210972400Y58623200D01*
X210972400Y58623200D02*
X210515200Y59080400D01*
X210007200Y61468000D02*
X210007200Y61518800D01*
X210007200Y61518800D02*
X209854800Y61671200D01*
X209854800Y61671200D02*
X208381600Y61671200D01*
X207957600Y61247200D02*
X207957600Y59241200D01*
X208381600Y61671200D02*
X207957600Y61247200D01*
X219303600Y20878800D02*
X219303600Y21082000D01*
X219303600Y21082000D02*
X219659200Y21437600D01*
X219659200Y21437600D02*
X223723200Y21437600D01*
X224135001Y21849401D02*
X227629399Y21849401D01*
X223723200Y21437600D02*
X224135001Y21849401D01*
X227629399Y21849401D02*
X228335198Y22555200D01*
X228335198Y22555200D02*
X228346000Y22555200D01*
%TO.N,SCK*%
X243135000Y52584200D02*
X243090400Y52628800D01*
X243191000Y52584200D02*
X243135000Y52584200D01*
X243090400Y52628800D02*
X229514400Y52628800D01*
X229514400Y52628800D02*
X228142800Y54000400D01*
X214528400Y54000400D02*
X214172800Y54356000D01*
X212445600Y57200800D02*
X203758800Y57200800D01*
X203758800Y57200800D02*
X202336400Y55778400D01*
X202641200Y41477600D02*
X202877600Y41241200D01*
X202641200Y43738800D02*
X202641200Y41477600D01*
X219151200Y26466800D02*
X209397600Y26466800D01*
X209397600Y26466800D02*
X205282800Y26466800D01*
X205282800Y26466800D02*
X205028800Y26720800D01*
X203149200Y39166800D02*
X202742800Y39573200D01*
X202742800Y41106400D02*
X202877600Y41241200D01*
X202742800Y39573200D02*
X202742800Y41106400D01*
X212445600Y57200800D02*
X213918800Y57200800D01*
X213918800Y57200800D02*
X214071200Y57048400D01*
X214528400Y54000400D02*
X228142800Y54000400D01*
D35*
%TO.N,3VESP*%
X187978700Y-8767700D02*
X187452000Y-8241000D01*
X189550000Y-8767700D02*
X187978700Y-8767700D01*
X187452000Y-8241000D02*
X187745400Y-8241000D01*
X187745400Y-8241000D02*
X188518800Y-7467600D01*
X189179200Y1258600D02*
X189292200Y1371600D01*
X189179200Y-50800D02*
X189179200Y1258600D01*
X191820800Y1371600D02*
X189292200Y1371600D01*
X194919600Y-1727200D02*
X191820800Y1371600D01*
X189292200Y5435600D02*
X189190600Y5537200D01*
X189292200Y1371600D02*
X189292200Y5435600D01*
X186932600Y62331600D02*
X186932600Y63031400D01*
X186932600Y63031400D02*
X187706000Y63804800D01*
X187706000Y63804800D02*
X193344800Y63804800D01*
X193344800Y63804800D02*
X193649600Y63500000D01*
X194005200Y59258800D02*
X193987600Y59241200D01*
X194005200Y61214000D02*
X194005200Y59258800D01*
X201711600Y66374800D02*
X201711600Y67680800D01*
X201711600Y67680800D02*
X201422000Y67970400D01*
X200050400Y71131400D02*
X200089800Y71170800D01*
X200050400Y69799200D02*
X200050400Y71131400D01*
X187186600Y37033200D02*
X187186600Y33742600D01*
X187186600Y33742600D02*
X187248800Y33680400D01*
X186334400Y8839200D02*
X188772800Y8839200D01*
X189190600Y8421400D02*
X189190600Y5537200D01*
X188772800Y8839200D02*
X189190600Y8421400D01*
X187186600Y37033200D02*
X187186600Y39307800D01*
X187186600Y39307800D02*
X188468000Y40589200D01*
X188468000Y40589200D02*
X190957200Y40589200D01*
X190957200Y40589200D02*
X191008000Y40640000D01*
X193987600Y56218000D02*
X193987600Y59241200D01*
X193243200Y55473600D02*
X193987600Y56218000D01*
X191785200Y54914800D02*
X192344000Y55473600D01*
X192344000Y55473600D02*
X193243200Y55473600D01*
X201422000Y67970400D02*
X198221600Y67970400D01*
X198221600Y67970400D02*
X198018400Y67767200D01*
X193852800Y63703200D02*
X193649600Y63500000D01*
X197205600Y63703200D02*
X193852800Y63703200D01*
%TO.N,Net-(C1-Pad1)*%
X201969400Y-6502400D02*
X201969400Y-5779800D01*
X201969400Y-5779800D02*
X201269600Y-5080000D01*
X197892400Y-5080000D02*
X196520800Y-6451600D01*
X201269600Y-5080000D02*
X197892400Y-5080000D01*
X194705000Y-6451600D02*
X194106800Y-7049800D01*
X196520800Y-6451600D02*
X194705000Y-6451600D01*
X189550000Y-7082502D02*
X190500000Y-8032502D01*
X189550000Y-6167500D02*
X189550000Y-7082502D01*
X190500000Y-9682702D02*
X190926498Y-10109200D01*
X190500000Y-8032502D02*
X190500000Y-9682702D01*
X190926498Y-10109200D02*
X194767200Y-10109200D01*
X194767200Y-10109200D02*
X195580000Y-9296400D01*
X195580000Y-8523000D02*
X194106800Y-7049800D01*
X195580000Y-9296400D02*
X195580000Y-8523000D01*
D36*
%TO.N,ESP_RX*%
X238810800Y9753600D02*
X238963200Y9601200D01*
X239014000Y2032000D02*
X239928400Y1117600D01*
X240182400Y1371600D02*
X240893600Y1371600D01*
X239928400Y1117600D02*
X240182400Y1371600D01*
X223621600Y34798000D02*
X228803200Y34798000D01*
X228803200Y34798000D02*
X229870000Y33731200D01*
X229870000Y33731200D02*
X232562400Y33731200D01*
X232562400Y33731200D02*
X232968800Y33324800D01*
X231902000Y9753600D02*
X238810800Y9753600D01*
X223266000Y9753600D02*
X223113600Y9906000D01*
X231902000Y9753600D02*
X223266000Y9753600D01*
X199440800Y30632400D02*
X199186800Y30886400D01*
X197967600Y41071200D02*
X197797600Y41241200D01*
X197967600Y39166800D02*
X197967600Y41071200D01*
X222605600Y31496000D02*
X211124800Y31496000D01*
X211124800Y31496000D02*
X210210400Y30581600D01*
X201066400Y30581600D02*
X201015600Y30632400D01*
X210210400Y30581600D02*
X201066400Y30581600D01*
X201371200Y30632400D02*
X201015600Y30632400D01*
X201015600Y30632400D02*
X199440800Y30632400D01*
%TO.N,EXP_TX*%
X240893600Y3911600D02*
X238658400Y3911600D01*
X238658400Y3911600D02*
X237947200Y3200400D01*
X237947200Y3200400D02*
X234833200Y3200400D01*
X234833200Y3200400D02*
X234325200Y3708400D01*
X234340400Y13563600D02*
X234086400Y13817600D01*
X225704400Y13817600D02*
X225399600Y13512800D01*
X234086400Y13817600D02*
X225704400Y13817600D01*
X225475800Y33299400D02*
X228828600Y33299400D01*
X228828600Y33299400D02*
X229870000Y32258000D01*
X229870000Y32258000D02*
X234086400Y32258000D01*
X234086400Y32258000D02*
X234797600Y31546800D01*
%TO.N,~RESET*%
X235762800Y4620400D02*
X235762800Y5334000D01*
X235762800Y5334000D02*
X234797600Y6299200D01*
X234797600Y6299200D02*
X193598800Y6299200D01*
X193598800Y6299200D02*
X193446400Y6451600D01*
%TO.N,Net-(J1-Pad3)*%
X230784400Y55880000D02*
X227126800Y55880000D01*
X227126800Y55880000D02*
X225348800Y57658000D01*
X225348800Y57658000D02*
X221081600Y57658000D01*
X221081600Y57658000D02*
X220675200Y57251600D01*
X219292200Y48463200D02*
X219202000Y48553400D01*
X220421200Y48463200D02*
X219292200Y48463200D01*
X219202000Y48553400D02*
X219202000Y47396400D01*
X235762800Y55829200D02*
X235712000Y55829200D01*
X235559600Y55676800D02*
X230987600Y55676800D01*
X235712000Y55829200D02*
X235559600Y55676800D01*
X230987600Y55676800D02*
X230784400Y55880000D01*
%TO.N,10_ESP_CS*%
X198526400Y14986000D02*
X199999600Y13512800D01*
X196545200Y15341600D02*
X196900800Y14986000D01*
X196900800Y14986000D02*
X198526400Y14986000D01*
X196392800Y23215600D02*
X196285799Y23108599D01*
X202387200Y23215600D02*
X196392800Y23215600D01*
X204147600Y41241200D02*
X204147600Y39590800D01*
X204147600Y39590800D02*
X204571600Y39166800D01*
X201839800Y71170800D02*
X201839800Y70143400D01*
X201839800Y70143400D02*
X202438000Y69545200D01*
X201944800Y64008000D02*
X201711600Y63774800D01*
X202844400Y64008000D02*
X201944800Y64008000D01*
X204147600Y41241200D02*
X204147600Y43518000D01*
X204147600Y43518000D02*
X204419200Y43789600D01*
X205892400Y63195200D02*
X205536800Y63550800D01*
X203301600Y63550800D02*
X202844400Y64008000D01*
X205536800Y63550800D02*
X203301600Y63550800D01*
X205384400Y23215600D02*
X202387200Y23215600D01*
X207518000Y25349200D02*
X205384400Y23215600D01*
%TO.N,9_ESP_BUSY*%
X206451200Y31496000D02*
X206705200Y31750000D01*
X206705200Y31750000D02*
X210108800Y31750000D01*
X210235800Y31877000D02*
X210235800Y33299400D01*
X210108800Y31750000D02*
X210235800Y31877000D01*
X208432400Y55067200D02*
X204419200Y55067200D01*
X204419200Y55067200D02*
X203809600Y55676800D01*
X202877600Y57742000D02*
X202877600Y59241200D01*
X202234800Y57099200D02*
X202877600Y57742000D01*
%TO.N,7_ESP_RESET*%
X212445600Y21234400D02*
X212039200Y20828000D01*
X212039200Y20828000D02*
X204317600Y20828000D01*
X204317600Y20828000D02*
X203809600Y20320000D01*
X211480400Y42214800D02*
X215341200Y42214800D01*
X215341200Y42214800D02*
X215442800Y42316400D01*
X212242400Y62331600D02*
X206857600Y62331600D01*
X206857600Y62331600D02*
X205892400Y61366400D01*
X205892400Y61366400D02*
X195376800Y61366400D01*
X195257600Y61247200D02*
X195257600Y59241200D01*
X195376800Y61366400D02*
X195257600Y61247200D01*
X212242400Y62331600D02*
X214985600Y62331600D01*
X214985600Y62331600D02*
X215646000Y61671200D01*
%TO.N,5_NEOPIXEL*%
X218846400Y36830000D02*
X218897200Y36830000D01*
X218897200Y36830000D02*
X218897200Y36728400D01*
X218897200Y36728400D02*
X218592400Y36423600D01*
X218592400Y36423600D02*
X215544400Y36423600D01*
X215544400Y36423600D02*
X215239600Y36118800D01*
X217779600Y48881000D02*
X219202000Y50303400D01*
X217779600Y48717200D02*
X217779600Y48881000D01*
X219202000Y50303400D02*
X220280200Y50303400D01*
X220280200Y50303400D02*
X221691200Y51714400D01*
X219557600Y55575200D02*
X219100400Y56032400D01*
X221589600Y55575200D02*
X219557600Y55575200D01*
%TO.N,2_ESP_GPIO0*%
X225247200Y15697200D02*
X224983610Y15433610D01*
X225247200Y15697200D02*
X224586800Y15036800D01*
X224586800Y15036800D02*
X222351600Y15036800D01*
X222351600Y15036800D02*
X222300800Y14986000D01*
X207772000Y14986000D02*
X207619600Y15138400D01*
X222300800Y14986000D02*
X207772000Y14986000D01*
X209227600Y41241200D02*
X215298800Y41241200D01*
X215298800Y41241200D02*
X216306400Y40233600D01*
X216916000Y30581600D02*
X217373200Y30124400D01*
X217373200Y30124400D02*
X223875600Y30124400D01*
X224490601Y29509399D02*
X226675001Y29509399D01*
X223875600Y30124400D02*
X224490601Y29509399D01*
X226675001Y29509399D02*
X226680402Y29514800D01*
X226680402Y29514800D02*
X227025200Y29514800D01*
X227025200Y29514800D02*
X227228400Y29311600D01*
%TO.N,ESP_MISO*%
X200761600Y63774800D02*
X200761600Y62382400D01*
X200761600Y62382400D02*
X200609200Y62230000D01*
X199288400Y46177200D02*
X194614800Y46177200D01*
X194614800Y46177200D02*
X194005200Y45567600D01*
X193954400Y41274400D02*
X193987600Y41241200D01*
X193954400Y43281600D02*
X193954400Y41274400D01*
D35*
%TO.N,VBAT*%
X199774800Y-12700000D02*
X202031600Y-14956800D01*
X202031600Y-14956800D02*
X216386400Y-14956800D01*
X216386400Y-14956800D02*
X217525600Y-13817600D01*
X192455800Y33299400D02*
X189407800Y33299400D01*
X189407800Y33299400D02*
X188010800Y31902400D01*
X188010800Y31902400D02*
X188010800Y31445200D01*
X198403200Y-11328400D02*
X199774800Y-12700000D01*
X195478400Y-11328400D02*
X198403200Y-11328400D01*
D36*
%TO.N,13_LORA_SCK*%
X219049600Y85248000D02*
X216312000Y85248000D01*
X216312000Y85248000D02*
X215036400Y83972400D01*
X204724000Y83972400D02*
X204673200Y83921600D01*
X215036400Y83972400D02*
X204724000Y83972400D01*
X204673200Y83921600D02*
X196291200Y83921600D01*
X196291200Y83921600D02*
X193751200Y81381600D01*
X193751200Y81381600D02*
X190703200Y81381600D01*
X190703200Y81381600D02*
X189687200Y80365600D01*
X191160400Y31343600D02*
X192532000Y31343600D01*
X192532000Y31343600D02*
X192938400Y31750000D01*
X198526400Y31750000D02*
X200075800Y33299400D01*
X192938400Y31750000D02*
X198526400Y31750000D01*
%TO.N,11_LORA_MOSI*%
X219049600Y83248000D02*
X216293200Y83248000D01*
X216293200Y83248000D02*
X216001600Y82956400D01*
X216001600Y82956400D02*
X206095600Y82956400D01*
X204470000Y46482000D02*
X200761600Y46482000D01*
X200761600Y46482000D02*
X200456800Y46177200D01*
X200863200Y36271200D02*
X204927200Y36271200D01*
X204927200Y36271200D02*
X205028800Y36169600D01*
X206095600Y82956400D02*
X204317600Y82956400D01*
X204317600Y82956400D02*
X203962000Y82600800D01*
%TO.N,12_LORA_MISO*%
X219049600Y81248000D02*
X208959200Y81248000D01*
X208959200Y81248000D02*
X208584800Y80873600D01*
X207111600Y37236400D02*
X203149200Y37236400D01*
X203149200Y37236400D02*
X203047600Y37134800D01*
%TO.N,A5_BUTTON_B*%
X237286800Y20370800D02*
X236220000Y20370800D01*
X228514002Y19151600D02*
X228107602Y18745200D01*
X236220000Y20370800D02*
X235000800Y19151600D01*
X235000800Y19151600D02*
X228514002Y19151600D01*
X228107602Y18745200D02*
X227584000Y18745200D01*
X227584000Y18745200D02*
X227177600Y18338800D01*
X226771200Y16510000D02*
X224282000Y16510000D01*
X224282000Y16510000D02*
X224282000Y16306800D01*
X224282000Y16306800D02*
X223723200Y15748000D01*
X223723200Y15748000D02*
X215442800Y15748000D01*
X215442800Y15748000D02*
X215341200Y15849600D01*
X215315800Y18059400D02*
X215315800Y18618200D01*
X213664800Y28651200D02*
X213817200Y28803600D01*
X213664800Y27787600D02*
X213664800Y28651200D01*
X213664800Y27787600D02*
X209448400Y27787600D01*
X214821800Y27787600D02*
X213664800Y27787600D01*
%TO.N,A4_LORA_CS*%
X219049600Y87248000D02*
X218568000Y87248000D01*
X218568000Y87248000D02*
X216204800Y89611200D01*
X216204800Y89611200D02*
X209550000Y89611200D01*
X209550000Y89611200D02*
X209346800Y89814400D01*
X207873600Y94640400D02*
X200558400Y94640400D01*
X200558400Y94640400D02*
X199745600Y93827600D01*
X199644000Y76454000D02*
X199237600Y76047600D01*
X199237600Y76047600D02*
X188722000Y76047600D01*
X188722000Y76047600D02*
X188417200Y75742800D01*
X188264800Y34747200D02*
X188874400Y35356800D01*
X188874400Y35356800D02*
X210870800Y35356800D01*
X210870800Y35356800D02*
X211429600Y34798000D01*
%TO.N,A3_BUTTON_A*%
X223697800Y50446200D02*
X222455000Y50446200D01*
X222455000Y50446200D02*
X221843600Y49834800D01*
X195580000Y73454400D02*
X222912800Y73454400D01*
X222912800Y73454400D02*
X223672400Y72694800D01*
X223723200Y50471600D02*
X223697800Y50446200D01*
X221538800Y16713200D02*
X221645801Y16820201D01*
X210235800Y18059400D02*
X211582000Y16713200D01*
X211582000Y16713200D02*
X221538800Y16713200D01*
%TO.N,A2_LORA_IRQ*%
X235049600Y83248000D02*
X236944400Y83248000D01*
X236944400Y83248000D02*
X238658400Y81534000D01*
X238658400Y81534000D02*
X241401600Y81534000D01*
X241401600Y81534000D02*
X243738400Y79197200D01*
X243382800Y60045600D02*
X240233200Y60045600D01*
X240233200Y60045600D02*
X240030000Y59842400D01*
X240030000Y59842400D02*
X240030000Y59639200D01*
X208020599Y24429399D02*
X207518000Y23926800D01*
X237134400Y24434800D02*
X237128999Y24429399D01*
X241497799Y24429399D02*
X236112999Y24429399D01*
X242366800Y25298400D02*
X241497799Y24429399D01*
X237128999Y24429399D02*
X236112999Y24429399D01*
X236112999Y24429399D02*
X208020599Y24429399D01*
D35*
%TO.N,VHI*%
X207580200Y-5689600D02*
X207580200Y-6491000D01*
X207580200Y-6491000D02*
X204165200Y-9906000D01*
X204165200Y-9906000D02*
X201625200Y-9906000D01*
X199820800Y-8101600D02*
X199820800Y-6451600D01*
X201625200Y-9906000D02*
X199820800Y-8101600D01*
X212431599Y-7148799D02*
X212431599Y-7879601D01*
X207580200Y-5689600D02*
X210972400Y-5689600D01*
X212431599Y-7879601D02*
X213492798Y-8940800D01*
X210972400Y-5689600D02*
X212431599Y-7148799D01*
X213492798Y-8940800D02*
X216712800Y-8940800D01*
X216712800Y-8940800D02*
X224078800Y-16306800D01*
X224078800Y-16306800D02*
X242366800Y-16306800D01*
X242366800Y-16306800D02*
X243789200Y-14884400D01*
X243789200Y-14884400D02*
X243789200Y-14732000D01*
X240995200Y-1270000D02*
X240893600Y-1168400D01*
X243382800Y-1270000D02*
X240995200Y-1270000D01*
X240893600Y-1168400D02*
X239014000Y-1168400D01*
X239014000Y-1168400D02*
X236982000Y863600D01*
X236982000Y863600D02*
X204063600Y863600D01*
X204063600Y863600D02*
X201625200Y863600D01*
X201625200Y863600D02*
X200304400Y863600D01*
X200304400Y863600D02*
X199999600Y1168400D01*
X198323200Y7620000D02*
X191160400Y7620000D01*
X191160400Y7620000D02*
X190347600Y8432800D01*
X190703200Y20675600D02*
X199440800Y20675600D01*
X236067600Y71678800D02*
X236575600Y71170800D01*
X236575600Y71170800D02*
X243433600Y71170800D01*
X243433600Y71170800D02*
X244805200Y69799200D01*
D36*
%TO.N,3_LDO_ENABLE*%
X237286800Y15290800D02*
X236829600Y15290800D01*
X236829600Y15290800D02*
X235864400Y16256000D01*
X235712000Y28651200D02*
X235508800Y28854400D01*
X235508800Y28854400D02*
X229311200Y28854400D01*
X228676200Y28219400D02*
X225475800Y28219400D01*
X229311200Y28854400D02*
X228676200Y28219400D01*
X218236800Y29260800D02*
X217982800Y29006800D01*
X223621600Y29260800D02*
X218236800Y29260800D01*
X224663000Y28219400D02*
X223621600Y29260800D01*
X225475800Y28219400D02*
X224663000Y28219400D01*
X215025000Y22109400D02*
X215025000Y23063200D01*
X217170000Y25654000D02*
X215188800Y25654000D01*
X209499200Y23063200D02*
X209448400Y23114000D01*
X215025000Y23063200D02*
X209499200Y23063200D01*
X215188800Y25654000D02*
X214172800Y25654000D01*
X214172800Y25654000D02*
X213817200Y25298400D01*
D35*
%TO.N,A0_LORAWAN*%
X217181400Y7975600D02*
X222554800Y7975600D01*
D36*
X225792200Y66751200D02*
X225792200Y65647400D01*
X225792200Y65647400D02*
X226415600Y65024000D01*
X226415600Y65024000D02*
X233222800Y65024000D01*
X233222800Y65024000D02*
X234289600Y63957200D01*
X233680000Y20574000D02*
X233324400Y20218400D01*
X229819200Y20218400D02*
X229666800Y20370800D01*
X233324400Y20218400D02*
X229819200Y20218400D01*
X217181400Y7975600D02*
X217181400Y8573800D01*
X217181400Y8573800D02*
X216357200Y9398000D01*
X216357200Y9398000D02*
X201726800Y9398000D01*
X201726800Y9398000D02*
X201168000Y9956800D01*
X229666800Y20370800D02*
X228549200Y20370800D01*
X228549200Y20370800D02*
X228041200Y19862800D01*
X227838000Y8229600D02*
X227584000Y7975600D01*
X227584000Y7975600D02*
X222554800Y7975600D01*
D35*
%TO.N,4_SERDAT*%
X222453200Y3200400D02*
X222554800Y3302000D01*
X217232200Y3200400D02*
X222453200Y3200400D01*
X232816400Y15290800D02*
X233375200Y14732000D01*
X233019600Y2641600D02*
X232613200Y2235200D01*
X223621600Y2235200D02*
X222554800Y3302000D01*
X232613200Y2235200D02*
X223621600Y2235200D01*
D36*
X225475800Y30759400D02*
X231571800Y30759400D01*
X231571800Y30759400D02*
X232054400Y30276800D01*
X231800400Y15595600D02*
X231495600Y15290800D01*
D35*
X229666800Y15290800D02*
X231495600Y15290800D01*
D36*
X231800400Y16357600D02*
X231800400Y15595600D01*
D35*
X231495600Y15290800D02*
X232816400Y15290800D01*
D36*
%TO.N,A1_SD_CS*%
X243191000Y49284200D02*
X229506200Y49284200D01*
X229019199Y49771201D02*
X226555201Y49771201D01*
X229506200Y49284200D02*
X229019199Y49771201D01*
X226555201Y49771201D02*
X226326799Y49771201D01*
X226326799Y49771201D02*
X226314000Y49784000D01*
X213817200Y20015200D02*
X205282800Y20015200D01*
X205282800Y20015200D02*
X205079600Y19812000D01*
X225552000Y53187600D02*
X225856800Y52882800D01*
X213918800Y53035200D02*
X214071200Y53187600D01*
X214071200Y53187600D02*
X225552000Y53187600D01*
D35*
%TO.N,Net-(R10-Pad2)*%
X194106800Y-8799800D02*
X193305400Y-8799800D01*
X193305400Y-8799800D02*
X192481200Y-7975600D01*
X192481200Y-7198700D02*
X191450000Y-6167500D01*
X192481200Y-7975600D02*
X192481200Y-7198700D01*
%TD*%
M02*
