%TF.GenerationSoftware,KiCad,Pcbnew,5.1.6-c6e7f7d~87~ubuntu18.04.1*%
%TF.CreationDate,2021-08-30T12:36:41-04:00*%
%TF.ProjectId,remote,72656d6f-7465-42e6-9b69-6361645f7063,rev?*%
%TF.SameCoordinates,Original*%
%TF.FileFunction,Copper,L1,Top*%
%TF.FilePolarity,Positive*%
%FSLAX46Y46*%
G04 Gerber Fmt 4.6, Leading zero omitted, Abs format (unit mm)*
G04 Created by KiCad (PCBNEW 5.1.6-c6e7f7d~87~ubuntu18.04.1) date 2021-08-30 12:36:41*
%MOMM*%
%LPD*%
G01*
G04 APERTURE LIST*
%TA.AperFunction,ComponentPad*%
%ADD10O,1.700000X1.700000*%
%TD*%
%TA.AperFunction,ComponentPad*%
%ADD11R,1.700000X1.700000*%
%TD*%
%TA.AperFunction,ViaPad*%
%ADD12C,0.800000*%
%TD*%
%TA.AperFunction,Conductor*%
%ADD13C,0.700000*%
%TD*%
%TA.AperFunction,Conductor*%
%ADD14C,0.400000*%
%TD*%
%TA.AperFunction,Conductor*%
%ADD15C,0.250000*%
%TD*%
G04 APERTURE END LIST*
D10*
%TO.P,J5,12*%
%TO.N,N/C*%
X195800000Y-60390000D03*
%TO.P,J5,11*%
X195800000Y-57850000D03*
%TO.P,J5,10*%
X195800000Y-55310000D03*
%TO.P,J5,9*%
X195800000Y-52770000D03*
%TO.P,J5,8*%
X195800000Y-50230000D03*
%TO.P,J5,7*%
X195800000Y-47690000D03*
%TO.P,J5,6*%
X195800000Y-45150000D03*
%TO.P,J5,5*%
X195800000Y-42610000D03*
%TO.P,J5,4*%
X195800000Y-40070000D03*
%TO.P,J5,3*%
X195800000Y-37530000D03*
%TO.P,J5,2*%
X195800000Y-34990000D03*
D11*
%TO.P,J5,1*%
X195800000Y-32450000D03*
%TD*%
D10*
%TO.P,J15,4*%
%TO.N,SCL*%
X198980000Y-64475000D03*
%TO.P,J15,3*%
%TO.N,SDA*%
X201520000Y-64475000D03*
%TO.P,J15,2*%
%TO.N,+3V3*%
X204060000Y-64475000D03*
D11*
%TO.P,J15,1*%
%TO.N,GND*%
X206600000Y-64475000D03*
%TD*%
D10*
%TO.P,J9,7*%
%TO.N,N/C*%
X216710000Y-56650000D03*
%TO.P,J9,6*%
X219250000Y-56650000D03*
%TO.P,J9,5*%
X221790000Y-56650000D03*
%TO.P,J9,4*%
%TO.N,SDA*%
X224330000Y-56650000D03*
%TO.P,J9,3*%
%TO.N,SCL*%
X226870000Y-56650000D03*
%TO.P,J9,2*%
%TO.N,GND*%
X229410000Y-56650000D03*
D11*
%TO.P,J9,1*%
%TO.N,+3V3*%
X231950000Y-56650000D03*
%TD*%
%TO.P,J2,1*%
%TO.N,GND*%
X206150000Y-27750000D03*
D10*
%TO.P,J2,2*%
%TO.N,+3V3*%
X203610000Y-27750000D03*
%TO.P,J2,3*%
%TO.N,SDA*%
X201070000Y-27750000D03*
%TO.P,J2,4*%
%TO.N,SCL*%
X198530000Y-27750000D03*
%TD*%
%TO.P,J1,16*%
%TO.N,N/C*%
X236450000Y-32450000D03*
%TO.P,J1,15*%
X233910000Y-32450000D03*
%TO.P,J1,14*%
X231370000Y-32450000D03*
%TO.P,J1,13*%
X228830000Y-32450000D03*
%TO.P,J1,12*%
X226290000Y-32450000D03*
%TO.P,J1,11*%
X223750000Y-32450000D03*
%TO.P,J1,10*%
X221210000Y-32450000D03*
%TO.P,J1,9*%
X218670000Y-32450000D03*
%TO.P,J1,8*%
X216130000Y-32450000D03*
%TO.P,J1,7*%
X213590000Y-32450000D03*
%TO.P,J1,6*%
X211050000Y-32450000D03*
%TO.P,J1,5*%
X208510000Y-32450000D03*
%TO.P,J1,4*%
X205970000Y-32450000D03*
%TO.P,J1,3*%
X203430000Y-32450000D03*
%TO.P,J1,2*%
X200890000Y-32450000D03*
D11*
%TO.P,J1,1*%
X198350000Y-32450000D03*
%TD*%
%TO.P,J12,1*%
%TO.N,N/C*%
X236450000Y-32450000D03*
D10*
%TO.P,J12,2*%
X236450000Y-34990000D03*
%TO.P,J12,3*%
X236450000Y-37530000D03*
%TO.P,J12,4*%
X236450000Y-40070000D03*
%TO.P,J12,5*%
X236450000Y-42610000D03*
%TO.P,J12,6*%
X236450000Y-45150000D03*
%TO.P,J12,7*%
X236450000Y-47690000D03*
%TO.P,J12,8*%
X236450000Y-50230000D03*
%TO.P,J12,9*%
X236450000Y-52770000D03*
%TO.P,J12,10*%
X236450000Y-55310000D03*
%TO.P,J12,11*%
X236450000Y-57850000D03*
%TO.P,J12,12*%
X236450000Y-60390000D03*
%TD*%
D11*
%TO.P,J3,1*%
%TO.N,N/C*%
X233900000Y-60400000D03*
D10*
%TO.P,J3,2*%
X231360000Y-60400000D03*
%TO.P,J3,3*%
X228820000Y-60400000D03*
%TO.P,J3,4*%
X226280000Y-60400000D03*
%TO.P,J3,5*%
X223740000Y-60400000D03*
%TO.P,J3,6*%
X221200000Y-60400000D03*
%TO.P,J3,7*%
X218660000Y-60400000D03*
%TO.P,J3,8*%
X216120000Y-60400000D03*
%TO.P,J3,9*%
X213580000Y-60400000D03*
%TO.P,J3,10*%
X211040000Y-60400000D03*
%TO.P,J3,11*%
X208500000Y-60400000D03*
%TO.P,J3,12*%
X205960000Y-60400000D03*
%TO.P,J3,13*%
X203420000Y-60400000D03*
%TO.P,J3,14*%
X200880000Y-60400000D03*
%TO.P,J3,15*%
X198340000Y-60400000D03*
%TO.P,J3,16*%
X195800000Y-60400000D03*
%TD*%
D12*
%TO.N,+3V3*%
X203100000Y-66800000D03*
X189225000Y-45125000D03*
X194900000Y-25500000D03*
X203400000Y-25500000D03*
X243500000Y-44000000D03*
X242100000Y-66100000D03*
X193400000Y-66300000D03*
X193100000Y-64200000D03*
X192800000Y-56800000D03*
X191500000Y-53800000D03*
%TO.N,GND*%
X223800000Y-67225000D03*
X221325000Y-62800000D03*
X245600000Y-42300000D03*
X206700000Y-67900000D03*
X193000000Y-32400000D03*
X192600000Y-46200000D03*
X228800000Y-67200000D03*
X189400000Y-65000000D03*
X239400000Y-49500000D03*
X245600000Y-62200000D03*
X245600000Y-66300000D03*
X240000000Y-60500000D03*
%TO.N,SDA*%
X198400000Y-46100000D03*
X199100000Y-53800000D03*
X223900000Y-54800000D03*
X240200000Y-65000000D03*
X199515001Y-62470001D03*
X238200000Y-49900000D03*
X237900000Y-54000000D03*
X241300000Y-48200000D03*
X242000000Y-44300000D03*
%TO.N,SCL*%
X197400000Y-43900000D03*
X197400000Y-51500000D03*
X226700000Y-53700000D03*
X234800000Y-46300000D03*
X233300000Y-53500000D03*
X243900000Y-63100000D03*
X235200000Y-63500000D03*
X196200000Y-62300000D03*
%TD*%
D13*
%TO.N,+3V3*%
X204060000Y-64475000D02*
X204060000Y-65840000D01*
X204060000Y-65840000D02*
X203100000Y-66800000D01*
%TO.N,*%
X188800000Y-55100000D02*
X188800000Y-53600000D01*
%TO.N,+3V3*%
X203400000Y-27540000D02*
X203610000Y-27750000D01*
X203400000Y-25500000D02*
X203400000Y-27540000D01*
X242100000Y-62000000D02*
X242100000Y-66100000D01*
X188800000Y-45550000D02*
X189225000Y-45125000D01*
X193700000Y-26700000D02*
X194900000Y-25500000D01*
X191300000Y-32600000D02*
X193700000Y-30200000D01*
X193700000Y-30200000D02*
X193700000Y-26700000D01*
X191300000Y-39800000D02*
X191300000Y-32600000D01*
X189225000Y-45125000D02*
X189225000Y-41875000D01*
X189225000Y-41875000D02*
X191300000Y-39800000D01*
X193400000Y-66300000D02*
X193400000Y-64500000D01*
X193400000Y-64500000D02*
X193100000Y-64200000D01*
X193100000Y-64200000D02*
X193100000Y-57100000D01*
X193100000Y-57100000D02*
X192800000Y-56800000D01*
X191500000Y-53800000D02*
X191500000Y-48600000D01*
X191500000Y-48600000D02*
X190900000Y-48000000D01*
X190900000Y-48000000D02*
X189400000Y-48000000D01*
X188800000Y-47400000D02*
X188800000Y-45550000D01*
X189400000Y-48000000D02*
X188800000Y-47400000D01*
X242100000Y-62000000D02*
X242100000Y-59200000D01*
X242100000Y-59200000D02*
X240600000Y-57700000D01*
X240600000Y-57700000D02*
X240600000Y-51800000D01*
X243500000Y-48900000D02*
X243500000Y-44000000D01*
X240600000Y-51800000D02*
X243500000Y-48900000D01*
%TO.N,GND*%
X223800000Y-67225000D02*
X223800000Y-65275000D01*
X223800000Y-65275000D02*
X221325000Y-62800000D01*
X206700000Y-64575000D02*
X206600000Y-64475000D01*
X206700000Y-67900000D02*
X206700000Y-64575000D01*
X193000000Y-32400000D02*
X193000000Y-45800000D01*
X193000000Y-45800000D02*
X192600000Y-46200000D01*
X228800000Y-67200000D02*
X228800000Y-63000000D01*
X230100000Y-61700000D02*
X230100000Y-61212002D01*
X228800000Y-63000000D02*
X230100000Y-61700000D01*
X229410000Y-56650000D02*
X229410000Y-59010000D01*
X229410000Y-59010000D02*
X230043999Y-59643999D01*
D14*
X230100000Y-59900000D02*
X230100000Y-61212002D01*
X230043999Y-59843999D02*
X230100000Y-59900000D01*
X230043999Y-59643999D02*
X230043999Y-59843999D01*
D13*
X192800000Y-46400000D02*
X192600000Y-46200000D01*
X192800000Y-54400000D02*
X192800000Y-46400000D01*
X189500000Y-57700000D02*
X192800000Y-54400000D01*
X189500000Y-59900000D02*
X189500000Y-57700000D01*
X189400000Y-60000000D02*
X189500000Y-59900000D01*
X189400000Y-65000000D02*
X189400000Y-60000000D01*
X245600000Y-62200000D02*
X245600000Y-66300000D01*
X239400000Y-49500000D02*
X239400000Y-59900000D01*
X239400000Y-59900000D02*
X240000000Y-60500000D01*
D15*
%TO.N,SDA*%
X202100000Y-28780000D02*
X201070000Y-27750000D01*
X202100000Y-33500000D02*
X202100000Y-28780000D01*
X198400000Y-46100000D02*
X198400000Y-37200000D01*
X198400000Y-37200000D02*
X202100000Y-33500000D01*
X199100000Y-53800000D02*
X199100000Y-46800000D01*
X199100000Y-46800000D02*
X198400000Y-46100000D01*
X199515001Y-62470001D02*
X201520000Y-64475000D01*
X199515001Y-54215001D02*
X199515001Y-62470001D01*
X199100000Y-53800000D02*
X199515001Y-54215001D01*
X224330000Y-56650000D02*
X224330000Y-55230000D01*
X224330000Y-55230000D02*
X223900000Y-54800000D01*
X238200000Y-49900000D02*
X238200000Y-53600000D01*
X238200000Y-53600000D02*
X237900000Y-53900000D01*
X237900000Y-53900000D02*
X237900000Y-54000000D01*
X242000000Y-44300000D02*
X242000000Y-47500000D01*
X242000000Y-47500000D02*
X241300000Y-48200000D01*
X240100000Y-64900000D02*
X240200000Y-65000000D01*
X237900000Y-54000000D02*
X237900000Y-64900000D01*
X237900000Y-64900000D02*
X240100000Y-64900000D01*
%TO.N,SCL*%
X198530000Y-27750000D02*
X198530000Y-29970000D01*
X197174999Y-43674999D02*
X197400000Y-43900000D01*
X198530000Y-29970000D02*
X197174999Y-31325001D01*
X197174999Y-31325001D02*
X197174999Y-43674999D01*
X197400000Y-51500000D02*
X197400000Y-43900000D01*
X197164999Y-51735001D02*
X197400000Y-51500000D01*
X197164999Y-62659999D02*
X197164999Y-51735001D01*
X198980000Y-64475000D02*
X197164999Y-62659999D01*
X226870000Y-56650000D02*
X226870000Y-53870000D01*
X226870000Y-53870000D02*
X226700000Y-53700000D01*
X234800000Y-46300000D02*
X234800000Y-52000000D01*
X234800000Y-52000000D02*
X233300000Y-53500000D01*
X235200000Y-63500000D02*
X235200000Y-56400000D01*
X233300000Y-54500000D02*
X233300000Y-53500000D01*
X235200000Y-56400000D02*
X233300000Y-54500000D01*
X197164999Y-62659999D02*
X196559999Y-62659999D01*
X196559999Y-62659999D02*
X196200000Y-62300000D01*
%TD*%
M02*
