(kicad_pcb (version 20171130) (host pcbnew 5.1.6-c6e7f7d~87~ubuntu18.04.1)

  (general
    (thickness 1.6)
    (drawings 76)
    (tracks 0)
    (zones 0)
    (modules 8)
    (nets 1)
  )

  (page A4)
  (layers
    (0 F.Cu signal)
    (31 B.Cu signal)
    (32 B.Adhes user)
    (33 F.Adhes user)
    (34 B.Paste user)
    (35 F.Paste user)
    (36 B.SilkS user)
    (37 F.SilkS user)
    (38 B.Mask user)
    (39 F.Mask user)
    (40 Dwgs.User user)
    (41 Cmts.User user)
    (42 Eco1.User user)
    (43 Eco2.User user)
    (44 Edge.Cuts user)
    (45 Margin user)
    (46 B.CrtYd user)
    (47 F.CrtYd user)
    (48 B.Fab user)
    (49 F.Fab user)
  )

  (setup
    (last_trace_width 0.25)
    (user_trace_width 0.4)
    (user_trace_width 0.7)
    (trace_clearance 0.2)
    (zone_clearance 0.508)
    (zone_45_only no)
    (trace_min 0.2)
    (via_size 0.8)
    (via_drill 0.4)
    (via_min_size 0.4)
    (via_min_drill 0.3)
    (user_via 3 2)
    (uvia_size 0.3)
    (uvia_drill 0.1)
    (uvias_allowed no)
    (uvia_min_size 0.2)
    (uvia_min_drill 0.1)
    (edge_width 0.05)
    (segment_width 0.2)
    (pcb_text_width 0.3)
    (pcb_text_size 1.5 1.5)
    (mod_edge_width 0.12)
    (mod_text_size 1 1)
    (mod_text_width 0.15)
    (pad_size 5.4 5.4)
    (pad_drill 2.7)
    (pad_to_mask_clearance 0.05)
    (aux_axis_origin 0 0)
    (visible_elements FFFFEFFF)
    (pcbplotparams
      (layerselection 0x010fc_ffffffff)
      (usegerberextensions false)
      (usegerberattributes true)
      (usegerberadvancedattributes true)
      (creategerberjobfile true)
      (excludeedgelayer true)
      (linewidth 0.100000)
      (plotframeref false)
      (viasonmask false)
      (mode 1)
      (useauxorigin false)
      (hpglpennumber 1)
      (hpglpenspeed 20)
      (hpglpendiameter 15.000000)
      (psnegative false)
      (psa4output false)
      (plotreference true)
      (plotvalue true)
      (plotinvisibletext false)
      (padsonsilk false)
      (subtractmaskfromsilk false)
      (outputformat 1)
      (mirror false)
      (drillshape 0)
      (scaleselection 1)
      (outputdirectory "gerber/"))
  )

  (net 0 "")

  (net_class Default "This is the default net class."
    (clearance 0.2)
    (trace_width 0.25)
    (via_dia 0.8)
    (via_drill 0.4)
    (uvia_dia 0.3)
    (uvia_drill 0.1)
    (add_net +3V3)
    (add_net D5)
    (add_net DISP)
    (add_net EIN)
    (add_net EMD)
    (add_net GND)
    (add_net MOSI)
    (add_net "Net-(J15-Pad2)")
    (add_net "Net-(J19-Pad1)")
    (add_net "Net-(SW2-Pad1)")
    (add_net SCK)
  )

  (module MountingHole:MountingHole_2.7mm_M2.5 (layer F.Cu) (tedit 56D1B4CB) (tstamp 61B94FD2)
    (at 3.75 2.25)
    (descr "Mounting Hole 2.7mm, no annular, M2.5")
    (tags "mounting hole 2.7mm no annular m2.5")
    (path /614E3468)
    (attr virtual)
    (fp_text reference H6 (at 0 -3.7) (layer F.SilkS) hide
      (effects (font (size 1 1) (thickness 0.15)))
    )
    (fp_text value MountingHole (at 0 3.7) (layer F.Fab)
      (effects (font (size 1 1) (thickness 0.15)))
    )
    (fp_text user %R (at 0.3 0) (layer F.Fab)
      (effects (font (size 1 1) (thickness 0.15)))
    )
    (fp_circle (center 0 0) (end 2.7 0) (layer Cmts.User) (width 0.15))
    (fp_circle (center 0 0) (end 2.95 0) (layer F.CrtYd) (width 0.05))
    (pad 1 np_thru_hole circle (at 0 0) (size 2.7 2.7) (drill 2.7) (layers *.Cu *.Mask))
  )

  (module MountingHole:MountingHole_2.7mm_M2.5 (layer F.Cu) (tedit 56D1B4CB) (tstamp 61C4EF1B)
    (at 48.09 2.25)
    (descr "Mounting Hole 2.7mm, no annular, M2.5")
    (tags "mounting hole 2.7mm no annular m2.5")
    (path /614E3462)
    (attr virtual)
    (fp_text reference H5 (at 0 -3.7) (layer F.SilkS) hide
      (effects (font (size 1 1) (thickness 0.15)))
    )
    (fp_text value MountingHole (at 0 3.7) (layer F.Fab)
      (effects (font (size 1 1) (thickness 0.15)))
    )
    (fp_text user %R (at 0.3 0) (layer F.Fab)
      (effects (font (size 1 1) (thickness 0.15)))
    )
    (fp_circle (center 0 0) (end 2.7 0) (layer Cmts.User) (width 0.15))
    (fp_circle (center 0 0) (end 2.95 0) (layer F.CrtYd) (width 0.05))
    (pad 1 np_thru_hole circle (at 0 0) (size 2.7 2.7) (drill 2.7) (layers *.Cu *.Mask))
  )

  (module MountingHole:MountingHole_2.7mm_M2.5 (layer F.Cu) (tedit 56D1B4CB) (tstamp 61CBF18C)
    (at 48.25 105.41)
    (descr "Mounting Hole 2.7mm, no annular, M2.5")
    (tags "mounting hole 2.7mm no annular m2.5")
    (path /61D667EA)
    (attr virtual)
    (fp_text reference U6 (at 0 -3.7) (layer F.SilkS) hide
      (effects (font (size 1 1) (thickness 0.15)))
    )
    (fp_text value MOUNTINGHOLE2.5 (at -0.9 -2.785) (layer F.Fab)
      (effects (font (size 1 1) (thickness 0.15)))
    )
    (fp_text user %R (at 0.3 0) (layer F.Fab)
      (effects (font (size 1 1) (thickness 0.15)))
    )
    (fp_circle (center 0 0) (end 2.7 0) (layer Cmts.User) (width 0.15))
    (fp_circle (center 0 0) (end 2.95 0) (layer F.CrtYd) (width 0.05))
    (pad 1 np_thru_hole circle (at 0 0) (size 2.7 2.7) (drill 2.7) (layers *.Cu *.Mask))
  )

  (module MountingHole:MountingHole_2.7mm_M2.5 (layer F.Cu) (tedit 56D1B4CB) (tstamp 61CBF184)
    (at 3.79 105.41)
    (descr "Mounting Hole 2.7mm, no annular, M2.5")
    (tags "mounting hole 2.7mm no annular m2.5")
    (path /61D667E0)
    (attr virtual)
    (fp_text reference U5 (at 0 -3.7) (layer F.SilkS) hide
      (effects (font (size 1 1) (thickness 0.15)))
    )
    (fp_text value MOUNTINGHOLE2.5 (at 0 3.7) (layer F.Fab)
      (effects (font (size 1 1) (thickness 0.15)))
    )
    (fp_circle (center 0 0) (end 2.95 0) (layer F.CrtYd) (width 0.05))
    (fp_circle (center 0 0) (end 2.7 0) (layer Cmts.User) (width 0.15))
    (fp_text user %R (at 0.3 0) (layer F.Fab)
      (effects (font (size 1 1) (thickness 0.15)))
    )
    (pad 1 np_thru_hole circle (at 0 0) (size 2.7 2.7) (drill 2.7) (layers *.Cu *.Mask))
  )

  (module MountingHole:MountingHole_2.7mm_M2.5 (layer F.Cu) (tedit 56D1B4CB) (tstamp 61CBD04D)
    (at 43.045 35.76)
    (descr "Mounting Hole 2.7mm, no annular, M2.5")
    (tags "mounting hole 2.7mm no annular m2.5")
    (path /61CC2246)
    (attr virtual)
    (fp_text reference U3 (at 0 -3.7) (layer F.SilkS) hide
      (effects (font (size 1 1) (thickness 0.15)))
    )
    (fp_text value MOUNTINGHOLE2.5 (at 0 3.7) (layer F.Fab)
      (effects (font (size 1 1) (thickness 0.15)))
    )
    (fp_text user %R (at 0.3 0) (layer F.Fab)
      (effects (font (size 1 1) (thickness 0.15)))
    )
    (fp_circle (center 0 0) (end 2.7 0) (layer Cmts.User) (width 0.15))
    (fp_circle (center 0 0) (end 2.95 0) (layer F.CrtYd) (width 0.05))
    (pad 1 np_thru_hole circle (at 0 0) (size 2.7 2.7) (drill 2.7) (layers *.Cu *.Mask))
  )

  (module MountingHole:MountingHole_2.7mm_M2.5 (layer F.Cu) (tedit 56D1B4CB) (tstamp 61CBD045)
    (at 43.045 68.78)
    (descr "Mounting Hole 2.7mm, no annular, M2.5")
    (tags "mounting hole 2.7mm no annular m2.5")
    (path /61CC2056)
    (attr virtual)
    (fp_text reference U2 (at 0 -3.7) (layer F.SilkS) hide
      (effects (font (size 1 1) (thickness 0.15)))
    )
    (fp_text value MOUNTINGHOLE2.5 (at 0 3.7) (layer F.Fab)
      (effects (font (size 1 1) (thickness 0.15)))
    )
    (fp_text user %R (at 0.3 0) (layer F.Fab)
      (effects (font (size 1 1) (thickness 0.15)))
    )
    (fp_circle (center 0 0) (end 2.7 0) (layer Cmts.User) (width 0.15))
    (fp_circle (center 0 0) (end 2.95 0) (layer F.CrtYd) (width 0.05))
    (pad 1 np_thru_hole circle (at 0 0) (size 2.7 2.7) (drill 2.7) (layers *.Cu *.Mask))
  )

  (module MountingHole:MountingHole_2.7mm_M2.5 (layer F.Cu) (tedit 56D1B4CB) (tstamp 61CBD03D)
    (at 9.05 35.76)
    (descr "Mounting Hole 2.7mm, no annular, M2.5")
    (tags "mounting hole 2.7mm no annular m2.5")
    (path /61CC1D62)
    (attr virtual)
    (fp_text reference U1 (at 0 -3.7) (layer F.SilkS) hide
      (effects (font (size 1 1) (thickness 0.15)))
    )
    (fp_text value MOUNTINGHOLE2.5 (at 0 3.7) (layer F.Fab)
      (effects (font (size 1 1) (thickness 0.15)))
    )
    (fp_text user %R (at 0.3 0) (layer F.Fab)
      (effects (font (size 1 1) (thickness 0.15)))
    )
    (fp_circle (center 0 0) (end 2.7 0) (layer Cmts.User) (width 0.15))
    (fp_circle (center 0 0) (end 2.95 0) (layer F.CrtYd) (width 0.05))
    (pad 1 np_thru_hole circle (at 0 0) (size 2.7 2.7) (drill 2.7) (layers *.Cu *.Mask))
  )

  (module MountingHole:MountingHole_2.7mm_M2.5 (layer F.Cu) (tedit 56D1B4CB) (tstamp 61CBC609)
    (at 9.05 68.78)
    (descr "Mounting Hole 2.7mm, no annular, M2.5")
    (tags "mounting hole 2.7mm no annular m2.5")
    (path /61CC19BA)
    (attr virtual)
    (fp_text reference U4 (at 0 -3.7) (layer F.SilkS) hide
      (effects (font (size 1 1) (thickness 0.15)))
    )
    (fp_text value MOUNTINGHOLE2.5 (at 0 3.7) (layer F.Fab)
      (effects (font (size 1 1) (thickness 0.15)))
    )
    (fp_text user %R (at 0.3 0) (layer F.Fab)
      (effects (font (size 1 1) (thickness 0.15)))
    )
    (fp_circle (center 0 0) (end 2.7 0) (layer Cmts.User) (width 0.15))
    (fp_circle (center 0 0) (end 2.95 0) (layer F.CrtYd) (width 0.05))
    (pad 1 np_thru_hole circle (at 0 0) (size 2.7 2.7) (drill 2.7) (layers *.Cu *.Mask))
  )

  (gr_circle (center 48.725 39.219943) (end 50.45 39.219943) (layer F.SilkS) (width 0.12) (tstamp 61CC24A0))
  (gr_text sharp_display (at 26.45 34.4) (layer B.SilkS) (tstamp 61CC2795)
    (effects (font (size 1.8 1.8) (thickness 0.2)) (justify mirror))
  )
  (gr_text pvos.org/co2/rev_v (at 25.975 105.025) (layer F.SilkS)
    (effects (font (size 1.8 1.8) (thickness 0.2)))
  )
  (gr_line (start 26 100) (end 26 0) (layer Dwgs.User) (width 0.15) (tstamp 61CC2252))
  (gr_arc (start 48.55 14.9) (end 47.825001 13.675001) (angle -300) (layer F.SilkS) (width 0.2))
  (gr_circle (center 48.65 29.575) (end 50.375 29.575) (layer F.SilkS) (width 0.12))
  (gr_circle (center 9.763 19.076) (end 11.263 19.076) (layer Edge.Cuts) (width 0.05) (tstamp 61C3FAAA))
  (gr_circle (center 9.793 23.066) (end 11.293 23.066) (layer Edge.Cuts) (width 0.05) (tstamp 61C3FA98))
  (gr_circle (center 9.763 11.076) (end 11.263 11.076) (layer Edge.Cuts) (width 0.05) (tstamp 61C3FB28))
  (gr_circle (center 9.818 27.041) (end 11.318 27.041) (layer Edge.Cuts) (width 0.05) (tstamp 61CC2249))
  (gr_circle (center 9.763 15.076) (end 11.263 15.076) (layer Edge.Cuts) (width 0.05) (tstamp 61C3FB1C))
  (gr_line (start 0 0) (end 26 0) (layer Dwgs.User) (width 0.15))
  (gr_circle (center 14.118 27.011) (end 15.618 27.011) (layer Edge.Cuts) (width 0.05) (tstamp 61CC224A))
  (gr_circle (center 18.088 27.021) (end 19.588 27.021) (layer Edge.Cuts) (width 0.05) (tstamp 61CC2248))
  (gr_circle (center 34.063 27.146) (end 35.563 27.146) (layer Edge.Cuts) (width 0.05) (tstamp 61CC2242))
  (gr_circle (center 38.063 27.146) (end 39.563 27.146) (layer Edge.Cuts) (width 0.05) (tstamp 61CC2241))
  (gr_circle (center 42.063 27.146) (end 43.563 27.146) (layer Edge.Cuts) (width 0.05) (tstamp 61CC2240))
  (gr_line (start 37.83 38.775) (end 14.27 38.775) (layer Edge.Cuts) (width 0.15) (tstamp 61CC1FD9))
  (gr_line (start 37.83 65.67) (end 14.27 65.67) (layer Edge.Cuts) (width 0.15) (tstamp 61CC1F43))
  (gr_line (start 37.83 38.775) (end 37.83 65.67) (layer Edge.Cuts) (width 0.15) (tstamp 61CC1EA4))
  (gr_line (start 14.27 38.775) (end 14.27 65.67) (layer Edge.Cuts) (width 0.15) (tstamp 61CC1CAD))
  (gr_line (start -13.025 -6.025) (end -6.25 -6.025) (layer F.SilkS) (width 0.12))
  (gr_line (start 48.55 13.4) (end 48.55 14.9) (layer F.SilkS) (width 0.2))
  (gr_circle (center 42.063 15.046) (end 43.563 15.046) (layer Edge.Cuts) (width 0.05) (tstamp 61C3FBB2))
  (gr_line (start 43.045 35.76) (end 43.045 35.28) (layer Dwgs.User) (width 0.15) (tstamp 61CB5BDF))
  (gr_line (start 9.05 35.28) (end 9.05 35.76) (layer Dwgs.User) (width 0.15) (tstamp 61CB5AF5))
  (dimension 0.81 (width 0.15) (layer Dwgs.User)
    (gr_text "0.810 mm" (at -4.29 108.755 90) (layer Dwgs.User)
      (effects (font (size 1 1) (thickness 0.15)))
    )
    (feature1 (pts (xy 3.81 108.35) (xy -3.576421 108.35)))
    (feature2 (pts (xy 3.81 109.16) (xy -3.576421 109.16)))
    (crossbar (pts (xy -2.99 109.16) (xy -2.99 108.35)))
    (arrow1a (pts (xy -2.99 108.35) (xy -2.403579 109.476504)))
    (arrow1b (pts (xy -2.99 108.35) (xy -3.576421 109.476504)))
    (arrow2a (pts (xy -2.99 109.16) (xy -2.403579 108.033496)))
    (arrow2b (pts (xy -2.99 109.16) (xy -3.576421 108.033496)))
  )
  (gr_text B (at 48.775 39.275) (layer F.SilkS) (tstamp 61C52FF8)
    (effects (font (size 2 2) (thickness 0.3)))
  )
  (gr_line (start 3.02058 -1.54058) (end 48.980052 -1.54058) (layer Edge.Cuts) (width 0.05) (tstamp 61C3ECAA))
  (gr_line (start 48.979736 109.159948) (end 46.019948 109.16) (layer Edge.Cuts) (width 0.05) (tstamp 61C38DD9))
  (gr_circle (center 34.063 23.046) (end 35.563 23.046) (layer Edge.Cuts) (width 0.05) (tstamp 61C3FAA1))
  (gr_circle (center 38.063 23.046) (end 39.563 23.046) (layer Edge.Cuts) (width 0.05) (tstamp 61C3FA9E))
  (gr_arc (start 21.22 2.338756) (end 21.22 4.385) (angle 180) (layer Edge.Cuts) (width 0.05) (tstamp 61BF4235))
  (gr_arc (start 3.028264 106.14) (end 0.008 106.14) (angle -89.99400537) (layer Edge.Cuts) (width 0.05) (tstamp 61CC19FE))
  (gr_text A (at 48.65 29.575) (layer F.SilkS) (tstamp 61BDE315)
    (effects (font (size 2 2) (thickness 0.3)))
  )
  (gr_arc (start 48.979736 1.479684) (end 52 1.479684) (angle -89.99399759) (layer Edge.Cuts) (width 0.05) (tstamp 61BF4361))
  (gr_circle (center 26.063 27.136) (end 27.563 27.136) (layer Edge.Cuts) (width 0.05) (tstamp 61C3FAB0))
  (gr_circle (center 22.093 27.036) (end 23.593 27.036) (layer Edge.Cuts) (width 0.05) (tstamp 61C3FB16))
  (gr_circle (center 30.063 27.136) (end 31.563 27.136) (layer Edge.Cuts) (width 0.05) (tstamp 61C3FBA9))
  (gr_circle (center 42.063 11.046) (end 43.563 11.046) (layer Edge.Cuts) (width 0.05) (tstamp 61C3FBA6))
  (gr_circle (center 30.063 11.046) (end 31.563 11.046) (layer Edge.Cuts) (width 0.05) (tstamp 61C3FA89))
  (gr_circle (center 26.063 11.046) (end 27.563 11.046) (layer Edge.Cuts) (width 0.05) (tstamp 61C3FA86))
  (gr_circle (center 14.063 11.046) (end 15.563 11.046) (layer Edge.Cuts) (width 0.05) (tstamp 61C3FB19))
  (gr_circle (center 18.063 11.046) (end 19.563 11.046) (layer Edge.Cuts) (width 0.05) (tstamp 61C3FA9B))
  (gr_circle (center 22.063 11.046) (end 23.563 11.046) (layer Edge.Cuts) (width 0.05) (tstamp 61C3FAB6))
  (gr_circle (center 38.063 11.046) (end 39.563 11.046) (layer Edge.Cuts) (width 0.05) (tstamp 61C3FAB3))
  (gr_circle (center 34.063 11.046) (end 35.563 11.046) (layer Edge.Cuts) (width 0.05) (tstamp 61C3FB4C))
  (gr_circle (center 22.093 23.036) (end 23.593 23.036) (layer Edge.Cuts) (width 0.05) (tstamp 61C3FB49))
  (gr_circle (center 14.093 23.036) (end 15.593 23.036) (layer Edge.Cuts) (width 0.05) (tstamp 61C3FBA0))
  (gr_circle (center 22.063 15.046) (end 23.563 15.046) (layer Edge.Cuts) (width 0.05) (tstamp 61C3FB9D))
  (gr_circle (center 14.063 19.046) (end 15.563 19.046) (layer Edge.Cuts) (width 0.05) (tstamp 61C3FA92))
  (gr_circle (center 30.063 19.046) (end 31.563 19.046) (layer Edge.Cuts) (width 0.05) (tstamp 61C3FA8F))
  (gr_circle (center 38.063 19.046) (end 39.563 19.046) (layer Edge.Cuts) (width 0.05) (tstamp 61C3FA77))
  (gr_circle (center 22.063 19.046) (end 23.563 19.046) (layer Edge.Cuts) (width 0.05) (tstamp 61C3FA74))
  (gr_circle (center 26.063 19.046) (end 27.563 19.046) (layer Edge.Cuts) (width 0.05) (tstamp 61C3FA7D))
  (gr_circle (center 30.063 23.046) (end 31.563 23.046) (layer Edge.Cuts) (width 0.05) (tstamp 61C3FA7A))
  (gr_circle (center 42.063 23.046) (end 43.563 23.046) (layer Edge.Cuts) (width 0.05) (tstamp 61C3FB22))
  (gr_circle (center 34.063 19.046) (end 35.563 19.046) (layer Edge.Cuts) (width 0.05) (tstamp 61C3FB1F))
  (gr_circle (center 30.063 15.046) (end 31.563 15.046) (layer Edge.Cuts) (width 0.05) (tstamp 61C3FB37))
  (gr_circle (center 38.063 15.046) (end 39.563 15.046) (layer Edge.Cuts) (width 0.05) (tstamp 61C3FB34))
  (gr_circle (center 42.063 19.046) (end 43.563 19.046) (layer Edge.Cuts) (width 0.05) (tstamp 61C3FB46))
  (gr_circle (center 18.063 19.046) (end 19.563 19.046) (layer Edge.Cuts) (width 0.05) (tstamp 61C3FB43))
  (gr_circle (center 34.063 15.046) (end 35.563 15.046) (layer Edge.Cuts) (width 0.05) (tstamp 61C3FAA7))
  (gr_circle (center 26.063 15.046) (end 27.563 15.046) (layer Edge.Cuts) (width 0.05) (tstamp 61C3FAA4))
  (gr_circle (center 18.063 15.046) (end 19.563 15.046) (layer Edge.Cuts) (width 0.05) (tstamp 61C3FB3D))
  (gr_circle (center 14.063 15.046) (end 15.563 15.046) (layer Edge.Cuts) (width 0.05) (tstamp 61C3FB3A))
  (gr_circle (center 26.063 23.046) (end 27.563 23.046) (layer Edge.Cuts) (width 0.05) (tstamp 61C3FBB5))
  (gr_circle (center 18.063 23.046) (end 19.563 23.046) (layer Edge.Cuts) (width 0.05) (tstamp 61C3FB2B))
  (gr_line (start 52 1.479684) (end 52 106.14) (layer Edge.Cuts) (width 0.05) (tstamp 61B94FF9))
  (gr_line (start 0 1.48) (end 0.008 106.14) (layer Edge.Cuts) (width 0.05) (tstamp 61B94FF6))
  (gr_line (start 30.892 4.39) (end 21.22 4.385) (layer Edge.Cuts) (width 0.05) (tstamp 61BF44C0))
  (gr_arc (start 30.892 2.343756) (end 30.892 4.39) (angle -180) (layer Edge.Cuts) (width 0.05) (tstamp 61BF4283))
  (gr_line (start 21.22 0.292512) (end 30.892 0.297512) (layer Edge.Cuts) (width 0.05) (tstamp 61BF44CC))
  (gr_arc (start 3.02058 1.48) (end 3.02058 -1.54058) (angle -90) (layer Edge.Cuts) (width 0.05) (tstamp 61C39CAC))
  (gr_arc (start 48.979736 106.139684) (end 48.979736 109.159948) (angle -89.99400537) (layer Edge.Cuts) (width 0.05) (tstamp 61BDF6DD))
  (gr_line (start 3.027948 109.160264) (end 46.019948 109.16) (layer Edge.Cuts) (width 0.05) (tstamp 6192DB57))

)
