%TF.GenerationSoftware,KiCad,Pcbnew,5.1.6-c6e7f7d~87~ubuntu18.04.1*%
%TF.CreationDate,2021-08-30T12:53:40-04:00*%
%TF.ProjectId,remote,72656d6f-7465-42e6-9b69-6361645f7063,rev?*%
%TF.SameCoordinates,Original*%
%TF.FileFunction,Soldermask,Top*%
%TF.FilePolarity,Negative*%
%FSLAX46Y46*%
G04 Gerber Fmt 4.6, Leading zero omitted, Abs format (unit mm)*
G04 Created by KiCad (PCBNEW 5.1.6-c6e7f7d~87~ubuntu18.04.1) date 2021-08-30 12:53:40*
%MOMM*%
%LPD*%
G01*
G04 APERTURE LIST*
%ADD10O,1.800000X1.800000*%
%ADD11R,1.800000X1.800000*%
G04 APERTURE END LIST*
D10*
%TO.C,J12*%
X236450000Y-60390000D03*
X236450000Y-57850000D03*
X236450000Y-55310000D03*
X236450000Y-52770000D03*
X236450000Y-50230000D03*
X236450000Y-47690000D03*
X236450000Y-45150000D03*
X236450000Y-42610000D03*
X236450000Y-40070000D03*
X236450000Y-37530000D03*
X236450000Y-34990000D03*
D11*
X236450000Y-32450000D03*
%TD*%
D10*
%TO.C,J5*%
X195800000Y-60390000D03*
X195800000Y-57850000D03*
X195800000Y-55310000D03*
X195800000Y-52770000D03*
X195800000Y-50230000D03*
X195800000Y-47690000D03*
X195800000Y-45150000D03*
X195800000Y-42610000D03*
X195800000Y-40070000D03*
X195800000Y-37530000D03*
X195800000Y-34990000D03*
D11*
X195800000Y-32450000D03*
%TD*%
%TO.C,J3*%
X233900000Y-60400000D03*
D10*
X231360000Y-60400000D03*
X228820000Y-60400000D03*
X226280000Y-60400000D03*
X223740000Y-60400000D03*
X221200000Y-60400000D03*
X218660000Y-60400000D03*
X216120000Y-60400000D03*
X213580000Y-60400000D03*
X211040000Y-60400000D03*
X208500000Y-60400000D03*
X205960000Y-60400000D03*
X203420000Y-60400000D03*
X200880000Y-60400000D03*
X198340000Y-60400000D03*
X195800000Y-60400000D03*
%TD*%
%TO.C,J1*%
X236450000Y-32450000D03*
X233910000Y-32450000D03*
X231370000Y-32450000D03*
X228830000Y-32450000D03*
X226290000Y-32450000D03*
X223750000Y-32450000D03*
X221210000Y-32450000D03*
X218670000Y-32450000D03*
X216130000Y-32450000D03*
X213590000Y-32450000D03*
X211050000Y-32450000D03*
X208510000Y-32450000D03*
X205970000Y-32450000D03*
X203430000Y-32450000D03*
X200890000Y-32450000D03*
D11*
X198350000Y-32450000D03*
%TD*%
M02*
