%TF.GenerationSoftware,KiCad,Pcbnew,5.1.6-c6e7f7d~87~ubuntu18.04.1*%
%TF.CreationDate,2021-11-17T16:52:01-05:00*%
%TF.ProjectId,remote,72656d6f-7465-42e6-9b69-6361645f7063,rev?*%
%TF.SameCoordinates,Original*%
%TF.FileFunction,Copper,L2,Bot*%
%TF.FilePolarity,Positive*%
%FSLAX46Y46*%
G04 Gerber Fmt 4.6, Leading zero omitted, Abs format (unit mm)*
G04 Created by KiCad (PCBNEW 5.1.6-c6e7f7d~87~ubuntu18.04.1) date 2021-11-17 16:52:01*
%MOMM*%
%LPD*%
G01*
G04 APERTURE LIST*
%TA.AperFunction,ComponentPad*%
%ADD10C,5.400000*%
%TD*%
%TA.AperFunction,ComponentPad*%
%ADD11R,1.700000X1.700000*%
%TD*%
%TA.AperFunction,ComponentPad*%
%ADD12O,1.700000X1.700000*%
%TD*%
%TA.AperFunction,Conductor*%
%ADD13C,0.700000*%
%TD*%
G04 APERTURE END LIST*
D10*
%TO.P,H6,1*%
%TO.N,SCL*%
X29908000Y-76390000D03*
%TD*%
%TO.P,H5,1*%
%TO.N,SDA*%
X73968000Y-76410000D03*
%TD*%
D11*
%TO.P,J16,1*%
%TO.N,GND*%
X47560000Y-80440000D03*
D12*
%TO.P,J16,2*%
%TO.N,+3V3*%
X50100000Y-80440000D03*
%TO.P,J16,3*%
%TO.N,SCL*%
X52640000Y-80440000D03*
%TO.P,J16,4*%
%TO.N,SDA*%
X55180000Y-80440000D03*
%TD*%
D10*
%TO.P,H4,1*%
%TO.N,N/C*%
X73908000Y-107914000D03*
%TD*%
%TO.P,H3,1*%
%TO.N,N/C*%
X29908000Y-107914000D03*
%TD*%
%TO.P,H2,1*%
%TO.N,+3V3*%
X73908000Y-140054000D03*
%TD*%
%TO.P,H1,1*%
%TO.N,GND*%
X29908000Y-140054000D03*
%TD*%
D13*
%TO.N,+3V3*%
X50100000Y-80440000D02*
X50100000Y-122120000D01*
X68034000Y-140054000D02*
X73908000Y-140054000D01*
X50100000Y-122120000D02*
X68034000Y-140054000D01*
%TO.N,GND*%
X47560000Y-122402000D02*
X29908000Y-140054000D01*
X47560000Y-80440000D02*
X47560000Y-122402000D01*
%TO.N,SDA*%
X55180000Y-80440000D02*
X55180000Y-78390000D01*
X57160000Y-76410000D02*
X73968000Y-76410000D01*
X55180000Y-78390000D02*
X57160000Y-76410000D01*
%TO.N,SCL*%
X52640000Y-80440000D02*
X52640000Y-77820000D01*
X51210000Y-76390000D02*
X29908000Y-76390000D01*
X52640000Y-77820000D02*
X51210000Y-76390000D01*
%TD*%
M02*
