(export (version D)
  (design
    (source /home/dwblair/gitwork/co2monitor-hardware/REV_L/kicad/remote.sch)
    (date "Wed 05 May 2021 12:42:31 PM EDT")
    (tool "Eeschema 5.1.9-73d0e3b20d~88~ubuntu18.04.1")
    (sheet (number 1) (name /) (tstamps /)
      (title_block
        (title)
        (company)
        (rev)
        (date)
        (source remote.sch)
        (comment (number 1) (value ""))
        (comment (number 2) (value ""))
        (comment (number 3) (value ""))
        (comment (number 4) (value "")))))
  (components
    (comp (ref R2)
      (value R)
      (footprint Resistor_THT:R_Axial_DIN0207_L6.3mm_D2.5mm_P10.16mm_Horizontal)
      (datasheet ~)
      (libsource (lib Device) (part R) (description Resistor))
      (sheetpath (names /) (tstamps /))
      (tstamp 5F989DB1))
    (comp (ref R4)
      (value R)
      (footprint Resistor_THT:R_Axial_DIN0207_L6.3mm_D2.5mm_P10.16mm_Horizontal)
      (datasheet ~)
      (libsource (lib Device) (part R) (description Resistor))
      (sheetpath (names /) (tstamps /))
      (tstamp 5F98BC9A))
    (comp (ref H2)
      (value MountingHole)
      (footprint MountingHole:MountingHole_3.5mm)
      (datasheet ~)
      (libsource (lib Mechanical) (part MountingHole) (description "Mounting Hole without connection"))
      (sheetpath (names /) (tstamps /))
      (tstamp 5F9CF5FF))
    (comp (ref J8)
      (value SCD30)
      (footprint Connector_PinSocket_2.54mm:PinSocket_1x07_P2.54mm_Vertical)
      (datasheet ~)
      (libsource (lib Connector) (part Conn_01x07_Female) (description "Generic connector, single row, 01x07, script generated (kicad-library-utils/schlib/autogen/connector/)"))
      (sheetpath (names /) (tstamps /))
      (tstamp 5FB57B67))
    (comp (ref H1)
      (value MountingHole)
      (footprint MountingHole:MountingHole_3.7mm)
      (datasheet ~)
      (libsource (lib Mechanical) (part MountingHole) (description "Mounting Hole without connection"))
      (sheetpath (names /) (tstamps /))
      (tstamp 5FDF5FDF))
    (comp (ref J10)
      (value ssd1306)
      (footprint Connector_PinSocket_2.54mm:PinSocket_1x04_P2.54mm_Vertical)
      (datasheet ~)
      (libsource (lib Connector) (part Conn_01x04_Female) (description "Generic connector, single row, 01x04, script generated (kicad-library-utils/schlib/autogen/connector/)"))
      (sheetpath (names /) (tstamps /))
      (tstamp 60000D99))
    (comp (ref SW1)
      (value SW_Push_Dual)
      (footprint Button_Switch_THT:SW_TH_Tactile_Omron_B3F-10xx)
      (datasheet ~)
      (libsource (lib Switch) (part SW_Push_Dual) (description "Push button switch, generic, symbol, four pins"))
      (sheetpath (names /) (tstamps /))
      (tstamp 6028B8CB))
    (comp (ref R6)
      (value 4.7K)
      (footprint Resistor_THT:R_Axial_DIN0207_L6.3mm_D2.5mm_P10.16mm_Horizontal)
      (datasheet ~)
      (libsource (lib Device) (part R) (description Resistor))
      (sheetpath (names /) (tstamps /))
      (tstamp 6028DEF2))
    (comp (ref SW2)
      (value SW_Push_Dual)
      (footprint Button_Switch_THT:SW_TH_Tactile_Omron_B3F-10xx)
      (datasheet ~)
      (libsource (lib Switch) (part SW_Push_Dual) (description "Push button switch, generic, symbol, four pins"))
      (sheetpath (names /) (tstamps /))
      (tstamp 6025455B))
    (comp (ref R8)
      (value 4.7K)
      (footprint Resistor_THT:R_Axial_DIN0207_L6.3mm_D2.5mm_P10.16mm_Horizontal)
      (datasheet ~)
      (libsource (lib Device) (part R) (description Resistor))
      (sheetpath (names /) (tstamps /))
      (tstamp 602547E2))
    (comp (ref R5)
      (value 4.7K)
      (footprint Resistor_SMD:R_0603_1608Metric_Pad1.05x0.95mm_HandSolder)
      (datasheet ~)
      (libsource (lib Device) (part R) (description Resistor))
      (sheetpath (names /) (tstamps /))
      (tstamp 602D018E))
    (comp (ref R7)
      (value 4.7K)
      (footprint Resistor_SMD:R_0603_1608Metric_Pad1.05x0.95mm_HandSolder)
      (datasheet ~)
      (libsource (lib Device) (part R) (description Resistor))
      (sheetpath (names /) (tstamps /))
      (tstamp 602D86EA))
    (comp (ref J4)
      (value Barrel_Jack_MountingPin)
      (footprint Connector_BarrelJack:BarrelJack_Horizontal)
      (datasheet ~)
      (libsource (lib Connector) (part Barrel_Jack_MountingPin) (description "DC Barrel Jack with a mounting pin"))
      (sheetpath (names /) (tstamps /))
      (tstamp 607F42DF))
    (comp (ref R3)
      (value R)
      (footprint Resistor_SMD:R_0603_1608Metric_Pad1.05x0.95mm_HandSolder)
      (datasheet ~)
      (libsource (lib Device) (part R) (description Resistor))
      (sheetpath (names /) (tstamps /))
      (tstamp 602C569E))
    (comp (ref R1)
      (value R)
      (footprint Resistor_SMD:R_0603_1608Metric_Pad1.05x0.95mm_HandSolder)
      (datasheet ~)
      (libsource (lib Device) (part R) (description Resistor))
      (sheetpath (names /) (tstamps /))
      (tstamp 602C5503))
    (comp (ref J11)
      (value Conn_01x04_Female)
      (footprint Connector_JST:JST_SH_SM04B-SRSS-TB_1x04-1MP_P1.00mm_Horizontal)
      (datasheet ~)
      (libsource (lib Connector) (part Conn_01x04_Female) (description "Generic connector, single row, 01x04, script generated (kicad-library-utils/schlib/autogen/connector/)"))
      (sheetpath (names /) (tstamps /))
      (tstamp 6079898D))
    (comp (ref U1)
      (value RFM95HW)
      (footprint footprints:RFM95)
      (datasheet https://cdn-learn.adafruit.com/assets/assets/000/031/659/original/RFM95_96_97_98W.pdf?1460518717)
      (libsource (lib mysensors_radios) (part RFM95HW) (description "RFM95HW, LORA +20dBm HopeRF Wireless Transceiver, Vcc=3.3V"))
      (sheetpath (names /) (tstamps /))
      (tstamp 608564B2))
    (comp (ref JP1)
      (value Jumper_NO_Small)
      (footprint Jumper:SolderJumper-2_P1.3mm_Open_TrianglePad1.0x1.5mm)
      (libsource (lib device) (part Jumper_NO_Small) (description ""))
      (sheetpath (names /) (tstamps /))
      (tstamp 608EF379))
    (comp (ref J5)
      (value Conn_01x01_Female)
      (footprint Connector_PinSocket_2.54mm:PinSocket_1x01_P2.54mm_Vertical)
      (datasheet ~)
      (libsource (lib Connector) (part Conn_01x01_Female) (description "Generic connector, single row, 01x01, script generated (kicad-library-utils/schlib/autogen/connector/)"))
      (sheetpath (names /) (tstamps /))
      (tstamp 609682ED))
    (comp (ref J2)
      (value Conn_01x09_Female)
      (footprint Connector_PinSocket_2.54mm:PinSocket_1x09_P2.54mm_Vertical)
      (datasheet ~)
      (libsource (lib Connector) (part Conn_01x09_Female) (description "Generic connector, single row, 01x09, script generated (kicad-library-utils/schlib/autogen/connector/)"))
      (sheetpath (names /) (tstamps /))
      (tstamp 60A72842))
    (comp (ref J13)
      (value Conn_01x14_Female)
      (footprint Connector_PinSocket_2.54mm:PinSocket_1x14_P2.54mm_Vertical)
      (datasheet ~)
      (libsource (lib Connector) (part Conn_01x14_Female) (description "Generic connector, single row, 01x14, script generated (kicad-library-utils/schlib/autogen/connector/)"))
      (sheetpath (names /) (tstamps /))
      (tstamp 60B52275))
    (comp (ref J12)
      (value Conn_01x14_Female)
      (footprint Connector_PinSocket_2.54mm:PinSocket_1x14_P2.54mm_Vertical)
      (datasheet ~)
      (libsource (lib Connector) (part Conn_01x14_Female) (description "Generic connector, single row, 01x14, script generated (kicad-library-utils/schlib/autogen/connector/)"))
      (sheetpath (names /) (tstamps /))
      (tstamp 60B539AE))
    (comp (ref J3)
      (value Conn_01x14_Female)
      (footprint Connector_PinSocket_2.54mm:PinSocket_1x14_P2.54mm_Vertical)
      (datasheet ~)
      (libsource (lib Connector) (part Conn_01x14_Female) (description "Generic connector, single row, 01x14, script generated (kicad-library-utils/schlib/autogen/connector/)"))
      (sheetpath (names /) (tstamps /))
      (tstamp 60BBD632))
    (comp (ref J14)
      (value Conn_01x14_Female)
      (footprint Connector_PinSocket_2.54mm:PinSocket_1x14_P2.54mm_Vertical)
      (datasheet ~)
      (libsource (lib Connector) (part Conn_01x14_Female) (description "Generic connector, single row, 01x14, script generated (kicad-library-utils/schlib/autogen/connector/)"))
      (sheetpath (names /) (tstamps /))
      (tstamp 60BBE697))
    (comp (ref J15)
      (value Micro_SD_Card)
      (footprint footprints:DM3D-SF)
      (datasheet http://katalog.we-online.de/em/datasheet/693072010801.pdf)
      (libsource (lib Connector) (part Micro_SD_Card) (description "Micro SD Card Socket"))
      (sheetpath (names /) (tstamps /))
      (tstamp 60C464D6))
    (comp (ref uSD-SP1)
      (value Conn_01x07_Female)
      (footprint Connector_PinSocket_2.54mm:PinSocket_1x07_P2.54mm_Vertical)
      (datasheet ~)
      (libsource (lib Connector) (part Conn_01x07_Female) (description "Generic connector, single row, 01x07, script generated (kicad-library-utils/schlib/autogen/connector/)"))
      (sheetpath (names /) (tstamps /))
      (tstamp 60C5A37A))
    (comp (ref IC1)
      (value 74AHC1G125)
      (footprint footprints:SOT23-5L)
      (libsource (lib Adafruit_AirLift_FeatherWing-eagle-import) (part 74AHC1G125) (description ""))
      (sheetpath (names /) (tstamps /))
      (tstamp 6092B17E))
    (comp (ref ECC1)
      (value ATECC108)
      (footprint footprints:SOIC8)
      (libsource (lib Adafruit_AirLift_FeatherWing-eagle-import) (part ATECC108) (description ""))
      (sheetpath (names /) (tstamps /))
      (tstamp 6092C816))
    (comp (ref U2)
      (value VREG_SOT23-5)
      (footprint footprints:SOT23-5)
      (libsource (lib Adafruit_AirLift_FeatherWing-eagle-import) (part VREG_SOT23-5) (description ""))
      (sheetpath (names /) (tstamps /))
      (tstamp 6096EEDE))
    (comp (ref D1)
      (value DIODE-SCHOTTKYPOWERDI)
      (footprint Diode_SMD:D_SOD-123)
      (libsource (lib Adafruit_AirLift_FeatherWing-eagle-import) (part DIODE-SCHOTTKYPOWERDI) (description ""))
      (sheetpath (names /) (tstamps /))
      (tstamp 6098DC22))
    (comp (ref R9)
      (value 100k)
      (footprint Resistor_SMD:R_0603_1608Metric_Pad1.05x0.95mm_HandSolder)
      (libsource (lib device) (part R) (description ""))
      (sheetpath (names /) (tstamps /))
      (tstamp 609939DD))
    (comp (ref C1)
      (value 10u)
      (footprint Capacitor_SMD:C_0603_1608Metric_Pad1.05x0.95mm_HandSolder)
      (libsource (lib device) (part C) (description ""))
      (sheetpath (names /) (tstamps /))
      (tstamp 609C2F54))
    (comp (ref R10)
      (value 100k)
      (footprint Resistor_SMD:R_0603_1608Metric_Pad1.05x0.95mm_HandSolder)
      (libsource (lib device) (part R) (description ""))
      (sheetpath (names /) (tstamps /))
      (tstamp 609C5BDA))
    (comp (ref X1)
      (value ESP32_WROOM32)
      (footprint footprints:ESP32-WROOM)
      (libsource (lib Adafruit_AirLift_FeatherWing-eagle-import) (part ESP32_WROOM32) (description ""))
      (sheetpath (names /) (tstamps /))
      (tstamp 609DA424))
    (comp (ref C3)
      (value 10u)
      (footprint Capacitor_SMD:C_0603_1608Metric_Pad1.05x0.95mm_HandSolder)
      (libsource (lib device) (part C) (description ""))
      (sheetpath (names /) (tstamps /))
      (tstamp 60A5B0F4))
    (comp (ref C4)
      (value 10u)
      (footprint Capacitor_SMD:C_0603_1608Metric_Pad1.05x0.95mm_HandSolder)
      (libsource (lib device) (part C) (description ""))
      (sheetpath (names /) (tstamps /))
      (tstamp 60A5C4A3))
    (comp (ref C2)
      (value 0.1u)
      (footprint Capacitor_SMD:C_0603_1608Metric_Pad1.05x0.95mm_HandSolder)
      (libsource (lib device) (part C) (description ""))
      (sheetpath (names /) (tstamps /))
      (tstamp 60A60C9F))
    (comp (ref R11)
      (value R)
      (footprint Resistor_SMD:R_0603_1608Metric_Pad1.05x0.95mm_HandSolder)
      (libsource (lib device) (part R) (description ""))
      (sheetpath (names /) (tstamps /))
      (tstamp 60A8D100))
    (comp (ref J16)
      (value Conn_01x03_Female)
      (footprint Package_TO_SOT_THT:TO-92_Inline_Wide)
      (datasheet ~)
      (libsource (lib Connector) (part Conn_01x03_Female) (description "Generic connector, single row, 01x03, script generated (kicad-library-utils/schlib/autogen/connector/)"))
      (sheetpath (names /) (tstamps /))
      (tstamp 60B93088))
    (comp (ref R13)
      (value 4.7K)
      (footprint Resistor_THT:R_Axial_DIN0207_L6.3mm_D2.5mm_P10.16mm_Horizontal)
      (libsource (lib device) (part R) (description ""))
      (sheetpath (names /) (tstamps /))
      (tstamp 60BA15FA))
    (comp (ref J6)
      (value Conn_01x04_Female)
      (footprint Package_TO_SOT_SMD:SOT-223)
      (datasheet ~)
      (libsource (lib Connector) (part Conn_01x04_Female) (description "Generic connector, single row, 01x04, script generated (kicad-library-utils/schlib/autogen/connector/)"))
      (sheetpath (names /) (tstamps /))
      (tstamp 60BB198B))
    (comp (ref R12)
      (value 4.7K)
      (footprint Resistor_SMD:R_0603_1608Metric_Pad1.05x0.95mm_HandSolder)
      (libsource (lib device) (part R) (description ""))
      (sheetpath (names /) (tstamps /))
      (tstamp 60BC5905))
    (comp (ref C5)
      (value 1u)
      (footprint Capacitor_SMD:C_0603_1608Metric_Pad1.05x0.95mm_HandSolder)
      (libsource (lib device) (part C) (description ""))
      (sheetpath (names /) (tstamps /))
      (tstamp 60904288))
    (comp (ref H4)
      (value MountingHole)
      (footprint MountingHole:MountingHole_3.5mm)
      (datasheet ~)
      (libsource (lib Mechanical) (part MountingHole) (description "Mounting Hole without connection"))
      (sheetpath (names /) (tstamps /))
      (tstamp 5F9D006D))
    (comp (ref H3)
      (value MountingHole)
      (footprint MountingHole:MountingHole_3.5mm)
      (datasheet ~)
      (libsource (lib Mechanical) (part MountingHole) (description "Mounting Hole without connection"))
      (sheetpath (names /) (tstamps /))
      (tstamp 5F9CFBAC))
    (comp (ref H5)
      (value MountingHole)
      (footprint MountingHole:MountingHole_3.5mm)
      (datasheet ~)
      (libsource (lib Mechanical) (part MountingHole) (description "Mounting Hole without connection"))
      (sheetpath (names /) (tstamps /))
      (tstamp 609D9C6D))
    (comp (ref H6)
      (value MountingHole)
      (footprint MountingHole:MountingHole_3.5mm)
      (datasheet ~)
      (libsource (lib Mechanical) (part MountingHole) (description "Mounting Hole without connection"))
      (sheetpath (names /) (tstamps /))
      (tstamp 609DA433))
    (comp (ref J1)
      (value Conn_01x04_Female)
      (footprint footprints:PinSocket_1x04_P2.54mm_Vertical_no_silk)
      (datasheet ~)
      (libsource (lib Connector) (part Conn_01x04_Female) (description "Generic connector, single row, 01x04, script generated (kicad-library-utils/schlib/autogen/connector/)"))
      (sheetpath (names /) (tstamps /))
      (tstamp 60A7A6C9))
    (comp (ref TP1)
      (value TestPoint)
      (footprint footprints:TestPoint_Pad_1.0x1.0mm_no_silk)
      (datasheet ~)
      (libsource (lib Connector) (part TestPoint) (description "test point"))
      (sheetpath (names /) (tstamps /))
      (tstamp 60A7F8AD))
    (comp (ref TP2)
      (value TestPoint)
      (footprint footprints:TestPoint_Pad_1.0x1.0mm_no_silk)
      (datasheet ~)
      (libsource (lib Connector) (part TestPoint) (description "test point"))
      (sheetpath (names /) (tstamps /))
      (tstamp 60A80254))
    (comp (ref TP3)
      (value TestPoint)
      (footprint footprints:TestPoint_Pad_1.0x1.0mm_no_silk)
      (datasheet ~)
      (libsource (lib Connector) (part TestPoint) (description "test point"))
      (sheetpath (names /) (tstamps /))
      (tstamp 60A80559))
    (comp (ref TP4)
      (value TestPoint)
      (footprint footprints:TestPoint_Pad_1.0x1.0mm_no_silk)
      (datasheet ~)
      (libsource (lib Connector) (part TestPoint) (description "test point"))
      (sheetpath (names /) (tstamps /))
      (tstamp 60A8079B))
    (comp (ref J7)
      (value Conn_01x04_Female)
      (footprint footprints:PinSocket_1x04_P2.54mm_Vertical_no_silk)
      (datasheet ~)
      (libsource (lib Connector) (part Conn_01x04_Female) (description "Generic connector, single row, 01x04, script generated (kicad-library-utils/schlib/autogen/connector/)"))
      (sheetpath (names /) (tstamps /))
      (tstamp 60932DB4))
    (comp (ref TP5)
      (value TestPoint)
      (footprint footprints:TestPoint_Pad_1.0x1.0mm_no_silk)
      (datasheet ~)
      (libsource (lib Connector) (part TestPoint) (description "test point"))
      (sheetpath (names /) (tstamps /))
      (tstamp 60933052))
    (comp (ref TP6)
      (value TestPoint)
      (footprint footprints:TestPoint_Pad_1.0x1.0mm_no_silk)
      (datasheet ~)
      (libsource (lib Connector) (part TestPoint) (description "test point"))
      (sheetpath (names /) (tstamps /))
      (tstamp 6093305C))
    (comp (ref TP7)
      (value TestPoint)
      (footprint footprints:TestPoint_Pad_1.0x1.0mm_no_silk)
      (datasheet ~)
      (libsource (lib Connector) (part TestPoint) (description "test point"))
      (sheetpath (names /) (tstamps /))
      (tstamp 60933066))
    (comp (ref TP8)
      (value TestPoint)
      (footprint footprints:TestPoint_Pad_1.0x1.0mm_no_silk)
      (datasheet ~)
      (libsource (lib Connector) (part TestPoint) (description "test point"))
      (sheetpath (names /) (tstamps /))
      (tstamp 60933070))
    (comp (ref J17)
      (value Conn_01x05_Female)
      (footprint Connector_PinSocket_2.54mm:PinSocket_1x05_P2.54mm_Vertical)
      (datasheet ~)
      (libsource (lib Connector) (part Conn_01x05_Female) (description "Generic connector, single row, 01x05, script generated (kicad-library-utils/schlib/autogen/connector/)"))
      (sheetpath (names /) (tstamps /))
      (tstamp 60C7C390))
    (comp (ref J9)
      (value Conn_01x05_Female)
      (footprint Connector_PinSocket_2.54mm:PinSocket_1x05_P2.54mm_Vertical)
      (datasheet ~)
      (libsource (lib Connector) (part Conn_01x05_Female) (description "Generic connector, single row, 01x05, script generated (kicad-library-utils/schlib/autogen/connector/)"))
      (sheetpath (names /) (tstamps /))
      (tstamp 6096404F))
    (comp (ref JP2)
      (value Jumper_NO_Small)
      (footprint Jumper:SolderJumper-2_P1.3mm_Open_TrianglePad1.0x1.5mm)
      (libsource (lib device) (part Jumper_NO_Small) (description ""))
      (sheetpath (names /) (tstamps /))
      (tstamp 60947193)))
  (libparts
    (libpart (lib Adafruit_AirLift_FeatherWing-eagle-import) (part 74AHC1G125)
      (fields
        (field (name Reference) IC)
        (field (name Value) 74AHC1G125))
      (pins
        (pin (num 1) (name ~OE) (type input))
        (pin (num 2) (name A) (type input))
        (pin (num 3) (name GND) (type power_in))
        (pin (num 4) (name Y) (type output))
        (pin (num 5) (name VCC) (type power_in))))
    (libpart (lib Adafruit_AirLift_FeatherWing-eagle-import) (part ATECC108)
      (fields
        (field (name Reference) ECC)
        (field (name Value) ATECC108))
      (pins
        (pin (num 1) (name NC1) (type BiDi))
        (pin (num 2) (name NC2) (type NotConnected))
        (pin (num 3) (name NC3) (type NotConnected))
        (pin (num 4) (name GND) (type power_in))
        (pin (num 5) (name SDA) (type BiDi))
        (pin (num 6) (name SCL) (type BiDi))
        (pin (num 7) (name NC7) (type NotConnected))
        (pin (num 8) (name VCC) (type power_in))))
    (libpart (lib Adafruit_AirLift_FeatherWing-eagle-import) (part DIODE-SCHOTTKYPOWERDI)
      (fields
        (field (name Reference) D)
        (field (name Value) DIODE-SCHOTTKYPOWERDI))
      (pins
        (pin (num A1) (name A) (type passive))
        (pin (num A2) (name A) (type passive))
        (pin (num C) (name C) (type passive))))
    (libpart (lib Adafruit_AirLift_FeatherWing-eagle-import) (part ESP32_WROOM32)
      (fields
        (field (name Reference) X)
        (field (name Value) ESP32_WROOM32))
      (pins
        (pin (num 1) (name GND) (type passive))
        (pin (num 2) (name 3.3V) (type passive))
        (pin (num 3) (name EN) (type input))
        (pin (num 4) (name IO36/SEN_VP/A1_0) (type passive))
        (pin (num 5) (name IO39/SEN_VN/A1_3) (type passive))
        (pin (num 6) (name I34/A1_6) (type BiDi))
        (pin (num 7) (name I35/A1_7) (type BiDi))
        (pin (num 8) (name IO32/A1_4/X32P) (type BiDi))
        (pin (num 9) (name IO33/A1_5/X32N) (type BiDi))
        (pin (num 10) (name IO25/DAC1/A2_8) (type BiDi))
        (pin (num 11) (name IO26/DAC2/A2_9) (type BiDi))
        (pin (num 12) (name IO27/A2_7) (type BiDi))
        (pin (num 13) (name IO14/A2_6) (type BiDi))
        (pin (num 14) (name IO12/A2_5) (type BiDi))
        (pin (num 15) (name GND) (type passive))
        (pin (num 16) (name IO13/A2_4) (type BiDi))
        (pin (num 17) (name SD2) (type BiDi))
        (pin (num 18) (name SD3) (type BiDi))
        (pin (num 19) (name CMD) (type BiDi))
        (pin (num 20) (name CLK) (type BiDi))
        (pin (num 21) (name SD0) (type BiDi))
        (pin (num 22) (name SD1) (type BiDi))
        (pin (num 23) (name IO15/A2_3) (type BiDi))
        (pin (num 24) (name IO2/A2_2) (type BiDi))
        (pin (num 25) (name IO0/A2_1) (type BiDi))
        (pin (num 26) (name IO4/A2_0) (type BiDi))
        (pin (num 27) (name IO16) (type BiDi))
        (pin (num 28) (name IO17) (type BiDi))
        (pin (num 29) (name IO5) (type BiDi))
        (pin (num 30) (name IO18) (type BiDi))
        (pin (num 31) (name IO19) (type BiDi))
        (pin (num 33) (name IO21) (type BiDi))
        (pin (num 34) (name RXD0) (type input))
        (pin (num 35) (name TXD0) (type output))
        (pin (num 36) (name IO22) (type BiDi))
        (pin (num 37) (name IO23) (type BiDi))
        (pin (num 38) (name GND) (type passive))
        (pin (num P$1) (name GND) (type passive))))
    (libpart (lib Adafruit_AirLift_FeatherWing-eagle-import) (part VREG_SOT23-5)
      (fields
        (field (name Reference) U)
        (field (name Value) VREG_SOT23-5))
      (pins
        (pin (num 1) (name IN) (type power_in))
        (pin (num 2) (name GND) (type power_in))
        (pin (num 3) (name EN) (type input))
        (pin (num 4) (name P4) (type BiDi))
        (pin (num 5) (name OUT) (type power_in))))
    (libpart (lib Connector) (part Barrel_Jack_MountingPin)
      (description "DC Barrel Jack with a mounting pin")
      (docs ~)
      (footprints
        (fp BarrelJack*))
      (fields
        (field (name Reference) J)
        (field (name Value) Barrel_Jack_MountingPin))
      (pins
        (pin (num 1) (name ~) (type passive))
        (pin (num 2) (name ~) (type passive))
        (pin (num MP) (name MountPin) (type passive))))
    (libpart (lib Connector) (part Conn_01x01_Female)
      (description "Generic connector, single row, 01x01, script generated (kicad-library-utils/schlib/autogen/connector/)")
      (docs ~)
      (footprints
        (fp Connector*:*))
      (fields
        (field (name Reference) J)
        (field (name Value) Conn_01x01_Female))
      (pins
        (pin (num 1) (name Pin_1) (type passive))))
    (libpart (lib Connector) (part Conn_01x03_Female)
      (description "Generic connector, single row, 01x03, script generated (kicad-library-utils/schlib/autogen/connector/)")
      (docs ~)
      (footprints
        (fp Connector*:*_1x??_*))
      (fields
        (field (name Reference) J)
        (field (name Value) Conn_01x03_Female))
      (pins
        (pin (num 1) (name Pin_1) (type passive))
        (pin (num 2) (name Pin_2) (type passive))
        (pin (num 3) (name Pin_3) (type passive))))
    (libpart (lib Connector) (part Conn_01x04_Female)
      (description "Generic connector, single row, 01x04, script generated (kicad-library-utils/schlib/autogen/connector/)")
      (docs ~)
      (footprints
        (fp Connector*:*_1x??_*))
      (fields
        (field (name Reference) J)
        (field (name Value) Conn_01x04_Female))
      (pins
        (pin (num 1) (name Pin_1) (type passive))
        (pin (num 2) (name Pin_2) (type passive))
        (pin (num 3) (name Pin_3) (type passive))
        (pin (num 4) (name Pin_4) (type passive))))
    (libpart (lib Connector) (part Conn_01x05_Female)
      (description "Generic connector, single row, 01x05, script generated (kicad-library-utils/schlib/autogen/connector/)")
      (docs ~)
      (footprints
        (fp Connector*:*_1x??_*))
      (fields
        (field (name Reference) J)
        (field (name Value) Conn_01x05_Female))
      (pins
        (pin (num 1) (name Pin_1) (type passive))
        (pin (num 2) (name Pin_2) (type passive))
        (pin (num 3) (name Pin_3) (type passive))
        (pin (num 4) (name Pin_4) (type passive))
        (pin (num 5) (name Pin_5) (type passive))))
    (libpart (lib Connector) (part Conn_01x07_Female)
      (description "Generic connector, single row, 01x07, script generated (kicad-library-utils/schlib/autogen/connector/)")
      (docs ~)
      (footprints
        (fp Connector*:*_1x??_*))
      (fields
        (field (name Reference) J)
        (field (name Value) Conn_01x07_Female))
      (pins
        (pin (num 1) (name Pin_1) (type passive))
        (pin (num 2) (name Pin_2) (type passive))
        (pin (num 3) (name Pin_3) (type passive))
        (pin (num 4) (name Pin_4) (type passive))
        (pin (num 5) (name Pin_5) (type passive))
        (pin (num 6) (name Pin_6) (type passive))
        (pin (num 7) (name Pin_7) (type passive))))
    (libpart (lib Connector) (part Conn_01x09_Female)
      (description "Generic connector, single row, 01x09, script generated (kicad-library-utils/schlib/autogen/connector/)")
      (docs ~)
      (footprints
        (fp Connector*:*_1x??_*))
      (fields
        (field (name Reference) J)
        (field (name Value) Conn_01x09_Female))
      (pins
        (pin (num 1) (name Pin_1) (type passive))
        (pin (num 2) (name Pin_2) (type passive))
        (pin (num 3) (name Pin_3) (type passive))
        (pin (num 4) (name Pin_4) (type passive))
        (pin (num 5) (name Pin_5) (type passive))
        (pin (num 6) (name Pin_6) (type passive))
        (pin (num 7) (name Pin_7) (type passive))
        (pin (num 8) (name Pin_8) (type passive))
        (pin (num 9) (name Pin_9) (type passive))))
    (libpart (lib Connector) (part Conn_01x14_Female)
      (description "Generic connector, single row, 01x14, script generated (kicad-library-utils/schlib/autogen/connector/)")
      (docs ~)
      (footprints
        (fp Connector*:*_1x??_*))
      (fields
        (field (name Reference) J)
        (field (name Value) Conn_01x14_Female))
      (pins
        (pin (num 1) (name Pin_1) (type passive))
        (pin (num 2) (name Pin_2) (type passive))
        (pin (num 3) (name Pin_3) (type passive))
        (pin (num 4) (name Pin_4) (type passive))
        (pin (num 5) (name Pin_5) (type passive))
        (pin (num 6) (name Pin_6) (type passive))
        (pin (num 7) (name Pin_7) (type passive))
        (pin (num 8) (name Pin_8) (type passive))
        (pin (num 9) (name Pin_9) (type passive))
        (pin (num 10) (name Pin_10) (type passive))
        (pin (num 11) (name Pin_11) (type passive))
        (pin (num 12) (name Pin_12) (type passive))
        (pin (num 13) (name Pin_13) (type passive))
        (pin (num 14) (name Pin_14) (type passive))))
    (libpart (lib Connector) (part Micro_SD_Card)
      (description "Micro SD Card Socket")
      (docs http://katalog.we-online.de/em/datasheet/693072010801.pdf)
      (footprints
        (fp microSD*))
      (fields
        (field (name Reference) J)
        (field (name Value) Micro_SD_Card))
      (pins
        (pin (num 1) (name DAT2) (type BiDi))
        (pin (num 2) (name DAT3/CD) (type BiDi))
        (pin (num 3) (name CMD) (type input))
        (pin (num 4) (name VDD) (type power_in))
        (pin (num 5) (name CLK) (type input))
        (pin (num 6) (name VSS) (type power_in))
        (pin (num 7) (name DAT0) (type BiDi))
        (pin (num 8) (name DAT1) (type BiDi))
        (pin (num 9) (name SHIELD) (type passive))))
    (libpart (lib Connector) (part TestPoint)
      (description "test point")
      (docs ~)
      (footprints
        (fp Pin*)
        (fp Test*))
      (fields
        (field (name Reference) TP)
        (field (name Value) TestPoint))
      (pins
        (pin (num 1) (name 1) (type passive))))
    (libpart (lib Device) (part R)
      (description Resistor)
      (docs ~)
      (footprints
        (fp R_*))
      (fields
        (field (name Reference) R)
        (field (name Value) R))
      (pins
        (pin (num 1) (name ~) (type passive))
        (pin (num 2) (name ~) (type passive))))
    (libpart (lib Mechanical) (part MountingHole)
      (description "Mounting Hole without connection")
      (docs ~)
      (footprints
        (fp MountingHole*))
      (fields
        (field (name Reference) H)
        (field (name Value) MountingHole)))
    (libpart (lib Switch) (part SW_Push_Dual)
      (description "Push button switch, generic, symbol, four pins")
      (docs ~)
      (fields
        (field (name Reference) SW)
        (field (name Value) SW_Push_Dual))
      (pins
        (pin (num 1) (name 1) (type passive))
        (pin (num 2) (name 2) (type passive))
        (pin (num 3) (name 3) (type passive))
        (pin (num 4) (name 4) (type passive))))
    (libpart (lib device) (part C)
      (footprints
        (fp C_*))
      (fields
        (field (name Reference) C)
        (field (name Value) C))
      (pins
        (pin (num 1) (name ~) (type passive))
        (pin (num 2) (name ~) (type passive))))
    (libpart (lib device) (part Jumper_NO_Small)
      (fields
        (field (name Reference) JP)
        (field (name Value) Jumper_NO_Small))
      (pins
        (pin (num 1) (name 1) (type passive))
        (pin (num 2) (name 2) (type passive))))
    (libpart (lib device) (part R)
      (footprints
        (fp R_*)
        (fp R_*))
      (fields
        (field (name Reference) R)
        (field (name Value) R))
      (pins
        (pin (num 1) (name ~) (type passive))
        (pin (num 2) (name ~) (type passive))))
    (libpart (lib mysensors_radios) (part RFM95HW)
      (description "RFM95HW, LORA +20dBm HopeRF Wireless Transceiver, Vcc=3.3V")
      (docs https://cdn-learn.adafruit.com/assets/assets/000/031/659/original/RFM95_96_97_98W.pdf?1460518717)
      (footprints
        (fp RFM95*))
      (fields
        (field (name Reference) U)
        (field (name Value) RFM95HW)
        (field (name Footprint) mysensors_radios:RFM69HW_SMD_ThroughHole_Handsoldering))
      (pins
        (pin (num 1) (name GND) (type power_in))
        (pin (num 2) (name MISO) (type 3state))
        (pin (num 3) (name MOSI) (type input))
        (pin (num 4) (name SCK) (type input))
        (pin (num 5) (name NSS) (type input))
        (pin (num 6) (name RESET) (type BiDi))
        (pin (num 7) (name DIO5) (type BiDi))
        (pin (num 8) (name GND) (type power_in))
        (pin (num 9) (name ANA) (type passive))
        (pin (num 10) (name GND) (type power_in))
        (pin (num 11) (name DIO3) (type BiDi))
        (pin (num 12) (name DIO4) (type BiDi))
        (pin (num 13) (name 3.3V) (type power_in))
        (pin (num 14) (name DIO0) (type BiDi))
        (pin (num 15) (name DIO1) (type BiDi))
        (pin (num 16) (name DIO2) (type BiDi)))))
  (libraries
    (library (logical Adafruit_AirLift_FeatherWing-eagle-import)
      (uri /home/dwblair/gitwork/co2monitor-hardware/REV_L/kicad/symbols/Adafruit_AirLift_FeatherWing-eagle-import.lib))
    (library (logical Connector)
      (uri /home/dwblair/gitwork/kicad-symbols/Connector.lib))
    (library (logical Device)
      (uri /home/dwblair/gitwork/kicad-symbols/Device.lib))
    (library (logical Mechanical)
      (uri /home/dwblair/gitwork/kicad-symbols/Mechanical.lib))
    (library (logical Switch)
      (uri /home/dwblair/gitwork/kicad-symbols/Switch.lib))
    (library (logical device)
      (uri /home/dwblair/gitwork/co2monitor-hardware/REV_L/kicad/symbols/device.lib))
    (library (logical mysensors_radios)
      (uri /home/dwblair/gitwork/co2monitor-hardware/REV_L/kicad/symbols/mysensors_radios.lib)))
  (nets
    (net (code 1) (name "Net-(X1-Pad33)")
      (node (ref X1) (pin 33)))
    (net (code 2) (name GND)
      (node (ref J6) (pin 4))
      (node (ref J6) (pin 1))
      (node (ref J16) (pin 1))
      (node (ref X1) (pin 15))
      (node (ref X1) (pin 1))
      (node (ref C1) (pin 2))
      (node (ref C5) (pin 2))
      (node (ref U1) (pin 10))
      (node (ref SW1) (pin 4))
      (node (ref SW1) (pin 3))
      (node (ref J12) (pin 2))
      (node (ref J3) (pin 2))
      (node (ref U1) (pin 8))
      (node (ref U1) (pin 1))
      (node (ref J11) (pin 1))
      (node (ref J2) (pin 9))
      (node (ref J10) (pin 1))
      (node (ref J4) (pin MP))
      (node (ref J4) (pin 2))
      (node (ref J8) (pin 2))
      (node (ref SW2) (pin 4))
      (node (ref SW2) (pin 3))
      (node (ref IC1) (pin 3))
      (node (ref R9) (pin 2))
      (node (ref ECC1) (pin 4))
      (node (ref C2) (pin 2))
      (node (ref C4) (pin 2))
      (node (ref U2) (pin 2))
      (node (ref C3) (pin 2))
      (node (ref X1) (pin 38))
      (node (ref X1) (pin P$1)))
    (net (code 3) (name "Net-(X1-Pad9)")
      (node (ref X1) (pin 9)))
    (net (code 4) (name "Net-(X1-Pad8)")
      (node (ref X1) (pin 8)))
    (net (code 5) (name "Net-(X1-Pad7)")
      (node (ref X1) (pin 7)))
    (net (code 6) (name "Net-(X1-Pad6)")
      (node (ref X1) (pin 6)))
    (net (code 7) (name "Net-(X1-Pad5)")
      (node (ref X1) (pin 5)))
    (net (code 8) (name "Net-(X1-Pad4)")
      (node (ref X1) (pin 4)))
    (net (code 9) (name "Net-(X1-Pad37)")
      (node (ref X1) (pin 37)))
    (net (code 10) (name "Net-(X1-Pad36)")
      (node (ref X1) (pin 36)))
    (net (code 11) (name ESP_TX)
      (node (ref X1) (pin 35)))
    (net (code 12) (name ESP_RX)
      (node (ref J12) (pin 13))
      (node (ref X1) (pin 34))
      (node (ref J3) (pin 13)))
    (net (code 13) (name "Net-(X1-Pad31)")
      (node (ref X1) (pin 31)))
    (net (code 14) (name "Net-(X1-Pad30)")
      (node (ref X1) (pin 30)))
    (net (code 15) (name "Net-(X1-Pad3)")
      (node (ref X1) (pin 3)))
    (net (code 16) (name "Net-(X1-Pad28)")
      (node (ref X1) (pin 28)))
    (net (code 17) (name "Net-(X1-Pad27)")
      (node (ref X1) (pin 27)))
    (net (code 18) (name "Net-(X1-Pad26)")
      (node (ref X1) (pin 26)))
    (net (code 19) (name ESP_GPIO0)
      (node (ref X1) (pin 25))
      (node (ref J12) (pin 7)))
    (net (code 20) (name "Net-(X1-Pad24)")
      (node (ref X1) (pin 24)))
    (net (code 21) (name "Net-(X1-Pad23)")
      (node (ref X1) (pin 23)))
    (net (code 22) (name "Net-(X1-Pad22)")
      (node (ref X1) (pin 22)))
    (net (code 23) (name "Net-(X1-Pad21)")
      (node (ref X1) (pin 21)))
    (net (code 24) (name "Net-(X1-Pad20)")
      (node (ref X1) (pin 20)))
    (net (code 25) (name 3VESP)
      (node (ref C3) (pin 1))
      (node (ref IC1) (pin 5))
      (node (ref U2) (pin 5))
      (node (ref C4) (pin 1))
      (node (ref X1) (pin 2))
      (node (ref C2) (pin 1))
      (node (ref R11) (pin 1)))
    (net (code 26) (name "Net-(X1-Pad19)")
      (node (ref X1) (pin 19)))
    (net (code 27) (name "Net-(ECC1-Pad3)")
      (node (ref ECC1) (pin 3)))
    (net (code 28) (name "Net-(U2-Pad4)")
      (node (ref U2) (pin 4)))
    (net (code 29) (name "Net-(ECC1-Pad7)")
      (node (ref ECC1) (pin 7)))
    (net (code 30) (name "Net-(ECC1-Pad2)")
      (node (ref ECC1) (pin 2)))
    (net (code 31) (name "Net-(ECC1-Pad1)")
      (node (ref ECC1) (pin 1)))
    (net (code 32) (name "Net-(IC1-Pad4)")
      (node (ref IC1) (pin 4)))
    (net (code 33) (name ESP_MISO)
      (node (ref IC1) (pin 2)))
    (net (code 34) (name "Net-(uSD-SP1-Pad7)")
      (node (ref uSD-SP1) (pin 7)))
    (net (code 35) (name "Net-(uSD-SP1-Pad6)")
      (node (ref uSD-SP1) (pin 6)))
    (net (code 36) (name "Net-(uSD-SP1-Pad5)")
      (node (ref uSD-SP1) (pin 5)))
    (net (code 37) (name "Net-(uSD-SP1-Pad4)")
      (node (ref uSD-SP1) (pin 4)))
    (net (code 38) (name "Net-(uSD-SP1-Pad3)")
      (node (ref uSD-SP1) (pin 3)))
    (net (code 39) (name "Net-(uSD-SP1-Pad2)")
      (node (ref uSD-SP1) (pin 2)))
    (net (code 40) (name "Net-(uSD-SP1-Pad1)")
      (node (ref uSD-SP1) (pin 1)))
    (net (code 41) (name "Net-(X1-Pad18)")
      (node (ref X1) (pin 18)))
    (net (code 42) (name "Net-(X1-Pad17)")
      (node (ref X1) (pin 17)))
    (net (code 43) (name "Net-(X1-Pad16)")
      (node (ref X1) (pin 16)))
    (net (code 44) (name "Net-(X1-Pad14)")
      (node (ref X1) (pin 14)))
    (net (code 45) (name "Net-(X1-Pad13)")
      (node (ref X1) (pin 13)))
    (net (code 46) (name "Net-(X1-Pad12)")
      (node (ref X1) (pin 12)))
    (net (code 47) (name "Net-(X1-Pad11)")
      (node (ref X1) (pin 11)))
    (net (code 48) (name "Net-(X1-Pad10)")
      (node (ref X1) (pin 10)))
    (net (code 49) (name "Net-(R10-Pad2)")
      (node (ref R10) (pin 2))
      (node (ref U2) (pin 3)))
    (net (code 50) (name "Net-(J1-Pad1)")
      (node (ref J1) (pin 1))
      (node (ref TP1) (pin 1)))
    (net (code 51) (name "Net-(J7-Pad4)")
      (node (ref TP8) (pin 1))
      (node (ref J7) (pin 4)))
    (net (code 52) (name "Net-(J7-Pad3)")
      (node (ref TP7) (pin 1))
      (node (ref J7) (pin 3)))
    (net (code 53) (name "Net-(J7-Pad2)")
      (node (ref TP6) (pin 1))
      (node (ref J7) (pin 2)))
    (net (code 54) (name "Net-(J1-Pad4)")
      (node (ref TP4) (pin 1))
      (node (ref J1) (pin 4)))
    (net (code 55) (name "Net-(J1-Pad3)")
      (node (ref TP3) (pin 1))
      (node (ref J1) (pin 3)))
    (net (code 56) (name "Net-(J1-Pad2)")
      (node (ref J1) (pin 2))
      (node (ref TP2) (pin 1)))
    (net (code 57) (name "Net-(J7-Pad1)")
      (node (ref TP5) (pin 1))
      (node (ref J7) (pin 1)))
    (net (code 58) (name +3V3)
      (node (ref R7) (pin 1))
      (node (ref ECC1) (pin 8))
      (node (ref J10) (pin 2))
      (node (ref J14) (pin 13))
      (node (ref C5) (pin 1))
      (node (ref R1) (pin 1))
      (node (ref J13) (pin 13))
      (node (ref U1) (pin 13))
      (node (ref R5) (pin 1))
      (node (ref R3) (pin 1))
      (node (ref R8) (pin 1))
      (node (ref J11) (pin 2))
      (node (ref R4) (pin 1))
      (node (ref J2) (pin 8))
      (node (ref R6) (pin 1))
      (node (ref R12) (pin 1))
      (node (ref R2) (pin 1))
      (node (ref R13) (pin 1))
      (node (ref J8) (pin 1)))
    (net (code 59) (name SERDAT)
      (node (ref J16) (pin 2))
      (node (ref R13) (pin 2))
      (node (ref J6) (pin 2))
      (node (ref R12) (pin 2)))
    (net (code 60) (name "Net-(J9-Pad1)")
      (node (ref J9) (pin 1)))
    (net (code 61) (name "Net-(C1-Pad1)")
      (node (ref R10) (pin 1))
      (node (ref C1) (pin 1))
      (node (ref U2) (pin 1))
      (node (ref JP2) (pin 2))
      (node (ref D1) (pin C)))
    (net (code 62) (name "Net-(J9-Pad5)")
      (node (ref J9) (pin 5)))
    (net (code 63) (name "Net-(J9-Pad4)")
      (node (ref J9) (pin 4)))
    (net (code 64) (name "Net-(J9-Pad3)")
      (node (ref J9) (pin 3)))
    (net (code 65) (name "Net-(J9-Pad2)")
      (node (ref J9) (pin 2)))
    (net (code 66) (name "Net-(J17-Pad5)")
      (node (ref J17) (pin 5)))
    (net (code 67) (name "Net-(J17-Pad4)")
      (node (ref J17) (pin 4)))
    (net (code 68) (name "Net-(J17-Pad3)")
      (node (ref J17) (pin 3)))
    (net (code 69) (name 3)
      (node (ref J17) (pin 2)))
    (net (code 70) (name 4)
      (node (ref J17) (pin 1)))
    (net (code 71) (name "Net-(J6-Pad3)")
      (node (ref J6) (pin 3)))
    (net (code 72) (name "Net-(J15-Pad9)")
      (node (ref J15) (pin 9)))
    (net (code 73) (name "Net-(J16-Pad3)")
      (node (ref J16) (pin 3)))
    (net (code 74) (name 6)
      (node (ref R7) (pin 2))
      (node (ref R8) (pin 2))
      (node (ref SW2) (pin 2))
      (node (ref SW2) (pin 1)))
    (net (code 75) (name "Net-(J8-Pad6)")
      (node (ref J8) (pin 6)))
    (net (code 76) (name "Net-(J8-Pad7)")
      (node (ref J8) (pin 7)))
    (net (code 77) (name "Net-(J8-Pad5)")
      (node (ref J8) (pin 5)))
    (net (code 78) (name 11)
      (node (ref R6) (pin 2))
      (node (ref SW1) (pin 2))
      (node (ref SW1) (pin 1))
      (node (ref R5) (pin 2)))
    (net (code 79) (name "Net-(J12-Pad12)")
      (node (ref J12) (pin 12)))
    (net (code 80) (name SDA)
      (node (ref ECC1) (pin 5))
      (node (ref R1) (pin 2))
      (node (ref J2) (pin 1))
      (node (ref J3) (pin 12))
      (node (ref J10) (pin 4))
      (node (ref J8) (pin 4))
      (node (ref J11) (pin 3))
      (node (ref R2) (pin 2)))
    (net (code 81) (name SCL)
      (node (ref J2) (pin 2))
      (node (ref R3) (pin 2))
      (node (ref J10) (pin 3))
      (node (ref J3) (pin 11))
      (node (ref R4) (pin 2))
      (node (ref ECC1) (pin 6))
      (node (ref J8) (pin 3))
      (node (ref J11) (pin 4)))
    (net (code 82) (name "Net-(J3-Pad10)")
      (node (ref J3) (pin 10)))
    (net (code 83) (name VBAT)
      (node (ref J3) (pin 1)))
    (net (code 84) (name "Net-(J12-Pad9)")
      (node (ref J12) (pin 9)))
    (net (code 85) (name "Net-(J12-Pad8)")
      (node (ref J12) (pin 8)))
    (net (code 86) (name ESP_BUSY)
      (node (ref J12) (pin 6)))
    (net (code 87) (name ESP_RESET)
      (node (ref J12) (pin 5)))
    (net (code 88) (name ESP_CS)
      (node (ref J12) (pin 4))
      (node (ref IC1) (pin 1))
      (node (ref R11) (pin 2))
      (node (ref X1) (pin 29)))
    (net (code 89) (name VBUS)
      (node (ref J3) (pin 3))
      (node (ref R9) (pin 1))
      (node (ref D1) (pin A2))
      (node (ref D1) (pin A1))
      (node (ref J2) (pin 7))
      (node (ref JP2) (pin 1))
      (node (ref J4) (pin 1))
      (node (ref J12) (pin 3)))
    (net (code 90) (name EXP_TX)
      (node (ref J12) (pin 14))
      (node (ref J3) (pin 14)))
    (net (code 91) (name "Net-(J12-Pad11)")
      (node (ref J12) (pin 11)))
    (net (code 92) (name "Net-(J12-Pad10)")
      (node (ref J12) (pin 10)))
    (net (code 93) (name "Net-(J12-Pad1)")
      (node (ref J12) (pin 1)))
    (net (code 94) (name "Net-(J13-Pad9)")
      (node (ref J13) (pin 9)))
    (net (code 95) (name "Net-(J13-Pad8)")
      (node (ref J13) (pin 8)))
    (net (code 96) (name "Net-(J13-Pad7)")
      (node (ref J13) (pin 7)))
    (net (code 97) (name "Net-(J13-Pad6)")
      (node (ref J13) (pin 6)))
    (net (code 98) (name "Net-(J13-Pad5)")
      (node (ref J13) (pin 5)))
    (net (code 99) (name "Net-(J13-Pad12)")
      (node (ref J13) (pin 12)))
    (net (code 100) (name MISO)
      (node (ref U1) (pin 2))
      (node (ref J13) (pin 2))
      (node (ref J14) (pin 2)))
    (net (code 101) (name "Net-(J15-Pad8)")
      (node (ref J15) (pin 8)))
    (net (code 102) (name "Net-(J15-Pad7)")
      (node (ref J15) (pin 7)))
    (net (code 103) (name "Net-(J15-Pad6)")
      (node (ref J15) (pin 6)))
    (net (code 104) (name "Net-(J15-Pad5)")
      (node (ref J15) (pin 5)))
    (net (code 105) (name "Net-(J15-Pad4)")
      (node (ref J15) (pin 4)))
    (net (code 106) (name "Net-(J15-Pad3)")
      (node (ref J15) (pin 3)))
    (net (code 107) (name "Net-(J15-Pad2)")
      (node (ref J15) (pin 2)))
    (net (code 108) (name "Net-(J15-Pad1)")
      (node (ref J15) (pin 1)))
    (net (code 109) (name "Net-(J14-Pad9)")
      (node (ref J14) (pin 9)))
    (net (code 110) (name "Net-(J14-Pad8)")
      (node (ref J14) (pin 8)))
    (net (code 111) (name "Net-(J14-Pad7)")
      (node (ref J14) (pin 7)))
    (net (code 112) (name "Net-(J14-Pad6)")
      (node (ref J14) (pin 6)))
    (net (code 113) (name "Net-(J14-Pad5)")
      (node (ref J14) (pin 5)))
    (net (code 114) (name SCK)
      (node (ref J14) (pin 4))
      (node (ref J13) (pin 4))
      (node (ref U1) (pin 4)))
    (net (code 115) (name MOSI)
      (node (ref U1) (pin 3))
      (node (ref J14) (pin 3))
      (node (ref J13) (pin 3)))
    (net (code 116) (name "Net-(J13-Pad11)")
      (node (ref J13) (pin 11)))
    (net (code 117) (name ~RESET)
      (node (ref J14) (pin 14))
      (node (ref J13) (pin 14)))
    (net (code 118) (name "Net-(J14-Pad12)")
      (node (ref J14) (pin 12)))
    (net (code 119) (name "Net-(J14-Pad11)")
      (node (ref J14) (pin 11)))
    (net (code 120) (name "Net-(J14-Pad10)")
      (node (ref J14) (pin 10)))
    (net (code 121) (name "Net-(J14-Pad1)")
      (node (ref J14) (pin 1)))
    (net (code 122) (name "Net-(J3-Pad9)")
      (node (ref J3) (pin 9)))
    (net (code 123) (name "Net-(J3-Pad8)")
      (node (ref J3) (pin 8)))
    (net (code 124) (name "Net-(J3-Pad7)")
      (node (ref J3) (pin 7)))
    (net (code 125) (name "Net-(J3-Pad6)")
      (node (ref J3) (pin 6)))
    (net (code 126) (name "Net-(J3-Pad5)")
      (node (ref J3) (pin 5)))
    (net (code 127) (name "Net-(J3-Pad4)")
      (node (ref J3) (pin 4)))
    (net (code 128) (name A3)
      (node (ref U1) (pin 6)))
    (net (code 129) (name "Net-(U1-Pad16)")
      (node (ref U1) (pin 16)))
    (net (code 130) (name A2)
      (node (ref U1) (pin 14)))
    (net (code 131) (name "Net-(U1-Pad12)")
      (node (ref U1) (pin 12)))
    (net (code 132) (name "Net-(U1-Pad11)")
      (node (ref U1) (pin 11)))
    (net (code 133) (name "Net-(U1-Pad7)")
      (node (ref U1) (pin 7)))
    (net (code 134) (name A4)
      (node (ref U1) (pin 5)))
    (net (code 135) (name "Net-(J13-Pad10)")
      (node (ref J13) (pin 10)))
    (net (code 136) (name "Net-(J13-Pad1)")
      (node (ref J13) (pin 1)))
    (net (code 137) (name RX0)
      (node (ref J2) (pin 6)))
    (net (code 138) (name TX1)
      (node (ref J2) (pin 5)))
    (net (code 139) (name A0)
      (node (ref J2) (pin 4)))
    (net (code 140) (name A1)
      (node (ref J2) (pin 3))
      (node (ref JP1) (pin 1)))
    (net (code 141) (name "Net-(J5-Pad1)")
      (node (ref J5) (pin 1))
      (node (ref U1) (pin 9)))
    (net (code 142) (name LORA_DIO1)
      (node (ref JP1) (pin 2))
      (node (ref U1) (pin 15)))))