EESchema Schematic File Version 4
EELAYER 30 0
EELAYER END
$Descr A2 23386 16535
encoding utf-8
Sheet 1 1
Title ""
Date ""
Rev ""
Comp ""
Comment1 ""
Comment2 ""
Comment3 ""
Comment4 ""
$EndDescr
$Comp
L Motor:Motor_DC M1
U 1 1 5F265922
P 20050 6700
F 0 "M1" V 20345 6650 50  0000 C CNN
F 1 "Motor_DC" V 20254 6650 50  0000 C CNN
F 2 "" H 20050 6610 50  0001 C CNN
F 3 "~" H 20050 6610 50  0001 C CNN
	1    20050 6700
	1    0    0    -1  
$EndComp
$Comp
L Device:Q_NMOS_SGD HS2
U 1 1 5F25E36F
P 15000 6750
F 0 "HS2" H 14850 6900 50  0000 L CNN
F 1 "IPD90N04S4-02" H 14600 6500 50  0000 L CNN
F 2 "" H 15200 6850 50  0001 C CNN
F 3 "~" H 15000 6750 50  0001 C CNN
	1    15000 6750
	1    0    0    -1  
$EndComp
$Comp
L Device:C C8
U 1 1 5F2B5D82
P 13100 7650
F 0 "C8" V 12848 7650 50  0000 C CNN
F 1 "330n" V 12939 7650 50  0000 C CNN
F 2 "" H 13138 7500 50  0001 C CNN
F 3 "~" H 13100 7650 50  0001 C CNN
	1    13100 7650
	0    1    1    0   
$EndComp
$Comp
L Diode:BAW56DW D?
U 1 1 5F2B98EE
P 13900 7550
F 0 "D?" H 13900 7765 50  0000 C CNN
F 1 "BAW56DW" H 13900 7674 50  0000 C CNN
F 2 "Package_TO_SOT_SMD:SOT-363_SC-70-6" H 13900 7375 50  0001 C CNN
F 3 "http://www.diodes.com/datasheets/ds30146.pdf" H 13900 7650 50  0001 C CNN
	1    13900 7550
	1    0    0    -1  
$EndComp
$Comp
L Diode:BAW56DW D?
U 2 1 5F2BADF8
P 14200 7550
F 0 "D?" H 14200 7325 50  0000 C CNN
F 1 "BAW56DW" H 14200 7416 50  0000 C CNN
F 2 "Package_TO_SOT_SMD:SOT-363_SC-70-6" H 14200 7375 50  0001 C CNN
F 3 "http://www.diodes.com/datasheets/ds30146.pdf" H 14200 7650 50  0001 C CNN
	2    14200 7550
	-1   0    0    1   
$EndComp
Wire Wire Line
	14050 7550 14050 7250
Connection ~ 14050 7550
$Comp
L power:GND #PWR?
U 1 1 5F2BD162
P 14050 7250
F 0 "#PWR?" H 14050 7000 50  0001 C CNN
F 1 "GND" H 14055 7077 50  0000 C CNN
F 2 "" H 14050 7250 50  0001 C CNN
F 3 "" H 14050 7250 50  0001 C CNN
	1    14050 7250
	-1   0    0    1   
$EndComp
Wire Wire Line
	14350 7550 14400 7550
$Comp
L Device:R R10
U 1 1 5F2BE476
P 14750 7400
F 0 "R10" V 14543 7400 50  0000 C CNN
F 1 "0R" V 14634 7400 50  0000 C CNN
F 2 "" V 14680 7400 50  0001 C CNN
F 3 "~" H 14750 7400 50  0001 C CNN
	1    14750 7400
	0    1    1    0   
$EndComp
$Comp
L Device:R R2
U 1 1 5F2C7057
P 15450 6850
F 0 "R2" H 15520 6896 50  0000 L CNN
F 1 "2,2R" H 15520 6805 50  0000 L CNN
F 2 "" V 15380 6850 50  0001 C CNN
F 3 "~" H 15450 6850 50  0001 C CNN
	1    15450 6850
	1    0    0    -1  
$EndComp
$Comp
L Device:C C3
U 1 1 5F2C76EA
P 15450 6550
F 0 "C3" H 15565 6596 50  0000 L CNN
F 1 "4,7nF" H 15565 6505 50  0000 L CNN
F 2 "" H 15488 6400 50  0001 C CNN
F 3 "~" H 15450 6550 50  0001 C CNN
	1    15450 6550
	1    0    0    -1  
$EndComp
Wire Wire Line
	15100 6550 15100 6400
Wire Wire Line
	15100 6400 15450 6400
Wire Wire Line
	15450 6400 16150 6400
Connection ~ 15450 6400
$Comp
L Device:CP C26
U 1 1 5F2CBD66
P 16150 6550
F 0 "C26" H 16268 6596 50  0000 L CNN
F 1 "220u/50V" H 16268 6505 50  0000 L CNN
F 2 "" H 16188 6400 50  0001 C CNN
F 3 "~" H 16150 6550 50  0001 C CNN
	1    16150 6550
	1    0    0    -1  
$EndComp
Wire Wire Line
	16150 6400 16800 6400
Connection ~ 16150 6400
$Comp
L Device:C C5
U 1 1 5F2CD6E7
P 16800 6550
F 0 "C5" H 16915 6596 50  0000 L CNN
F 1 "2,2u" H 16915 6505 50  0000 L CNN
F 2 "" H 16838 6400 50  0001 C CNN
F 3 "~" H 16800 6550 50  0001 C CNN
	1    16800 6550
	1    0    0    -1  
$EndComp
Wire Wire Line
	16800 6700 16150 6700
Wire Wire Line
	16150 6700 16150 6800
Connection ~ 16150 6700
$Comp
L power:GNDPWR #PWR?
U 1 1 5F2CFFBA
P 16150 6800
F 0 "#PWR?" H 16150 6600 50  0001 C CNN
F 1 "GNDPWR" H 16154 6646 50  0000 C CNN
F 2 "" H 16150 6750 50  0001 C CNN
F 3 "" H 16150 6750 50  0001 C CNN
	1    16150 6800
	1    0    0    -1  
$EndComp
Wire Wire Line
	14400 7550 14400 7650
Wire Wire Line
	14400 7650 13400 7650
Connection ~ 14400 7550
Wire Wire Line
	14400 7550 14550 7550
Wire Wire Line
	13550 7800 13550 6900
Wire Wire Line
	13550 6900 13850 6900
$Comp
L Device:R R5
U 1 1 5F2D7DF7
P 14100 6900
F 0 "R5" V 13893 6900 50  0000 C CNN
F 1 "10R 1%" V 13984 6900 50  0000 C CNN
F 2 "" V 14030 6900 50  0001 C CNN
F 3 "~" H 14100 6900 50  0001 C CNN
	1    14100 6900
	0    1    1    0   
$EndComp
Wire Wire Line
	14250 6900 14350 6900
$Comp
L Device:D D3
U 1 1 5F2D9798
P 14100 6550
F 0 "D3" H 14100 6766 50  0000 C CNN
F 1 "D" H 14100 6675 50  0000 C CNN
F 2 "" H 14100 6550 50  0001 C CNN
F 3 "~" H 14100 6550 50  0001 C CNN
	1    14100 6550
	1    0    0    -1  
$EndComp
Wire Wire Line
	14250 6550 14350 6550
Wire Wire Line
	14350 6550 14350 6750
Wire Wire Line
	15100 6950 15100 7200
Connection ~ 15100 7400
Wire Wire Line
	15450 7000 15450 7200
Wire Wire Line
	14800 6750 14350 6750
Connection ~ 14350 6750
Wire Wire Line
	14350 6750 14350 6900
Wire Wire Line
	13950 6550 13850 6550
Wire Wire Line
	13850 6550 13850 6900
Connection ~ 13850 6900
Wire Wire Line
	13850 6900 13950 6900
Wire Wire Line
	12800 7500 12800 7900
Wire Wire Line
	13750 8100 13750 8350
$Comp
L Device:R R8
U 1 1 5F32D7B8
P 14100 8350
F 0 "R8" V 13893 8350 50  0000 C CNN
F 1 "10R 1%" V 13984 8350 50  0000 C CNN
F 2 "" V 14030 8350 50  0001 C CNN
F 3 "~" H 14100 8350 50  0001 C CNN
	1    14100 8350
	0    1    1    0   
$EndComp
$Comp
L Device:D D8
U 1 1 5F32E176
P 14100 8600
F 0 "D8" H 14100 8700 50  0000 C CNN
F 1 "D" H 14300 8700 50  0000 C CNN
F 2 "" H 14100 8600 50  0001 C CNN
F 3 "~" H 14100 8600 50  0001 C CNN
	1    14100 8600
	1    0    0    -1  
$EndComp
Wire Wire Line
	13750 8350 13950 8350
Wire Wire Line
	13950 8350 13950 8600
Connection ~ 13950 8350
Wire Wire Line
	14250 8350 14250 8600
$Comp
L Device:Q_NMOS_SGD LS2
U 1 1 5F3355AB
P 15000 8350
F 0 "LS2" H 15204 8396 50  0000 L CNN
F 1 "IPD90N04S4-02" H 14600 8100 50  0000 L CNN
F 2 "" H 15200 8450 50  0001 C CNN
F 3 "~" H 15000 8350 50  0001 C CNN
	1    15000 8350
	1    0    0    -1  
$EndComp
Wire Wire Line
	14250 8350 14800 8350
Connection ~ 14250 8350
$Comp
L Device:C C9
U 1 1 5F3437C5
P 15550 8200
F 0 "C9" H 15665 8246 50  0000 L CNN
F 1 "4,7nF" H 15665 8155 50  0000 L CNN
F 2 "" H 15588 8050 50  0001 C CNN
F 3 "~" H 15550 8200 50  0001 C CNN
	1    15550 8200
	1    0    0    -1  
$EndComp
$Comp
L Device:R R?
U 1 1 5F348069
P 15550 8600
F 0 "R?" H 15620 8646 50  0000 L CNN
F 1 "R" H 15620 8555 50  0000 L CNN
F 2 "" V 15480 8600 50  0001 C CNN
F 3 "~" H 15550 8600 50  0001 C CNN
	1    15550 8600
	1    0    0    -1  
$EndComp
Wire Wire Line
	15550 8450 15550 8350
Wire Wire Line
	15550 8750 15550 8850
Wire Wire Line
	15550 8850 15100 8850
Wire Wire Line
	15100 8550 15100 8850
Wire Wire Line
	15100 8850 14650 8850
Connection ~ 15100 8850
$Comp
L Device:R R11
U 1 1 5F353F20
P 14500 8850
F 0 "R11" V 14400 8850 50  0000 C CNN
F 1 "0R" V 14600 8850 50  0000 C CNN
F 2 "" V 14430 8850 50  0001 C CNN
F 3 "~" H 14500 8850 50  0001 C CNN
	1    14500 8850
	0    1    1    0   
$EndComp
Wire Wire Line
	13150 8250 13150 8850
Wire Wire Line
	13150 8850 14350 8850
$Comp
L Device:D D5
U 1 1 5F359B6C
P 13300 8250
F 0 "D5" H 13300 8350 50  0000 C CNN
F 1 "D" H 13500 8350 50  0000 C CNN
F 2 "" H 13300 8250 50  0001 C CNN
F 3 "~" H 13300 8250 50  0001 C CNN
	1    13300 8250
	1    0    0    -1  
$EndComp
Connection ~ 13150 8250
$Comp
L power:GND #PWR?
U 1 1 5F35A53F
P 13450 8250
F 0 "#PWR?" H 13450 8000 50  0001 C CNN
F 1 "GND" V 13455 8122 50  0000 R CNN
F 2 "" H 13450 8250 50  0001 C CNN
F 3 "" H 13450 8250 50  0001 C CNN
	1    13450 8250
	0    -1   -1   0   
$EndComp
Wire Wire Line
	15550 8850 17200 8850
Connection ~ 15550 8850
$Comp
L Device:Q_NMOS_SGD LS1
U 1 1 5F363647
P 17600 8300
F 0 "LS1" H 17804 8346 50  0000 L CNN
F 1 "IPD90N04S4-02" H 17200 8050 50  0000 L CNN
F 2 "" H 17800 8400 50  0001 C CNN
F 3 "~" H 17600 8300 50  0001 C CNN
	1    17600 8300
	1    0    0    -1  
$EndComp
Wire Wire Line
	17700 8100 17700 8000
$Comp
L Device:C C6
U 1 1 5F36D1E4
P 18150 8150
F 0 "C6" H 18265 8196 50  0000 L CNN
F 1 "4,7nF" H 18265 8105 50  0000 L CNN
F 2 "" H 18188 8000 50  0001 C CNN
F 3 "~" H 18150 8150 50  0001 C CNN
	1    18150 8150
	1    0    0    -1  
$EndComp
Wire Wire Line
	17700 8000 18150 8000
$Comp
L Device:R R3
U 1 1 5F370A02
P 18150 8450
F 0 "R3" H 18220 8496 50  0000 L CNN
F 1 "2,2R" H 18220 8405 50  0000 L CNN
F 2 "" V 18080 8450 50  0001 C CNN
F 3 "~" H 18150 8450 50  0001 C CNN
	1    18150 8450
	1    0    0    -1  
$EndComp
Wire Wire Line
	17700 8500 17700 8600
Wire Wire Line
	17700 8600 18150 8600
Wire Wire Line
	17700 8600 17700 8850
Connection ~ 17700 8600
$Comp
L Diode:BAW56DW D?
U 1 1 5F3ABDC0
P 13150 6550
F 0 "D?" H 13150 6765 50  0000 C CNN
F 1 "BAW56DW" H 13150 6674 50  0000 C CNN
F 2 "Package_TO_SOT_SMD:SOT-363_SC-70-6" H 13150 6375 50  0001 C CNN
F 3 "http://www.diodes.com/datasheets/ds30146.pdf" H 13150 6650 50  0001 C CNN
	1    13150 6550
	1    0    0    -1  
$EndComp
$Comp
L Diode:BAW56DW D?
U 2 1 5F3ACC7A
P 13450 6550
F 0 "D?" H 13450 6325 50  0000 C CNN
F 1 "BAW56DW" H 13450 6416 50  0000 C CNN
F 2 "Package_TO_SOT_SMD:SOT-363_SC-70-6" H 13450 6375 50  0001 C CNN
F 3 "http://www.diodes.com/datasheets/ds30146.pdf" H 13450 6650 50  0001 C CNN
	2    13450 6550
	-1   0    0    1   
$EndComp
Wire Wire Line
	13300 6550 13300 6650
Connection ~ 13300 6550
$Comp
L power:GND #PWR?
U 1 1 5F3B131E
P 13300 6650
F 0 "#PWR?" H 13300 6400 50  0001 C CNN
F 1 "GND" H 13305 6477 50  0000 C CNN
F 2 "" H 13300 6650 50  0001 C CNN
F 3 "" H 13300 6650 50  0001 C CNN
	1    13300 6650
	1    0    0    -1  
$EndComp
Wire Wire Line
	12300 8250 13150 8250
Wire Wire Line
	12300 8100 13750 8100
Wire Wire Line
	12300 7800 13550 7800
Wire Wire Line
	12300 7650 12950 7650
Wire Wire Line
	12300 7500 12800 7500
Wire Wire Line
	12300 7050 12750 7050
Wire Wire Line
	13050 6150 13850 6150
$Comp
L Device:R R9
U 1 1 5F3F7675
P 14000 6150
F 0 "R9" V 13793 6150 50  0000 C CNN
F 1 "0R" V 13884 6150 50  0000 C CNN
F 2 "" V 13930 6150 50  0001 C CNN
F 3 "~" H 14000 6150 50  0001 C CNN
	1    14000 6150
	0    1    1    0   
$EndComp
Wire Wire Line
	12300 7200 12600 7200
Wire Wire Line
	12600 7200 12600 5750
$Comp
L Device:R R6
U 1 1 5F402AE3
P 13950 5750
F 0 "R6" V 13743 5750 50  0000 C CNN
F 1 "10R 1%" V 13834 5750 50  0000 C CNN
F 2 "" V 13880 5750 50  0001 C CNN
F 3 "~" H 13950 5750 50  0001 C CNN
	1    13950 5750
	0    1    1    0   
$EndComp
$Comp
L Device:D D1
U 1 1 5F4032F1
P 13950 5400
F 0 "D1" H 13950 5616 50  0000 C CNN
F 1 "D" H 13950 5525 50  0000 C CNN
F 2 "" H 13950 5400 50  0001 C CNN
F 3 "~" H 13950 5400 50  0001 C CNN
	1    13950 5400
	1    0    0    -1  
$EndComp
Wire Wire Line
	14100 5400 14100 5750
Wire Wire Line
	13800 5400 13800 5750
Connection ~ 13800 5750
Wire Wire Line
	12600 5750 13800 5750
Wire Wire Line
	12450 6900 12450 4950
Wire Wire Line
	12450 4950 13800 4950
Wire Wire Line
	12300 6900 12450 6900
$Comp
L Device:R R19
U 1 1 5F41CFBB
P 13950 4950
F 0 "R19" V 13743 4950 50  0000 C CNN
F 1 "22R 1%" V 13834 4950 50  0000 C CNN
F 2 "" V 13880 4950 50  0001 C CNN
F 3 "~" H 13950 4950 50  0001 C CNN
	1    13950 4950
	0    1    1    0   
$EndComp
Wire Wire Line
	12300 4450 13800 4450
Wire Wire Line
	12300 4450 12300 6750
$Comp
L Device:R R18
U 1 1 5F426824
P 13950 4450
F 0 "R18" V 13743 4450 50  0000 C CNN
F 1 "4k7" V 13834 4450 50  0000 C CNN
F 2 "" V 13880 4450 50  0001 C CNN
F 3 "~" H 13950 4450 50  0001 C CNN
	1    13950 4450
	0    1    1    0   
$EndComp
$Comp
L Device:Q_NMOS_SGD RPP-MOSFET
U 1 1 5F42BF2C
P 17600 4450
F 0 "RPP-MOSFET" H 17804 4496 50  0000 L CNN
F 1 "IPD90N04S4-02" H 17200 4200 50  0000 L CNN
F 2 "" H 17800 4550 50  0001 C CNN
F 3 "~" H 17600 4450 50  0001 C CNN
	1    17600 4450
	1    0    0    1   
$EndComp
Wire Wire Line
	17700 4950 17700 4650
$Comp
L Device:Q_NMOS_SGD HS1
U 1 1 5F45184E
P 17600 5450
F 0 "HS1" H 17450 5650 50  0000 L CNN
F 1 "IPD90N04S4-02" H 17200 5200 50  0000 L CNN
F 2 "" H 17800 5550 50  0001 C CNN
F 3 "~" H 17600 5450 50  0001 C CNN
	1    17600 5450
	1    0    0    -1  
$EndComp
Wire Wire Line
	14150 6150 17700 6150
$Comp
L Device:C C29
U 1 1 5F475FF3
P 16000 5100
F 0 "C29" H 16115 5146 50  0000 L CNN
F 1 "2,2nF" H 16115 5055 50  0000 L CNN
F 2 "" H 16038 4950 50  0001 C CNN
F 3 "~" H 16000 5100 50  0001 C CNN
	1    16000 5100
	1    0    0    -1  
$EndComp
Wire Wire Line
	16000 4950 16500 4950
$Comp
L Device:CP C28
U 1 1 5F477E4D
P 16500 5100
F 0 "C28" H 16618 5146 50  0000 L CNN
F 1 "220u/50V" H 16618 5055 50  0000 L CNN
F 2 "" H 16538 4950 50  0001 C CNN
F 3 "~" H 16500 5100 50  0001 C CNN
	1    16500 5100
	1    0    0    -1  
$EndComp
Wire Wire Line
	17700 4950 17700 5250
Connection ~ 17700 4950
$Comp
L power:GNDPWR #PWR?
U 1 1 5F48E5B5
P 16000 5400
F 0 "#PWR?" H 16000 5200 50  0001 C CNN
F 1 "GNDPWR" H 16004 5246 50  0000 C CNN
F 2 "" H 16000 5350 50  0001 C CNN
F 3 "" H 16000 5350 50  0001 C CNN
	1    16000 5400
	1    0    0    -1  
$EndComp
Wire Wire Line
	16000 5250 16000 5300
Wire Wire Line
	16000 5300 16500 5300
Wire Wire Line
	16500 5300 16500 5250
Connection ~ 16000 5300
Wire Wire Line
	16000 5300 16000 5400
Wire Wire Line
	14100 5750 16950 5750
Wire Wire Line
	16950 5750 16950 5450
Wire Wire Line
	16950 5450 17400 5450
Connection ~ 14100 5750
$Comp
L Device:C C?
U 1 1 5F4A13D0
P 18100 5100
F 0 "C?" H 18215 5146 50  0000 L CNN
F 1 "2,2nF" H 18215 5055 50  0000 L CNN
F 2 "" H 18138 4950 50  0001 C CNN
F 3 "~" H 18100 5100 50  0001 C CNN
	1    18100 5100
	1    0    0    -1  
$EndComp
$Comp
L Device:R R?
U 1 1 5F4A447C
P 18100 5500
F 0 "R?" H 18170 5546 50  0000 L CNN
F 1 "R" H 18170 5455 50  0000 L CNN
F 2 "" V 18030 5500 50  0001 C CNN
F 3 "~" H 18100 5500 50  0001 C CNN
	1    18100 5500
	1    0    0    -1  
$EndComp
Wire Wire Line
	18100 5250 18100 5350
Wire Wire Line
	17700 5650 17700 5850
Connection ~ 17700 6150
Wire Wire Line
	17700 6150 18700 6150
Wire Wire Line
	18100 5650 18100 5850
Wire Wire Line
	18100 5850 17700 5850
Connection ~ 17700 5850
Wire Wire Line
	17700 5850 17700 6150
Wire Wire Line
	18100 4950 17700 4950
Wire Wire Line
	12550 8000 12550 7950
Wire Wire Line
	12550 7950 12300 7950
Wire Wire Line
	15100 7200 15450 7200
Connection ~ 15100 7200
Wire Wire Line
	15100 7200 15100 7400
Wire Wire Line
	17700 8000 17700 6150
Connection ~ 17700 8000
Connection ~ 18700 6150
Wire Wire Line
	14600 7400 14550 7400
Wire Wire Line
	14550 7400 14550 7550
Wire Wire Line
	14900 7400 15100 7400
Wire Wire Line
	15100 7400 15100 8050
Wire Wire Line
	15550 8050 15100 8050
Connection ~ 15100 8050
Wire Wire Line
	15100 8050 15100 8150
Wire Wire Line
	17400 7900 17400 8300
Wire Wire Line
	14850 7900 17400 7900
Wire Wire Line
	12800 7900 14550 7900
Connection ~ 14850 7900
Connection ~ 14550 7900
Wire Wire Line
	14850 7650 14850 7900
Wire Wire Line
	14550 7650 14550 7900
$Comp
L Device:D D6
U 1 1 5F30A39D
P 14700 7650
F 0 "D6" H 14700 7750 50  0000 C CNN
F 1 "D" H 14800 7700 50  0000 C CNN
F 2 "" H 14700 7650 50  0001 C CNN
F 3 "~" H 14700 7650 50  0001 C CNN
	1    14700 7650
	1    0    0    -1  
$EndComp
$Comp
L Device:R R7
U 1 1 5F2F90FC
P 14700 7900
F 0 "R7" V 14600 7900 50  0000 C CNN
F 1 "10R 1%" V 14800 7900 50  0000 C CNN
F 2 "" V 14630 7900 50  0001 C CNN
F 3 "~" H 14700 7900 50  0001 C CNN
	1    14700 7900
	0    1    1    0   
$EndComp
$Comp
L Device:C C7
U 1 1 5F3ED55C
P 12900 6150
F 0 "C7" V 12648 6150 50  0000 C CNN
F 1 "330n" V 12739 6150 50  0000 C CNN
F 2 "" H 12938 6000 50  0001 C CNN
F 3 "~" H 12900 6150 50  0001 C CNN
	1    12900 6150
	0    1    1    0   
$EndComp
Wire Wire Line
	12750 6150 12750 7050
Wire Wire Line
	13000 6550 12900 6550
Wire Wire Line
	12900 6550 12900 7350
Wire Wire Line
	12300 7350 12900 7350
Wire Wire Line
	13400 7650 13400 8000
Wire Wire Line
	12550 8000 13400 8000
Connection ~ 13400 7650
Wire Wire Line
	13400 7650 13250 7650
$Comp
L power:+5V #PWR?
U 1 1 5F61E00D
P 14650 9250
F 0 "#PWR?" H 14650 9100 50  0001 C CNN
F 1 "+5V" H 14665 9423 50  0000 C CNN
F 2 "" H 14650 9250 50  0001 C CNN
F 3 "" H 14650 9250 50  0001 C CNN
	1    14650 9250
	1    0    0    -1  
$EndComp
$Comp
L Device:C C4
U 1 1 5F62182C
P 14950 9400
F 0 "C4" H 15065 9446 50  0000 L CNN
F 1 "100n" H 15065 9355 50  0000 L CNN
F 2 "" H 14988 9250 50  0001 C CNN
F 3 "~" H 14950 9400 50  0001 C CNN
	1    14950 9400
	1    0    0    -1  
$EndComp
$Comp
L power:GND #PWR?
U 1 1 5F622DC5
P 15400 9550
F 0 "#PWR?" H 15400 9300 50  0001 C CNN
F 1 "GND" H 15405 9377 50  0000 C CNN
F 2 "" H 15400 9550 50  0001 C CNN
F 3 "" H 15400 9550 50  0001 C CNN
	1    15400 9550
	-1   0    0    1   
$EndComp
Wire Wire Line
	14950 9550 15400 9550
$Comp
L Device:C C14
U 1 1 5F630CD0
P 15400 9700
F 0 "C14" H 15515 9746 50  0000 L CNN
F 1 "10p" H 15515 9655 50  0000 L CNN
F 2 "" H 15438 9550 50  0001 C CNN
F 3 "~" H 15400 9700 50  0001 C CNN
	1    15400 9700
	1    0    0    -1  
$EndComp
Connection ~ 15400 9550
$Comp
L Device:C C12
U 1 1 5F631435
P 15400 10250
F 0 "C12" H 15515 10296 50  0000 L CNN
F 1 "100p" H 15515 10205 50  0000 L CNN
F 2 "" H 15438 10100 50  0001 C CNN
F 3 "~" H 15400 10250 50  0001 C CNN
	1    15400 10250
	1    0    0    -1  
$EndComp
Wire Wire Line
	15400 10100 15400 9950
$Comp
L Device:C C15
U 1 1 5F63898C
P 15400 11100
F 0 "C15" H 15515 11146 50  0000 L CNN
F 1 "10p" H 15515 11055 50  0000 L CNN
F 2 "" H 15438 10950 50  0001 C CNN
F 3 "~" H 15400 11100 50  0001 C CNN
	1    15400 11100
	1    0    0    -1  
$EndComp
Wire Wire Line
	15400 10400 15400 10600
Wire Wire Line
	14650 9250 14950 9250
$Comp
L Device:R R14
U 1 1 5F64F824
P 14650 9650
F 0 "R14" H 14720 9696 50  0000 L CNN
F 1 "10K 1%" H 14720 9605 50  0000 L CNN
F 2 "" V 14580 9650 50  0001 C CNN
F 3 "~" H 14650 9650 50  0001 C CNN
	1    14650 9650
	1    0    0    -1  
$EndComp
Wire Wire Line
	15400 9950 14650 9950
Connection ~ 15400 9950
Wire Wire Line
	15400 9950 15400 9850
Wire Wire Line
	14650 9250 14650 9500
Connection ~ 14650 9250
$Comp
L Device:R R12
U 1 1 5F65D75F
P 15900 9950
F 0 "R12" V 15693 9950 50  0000 C CNN
F 1 "220R 1%" V 15784 9950 50  0000 C CNN
F 2 "" V 15830 9950 50  0001 C CNN
F 3 "~" H 15900 9950 50  0001 C CNN
	1    15900 9950
	0    1    1    0   
$EndComp
Wire Wire Line
	15750 9950 15400 9950
Connection ~ 14650 9950
$Comp
L Device:R R15
U 1 1 5F6733FD
P 14650 11000
F 0 "R15" H 14720 11046 50  0000 L CNN
F 1 "10K 1%" H 14720 10955 50  0000 L CNN
F 2 "" V 14580 11000 50  0001 C CNN
F 3 "~" H 14650 11000 50  0001 C CNN
	1    14650 11000
	1    0    0    -1  
$EndComp
$Comp
L power:GND #PWR?
U 1 1 5F673DDC
P 14650 11250
F 0 "#PWR?" H 14650 11000 50  0001 C CNN
F 1 "GND" H 14655 11077 50  0000 C CNN
F 2 "" H 14650 11250 50  0001 C CNN
F 3 "" H 14650 11250 50  0001 C CNN
	1    14650 11250
	1    0    0    -1  
$EndComp
$Comp
L power:GND #PWR?
U 1 1 5F6744D8
P 15400 11250
F 0 "#PWR?" H 15400 11000 50  0001 C CNN
F 1 "GND" H 15405 11077 50  0000 C CNN
F 2 "" H 15400 11250 50  0001 C CNN
F 3 "" H 15400 11250 50  0001 C CNN
	1    15400 11250
	1    0    0    -1  
$EndComp
Wire Wire Line
	14650 11150 14650 11250
$Comp
L Device:R R13
U 1 1 5F67C788
P 15850 10600
F 0 "R13" V 15643 10600 50  0000 C CNN
F 1 "220R 1%" V 15734 10600 50  0000 C CNN
F 2 "" V 15780 10600 50  0001 C CNN
F 3 "~" H 15850 10600 50  0001 C CNN
	1    15850 10600
	0    1    1    0   
$EndComp
Wire Wire Line
	15700 10600 15400 10600
Connection ~ 15400 10600
Wire Wire Line
	14650 9800 14650 9950
Wire Wire Line
	13000 8400 12300 8400
Wire Wire Line
	15400 10600 15400 10950
Wire Wire Line
	14650 9950 14650 10850
Wire Wire Line
	15400 10600 14100 10600
Wire Wire Line
	12750 8550 12300 8550
$Comp
L power:GNDPWR #PWR?
U 1 1 5F6F44C3
P 17200 10550
F 0 "#PWR?" H 17200 10350 50  0001 C CNN
F 1 "GNDPWR" H 17204 10396 50  0000 C CNN
F 2 "" H 17200 10500 50  0001 C CNN
F 3 "" H 17200 10500 50  0001 C CNN
	1    17200 10550
	1    0    0    -1  
$EndComp
Connection ~ 17200 8850
Wire Wire Line
	17200 8850 17700 8850
Wire Wire Line
	16050 9950 16850 9950
Wire Wire Line
	16850 9950 16850 10000
Wire Wire Line
	16000 10600 16850 10600
Wire Wire Line
	16850 10600 16850 10450
$Comp
L Device:C C24
U 1 1 5F72EDFE
P 17700 9900
F 0 "C24" V 17448 9900 50  0000 C CNN
F 1 "C" V 17539 9900 50  0000 C CNN
F 2 "" H 17738 9750 50  0001 C CNN
F 3 "~" H 17700 9900 50  0001 C CNN
	1    17700 9900
	0    1    1    0   
$EndComp
Wire Wire Line
	17550 9900 17200 9900
Connection ~ 17200 9900
Wire Wire Line
	17200 9900 17200 8850
$Comp
L power:GNDPWR #PWR?
U 1 1 5F738532
P 17850 9900
F 0 "#PWR?" H 17850 9700 50  0001 C CNN
F 1 "GNDPWR" V 17855 9792 50  0000 R CNN
F 2 "" H 17850 9850 50  0001 C CNN
F 3 "" H 17850 9850 50  0001 C CNN
	1    17850 9900
	0    -1   -1   0   
$EndComp
$Comp
L Device:R R?
U 1 1 5F73CDC4
P 17200 10200
F 0 "R?" H 17270 10246 50  0000 L CNN
F 1 "R" H 17270 10155 50  0000 L CNN
F 2 "" V 17130 10200 50  0001 C CNN
F 3 "~" H 17200 10200 50  0001 C CNN
	1    17200 10200
	1    0    0    -1  
$EndComp
Wire Wire Line
	17200 9900 17200 10000
Wire Wire Line
	17200 10350 17200 10450
Wire Wire Line
	17200 10450 16850 10450
Connection ~ 17200 10450
Wire Wire Line
	17200 10450 17200 10550
Wire Wire Line
	17200 10000 16850 10000
Connection ~ 17200 10000
Wire Wire Line
	17200 10000 17200 10050
Wire Wire Line
	14650 9950 14300 9950
Wire Wire Line
	14300 9950 14300 9100
Wire Wire Line
	14300 9100 13000 9100
Wire Wire Line
	13000 9100 13000 8400
Wire Wire Line
	12750 9400 13350 9400
Wire Wire Line
	12750 9400 12750 8550
$Comp
L Device:R R44
U 1 1 5F787179
P 13350 9550
F 0 "R44" V 13250 9450 50  0000 L CNN
F 1 "10K 1%" V 13450 9450 50  0000 L CNN
F 2 "" V 13280 9550 50  0001 C CNN
F 3 "~" H 13350 9550 50  0001 C CNN
	1    13350 9550
	1    0    0    -1  
$EndComp
Connection ~ 13350 9400
Wire Wire Line
	13350 9400 13800 9400
$Comp
L Device:R R16
U 1 1 5F7876E4
P 13800 9550
F 0 "R16" V 13700 9500 50  0000 L CNN
F 1 "10K 1%" V 13950 9450 50  0000 L CNN
F 2 "" V 13730 9550 50  0001 C CNN
F 3 "~" H 13800 9550 50  0001 C CNN
	1    13800 9550
	1    0    0    -1  
$EndComp
Connection ~ 13800 9400
Wire Wire Line
	13800 9400 14100 9400
Wire Wire Line
	11450 8550 11450 9700
Wire Wire Line
	11450 9700 13350 9700
Connection ~ 13350 9700
Wire Wire Line
	13350 9700 13800 9700
$Comp
L power:GND #PWR?
U 1 1 5F792727
P 11850 8900
F 0 "#PWR?" H 11850 8650 50  0001 C CNN
F 1 "GND" H 11855 8727 50  0000 C CNN
F 2 "" H 11850 8900 50  0001 C CNN
F 3 "" H 11850 8900 50  0001 C CNN
	1    11850 8900
	1    0    0    -1  
$EndComp
$Comp
L Device:C C16
U 1 1 5F79DFC6
P 14100 11000
F 0 "C16" H 14215 11046 50  0000 L CNN
F 1 "220p" H 14215 10955 50  0000 L CNN
F 2 "" H 14138 10850 50  0001 C CNN
F 3 "~" H 14100 11000 50  0001 C CNN
	1    14100 11000
	1    0    0    -1  
$EndComp
$Comp
L Device:C C17
U 1 1 5F79E655
P 13350 11000
F 0 "C17" H 13465 11046 50  0000 L CNN
F 1 "220p" H 13465 10955 50  0000 L CNN
F 2 "" H 13388 10850 50  0001 C CNN
F 3 "~" H 13350 11000 50  0001 C CNN
	1    13350 11000
	1    0    0    -1  
$EndComp
Wire Wire Line
	14100 10600 14100 10850
Connection ~ 14100 10600
$Comp
L power:GND #PWR?
U 1 1 5F7A9838
P 14100 11250
F 0 "#PWR?" H 14100 11000 50  0001 C CNN
F 1 "GND" H 14105 11077 50  0000 C CNN
F 2 "" H 14100 11250 50  0001 C CNN
F 3 "" H 14100 11250 50  0001 C CNN
	1    14100 11250
	1    0    0    -1  
$EndComp
$Comp
L power:GND #PWR?
U 1 1 5F7A9C93
P 13350 11250
F 0 "#PWR?" H 13350 11000 50  0001 C CNN
F 1 "GND" H 13355 11077 50  0000 C CNN
F 2 "" H 13350 11250 50  0001 C CNN
F 3 "" H 13350 11250 50  0001 C CNN
	1    13350 11250
	1    0    0    -1  
$EndComp
Wire Wire Line
	14100 11250 14100 11150
Wire Wire Line
	13350 11250 13350 11150
Wire Wire Line
	18700 6150 18700 12000
Wire Wire Line
	15100 7400 19100 7400
Wire Wire Line
	19100 7400 19100 11700
Connection ~ 19100 7400
$Comp
L Device:Q_NPN_BCE Q?
U 1 1 5F891A5A
P 16350 3950
F 0 "Q?" H 16541 3904 50  0000 L CNN
F 1 "Q_NPN_BCE" H 16541 3995 50  0000 L CNN
F 2 "" H 16550 4050 50  0001 C CNN
F 3 "~" H 16350 3950 50  0001 C CNN
	1    16350 3950
	1    0    0    1   
$EndComp
$Comp
L Device:D_Zener D?
U 1 1 5F89EDC4
P 16450 3600
F 0 "D?" V 16404 3679 50  0000 L CNN
F 1 "D_Zener" V 16495 3679 50  0000 L CNN
F 2 "" H 16450 3600 50  0001 C CNN
F 3 "~" H 16450 3600 50  0001 C CNN
	1    16450 3600
	0    1    1    0   
$EndComp
$Comp
L Device:R R43
U 1 1 5F8A0728
P 16000 3950
F 0 "R43" V 15793 3950 50  0000 C CNN
F 1 "47K" V 15884 3950 50  0000 C CNN
F 2 "" V 15930 3950 50  0001 C CNN
F 3 "~" H 16000 3950 50  0001 C CNN
	1    16000 3950
	0    1    1    0   
$EndComp
$Comp
L power:GND #PWR?
U 1 1 5F8A2DBC
P 15850 3950
F 0 "#PWR?" H 15850 3700 50  0001 C CNN
F 1 "GND" V 15855 3822 50  0000 R CNN
F 2 "" H 15850 3950 50  0001 C CNN
F 3 "" H 15850 3950 50  0001 C CNN
	1    15850 3950
	0    1    1    0   
$EndComp
Wire Wire Line
	17700 4200 17700 3350
Wire Wire Line
	16450 3350 16450 3450
Wire Wire Line
	17700 4950 16500 4950
Connection ~ 16500 4950
Wire Wire Line
	16000 4950 15100 4950
Connection ~ 16000 4950
Wire Wire Line
	14100 4450 16450 4450
Wire Wire Line
	17700 3350 16450 3350
Connection ~ 16450 3350
Wire Wire Line
	16450 4150 16450 4450
Connection ~ 16450 4450
Wire Wire Line
	16450 4450 17400 4450
Wire Wire Line
	15100 6400 15100 4950
Connection ~ 15100 6400
$Comp
L Device:L L?
U 1 1 5F93D806
P 13500 3350
F 0 "L?" V 13319 3350 50  0000 C CNN
F 1 "L" V 13410 3350 50  0000 C CNN
F 2 "" H 13500 3350 50  0001 C CNN
F 3 "~" H 13500 3350 50  0001 C CNN
	1    13500 3350
	0    1    1    0   
$EndComp
Wire Wire Line
	13650 3350 16450 3350
$Comp
L Device:C C?
U 1 1 5F94C304
P 12950 3500
F 0 "C?" H 13065 3546 50  0000 L CNN
F 1 "C" H 13065 3455 50  0000 L CNN
F 2 "" H 12988 3350 50  0001 C CNN
F 3 "~" H 12950 3500 50  0001 C CNN
	1    12950 3500
	1    0    0    -1  
$EndComp
$Comp
L power:GNDPWR #PWR?
U 1 1 5F94CBCC
P 12950 3650
F 0 "#PWR?" H 12950 3450 50  0001 C CNN
F 1 "GNDPWR" H 12954 3496 50  0000 C CNN
F 2 "" H 12950 3600 50  0001 C CNN
F 3 "" H 12950 3600 50  0001 C CNN
	1    12950 3650
	1    0    0    -1  
$EndComp
Wire Wire Line
	13350 3350 12950 3350
Wire Wire Line
	11900 6550 11900 5750
Wire Wire Line
	11900 5750 12050 5750
$Comp
L Device:C C20
U 1 1 5F975787
P 12050 5900
F 0 "C20" H 11935 5854 50  0000 R CNN
F 1 "2,2uF/50V" H 11935 5945 50  0000 R CNN
F 2 "" H 12088 5750 50  0001 C CNN
F 3 "~" H 12050 5900 50  0001 C CNN
	1    12050 5900
	-1   0    0    1   
$EndComp
$Comp
L power:GND #PWR?
U 1 1 5F97617C
P 12050 6050
F 0 "#PWR?" H 12050 5800 50  0001 C CNN
F 1 "GND" H 12055 5877 50  0000 C CNN
F 2 "" H 12050 6050 50  0001 C CNN
F 3 "" H 12050 6050 50  0001 C CNN
	1    12050 6050
	1    0    0    -1  
$EndComp
Wire Wire Line
	12300 4450 11700 4450
Wire Wire Line
	11700 4450 11700 4850
Connection ~ 12300 4450
$Comp
L Device:R R22
U 1 1 5F9862D6
P 11700 5000
F 0 "R22" H 11770 5046 50  0000 L CNN
F 1 "1R" H 11770 4955 50  0000 L CNN
F 2 "" V 11630 5000 50  0001 C CNN
F 3 "~" H 11700 5000 50  0001 C CNN
	1    11700 5000
	1    0    0    -1  
$EndComp
Wire Wire Line
	11700 6550 11700 5500
Wire Wire Line
	11700 5500 11300 5500
Connection ~ 11700 5500
Wire Wire Line
	11700 5500 11700 5150
$Comp
L Device:C C19
U 1 1 5F9A115D
P 10850 5650
F 0 "C19" H 10735 5604 50  0000 R CNN
F 1 "100n" H 10735 5695 50  0000 R CNN
F 2 "" H 10888 5500 50  0001 C CNN
F 3 "~" H 10850 5650 50  0001 C CNN
	1    10850 5650
	-1   0    0    1   
$EndComp
$Comp
L Device:C C18
U 1 1 5F9A1827
P 11300 5650
F 0 "C18" H 11185 5604 50  0000 R CNN
F 1 "2,2uF/50V" H 11185 5695 50  0000 R CNN
F 2 "" H 11338 5500 50  0001 C CNN
F 3 "~" H 11300 5650 50  0001 C CNN
	1    11300 5650
	-1   0    0    1   
$EndComp
Connection ~ 11300 5500
Wire Wire Line
	10850 5500 11300 5500
$Comp
L power:GND #PWR?
U 1 1 5F9AFBF7
P 10850 5800
F 0 "#PWR?" H 10850 5550 50  0001 C CNN
F 1 "GND" H 10855 5627 50  0000 C CNN
F 2 "" H 10850 5800 50  0001 C CNN
F 3 "" H 10850 5800 50  0001 C CNN
	1    10850 5800
	1    0    0    -1  
$EndComp
$Comp
L power:GND #PWR?
U 1 1 5F9AFFF4
P 11300 5800
F 0 "#PWR?" H 11300 5550 50  0001 C CNN
F 1 "GND" H 11305 5627 50  0000 C CNN
F 2 "" H 11300 5800 50  0001 C CNN
F 3 "" H 11300 5800 50  0001 C CNN
	1    11300 5800
	1    0    0    -1  
$EndComp
$Comp
L Connector:Conn_01x02_Female JP1
U 1 1 5F9E0E2D
P 10550 7050
F 0 "JP1" V 10488 6862 50  0000 R CNN
F 1 "Conn_01x02_Female" V 10250 7150 50  0001 R CNN
F 2 "" H 10550 7050 50  0001 C CNN
F 3 "~" H 10550 7050 50  0001 C CNN
	1    10550 7050
	0    -1   -1   0   
$EndComp
Wire Wire Line
	11450 7250 10650 7250
$Comp
L Device:R_POT_US R20
U 1 1 5F9F0C36
P 9900 7250
F 0 "R20" H 9833 7296 50  0000 R CNN
F 1 "100K" H 10150 7100 50  0000 R CNN
F 2 "" H 9900 7250 50  0001 C CNN
F 3 "~" H 9900 7250 50  0001 C CNN
	1    9900 7250
	1    0    0    -1  
$EndComp
$Comp
L Device:R R?
U 1 1 5FA0C364
P 9900 6450
F 0 "R?" H 9970 6496 50  0000 L CNN
F 1 "R" H 9970 6405 50  0000 L CNN
F 2 "" V 9830 6450 50  0001 C CNN
F 3 "~" H 9900 6450 50  0001 C CNN
	1    9900 6450
	1    0    0    -1  
$EndComp
$Comp
L power:GND #PWR?
U 1 1 5FA0CB12
P 9900 7400
F 0 "#PWR?" H 9900 7150 50  0001 C CNN
F 1 "GND" H 9905 7227 50  0000 C CNN
F 2 "" H 9900 7400 50  0001 C CNN
F 3 "" H 9900 7400 50  0001 C CNN
	1    9900 7400
	1    0    0    -1  
$EndComp
$Comp
L power:+5V #PWR?
U 1 1 5FA0D804
P 9900 6300
F 0 "#PWR?" H 9900 6150 50  0001 C CNN
F 1 "+5V" H 9915 6473 50  0000 C CNN
F 2 "" H 9900 6300 50  0001 C CNN
F 3 "" H 9900 6300 50  0001 C CNN
	1    9900 6300
	1    0    0    -1  
$EndComp
Connection ~ 9900 6300
Wire Wire Line
	9150 6300 9900 6300
Wire Wire Line
	9150 6300 9150 6650
$Comp
L Device:R R38
U 1 1 5FA38421
P 9150 6800
F 0 "R38" H 9220 6846 50  0000 L CNN
F 1 "2k7" H 9220 6755 50  0000 L CNN
F 2 "" V 9080 6800 50  0001 C CNN
F 3 "~" H 9150 6800 50  0001 C CNN
	1    9150 6800
	1    0    0    -1  
$EndComp
Wire Wire Line
	9150 6950 9150 7100
$Comp
L Device:LED ERR
U 1 1 5FA4733D
P 9150 7250
F 0 "ERR" V 9189 7132 50  0000 R CNN
F 1 "LED" V 9098 7132 50  0000 R CNN
F 2 "" H 9150 7250 50  0001 C CNN
F 3 "~" H 9150 7250 50  0001 C CNN
	1    9150 7250
	0    -1   -1   0   
$EndComp
Wire Wire Line
	11450 7650 9150 7650
Wire Wire Line
	9900 6600 9900 7100
Wire Wire Line
	10050 7250 10550 7250
Wire Wire Line
	8850 7800 8850 7000
Wire Wire Line
	8850 6850 8650 6850
$Comp
L Connector:Conn_01x02_Female JP5
U 1 1 5FABA88A
P 8550 6650
F 0 "JP5" V 8488 6462 50  0000 R CNN
F 1 "Conn_01x02_Female" V 8300 6950 50  0001 R CNN
F 2 "" H 8550 6650 50  0001 C CNN
F 3 "~" H 8550 6650 50  0001 C CNN
	1    8550 6650
	0    -1   -1   0   
$EndComp
Wire Wire Line
	8550 6850 8000 6850
Wire Wire Line
	8000 6850 8000 6750
$Comp
L Device:R R24
U 1 1 5FACD00A
P 8000 6600
F 0 "R24" H 8070 6646 50  0000 L CNN
F 1 "1K" H 8070 6555 50  0000 L CNN
F 2 "" V 7930 6600 50  0001 C CNN
F 3 "~" H 8000 6600 50  0001 C CNN
	1    8000 6600
	1    0    0    -1  
$EndComp
$Comp
L power:+5V #PWR?
U 1 1 5FACD65D
P 8000 6450
F 0 "#PWR?" H 8000 6300 50  0001 C CNN
F 1 "+5V" H 8015 6623 50  0000 C CNN
F 2 "" H 8000 6450 50  0001 C CNN
F 3 "" H 8000 6450 50  0001 C CNN
	1    8000 6450
	1    0    0    -1  
$EndComp
$Comp
L Device:R R23
U 1 1 5FADD4BE
P 7400 7000
F 0 "R23" V 7193 7000 50  0000 C CNN
F 1 "22K" V 7284 7000 50  0000 C CNN
F 2 "" V 7330 7000 50  0001 C CNN
F 3 "~" H 7400 7000 50  0001 C CNN
	1    7400 7000
	0    1    1    0   
$EndComp
Wire Wire Line
	7550 7000 8850 7000
Connection ~ 8850 7000
Wire Wire Line
	8850 7000 8850 6850
$Comp
L Switch:SW_Push RESET
U 1 1 5FB2E0ED
P 9550 9350
F 0 "RESET" V 9504 9498 50  0000 L CNN
F 1 "SW_Push" V 9595 9498 50  0000 L CNN
F 2 "" H 9550 9550 50  0001 C CNN
F 3 "~" H 9550 9550 50  0001 C CNN
	1    9550 9350
	0    1    1    0   
$EndComp
$Comp
L power:GND #PWR?
U 1 1 5FB2F470
P 9550 9550
F 0 "#PWR?" H 9550 9300 50  0001 C CNN
F 1 "GND" H 9555 9377 50  0000 C CNN
F 2 "" H 9550 9550 50  0001 C CNN
F 3 "" H 9550 9550 50  0001 C CNN
	1    9550 9550
	1    0    0    -1  
$EndComp
Wire Wire Line
	11450 8400 11200 8400
Wire Wire Line
	11200 8400 11200 8800
Wire Wire Line
	11200 8800 10200 8800
$Comp
L Connector:Conn_01x02_Female JP3
U 1 1 5FB8CCE7
P 8600 7100
F 0 "JP3" V 8500 7350 50  0000 R CNN
F 1 "Conn_01x02_Female" V 8700 7450 50  0001 R CNN
F 2 "" H 8600 7100 50  0001 C CNN
F 3 "~" H 8600 7100 50  0001 C CNN
	1    8600 7100
	0    -1   -1   0   
$EndComp
$Comp
L power:GND #PWR?
U 1 1 5FB8D6E3
P 8700 7300
F 0 "#PWR?" H 8700 7050 50  0001 C CNN
F 1 "GND" H 8705 7127 50  0000 C CNN
F 2 "" H 8700 7300 50  0001 C CNN
F 3 "" H 8700 7300 50  0001 C CNN
	1    8700 7300
	1    0    0    -1  
$EndComp
$Comp
L Connector:Conn_01x02_Female JP2
U 1 1 5FBB55BA
P 10200 8400
F 0 "JP2" V 10138 8212 50  0000 R CNN
F 1 "Conn_01x02_Female" V 10300 8750 50  0001 R CNN
F 2 "" H 10200 8400 50  0001 C CNN
F 3 "~" H 10200 8400 50  0001 C CNN
	1    10200 8400
	0    -1   -1   0   
$EndComp
$Comp
L Connector:Conn_01x02_Female JP4
U 1 1 5FBE4798
P 8900 8400
F 0 "JP4" V 8838 8212 50  0000 R CNN
F 1 "Conn_01x02_Female" V 9000 8750 50  0001 R CNN
F 2 "" H 8900 8400 50  0001 C CNN
F 3 "~" H 8900 8400 50  0001 C CNN
	1    8900 8400
	0    -1   -1   0   
$EndComp
$Comp
L power:+5V #PWR?
U 1 1 5FBE4D61
P 10300 8900
F 0 "#PWR?" H 10300 8750 50  0001 C CNN
F 1 "+5V" H 10315 9073 50  0000 C CNN
F 2 "" H 10300 8900 50  0001 C CNN
F 3 "" H 10300 8900 50  0001 C CNN
	1    10300 8900
	-1   0    0    1   
$EndComp
$Comp
L power:GND #PWR?
U 1 1 5FBF8322
P 9000 8950
F 0 "#PWR?" H 9000 8700 50  0001 C CNN
F 1 "GND" H 9005 8777 50  0000 C CNN
F 2 "" H 9000 8950 50  0001 C CNN
F 3 "" H 9000 8950 50  0001 C CNN
	1    9000 8950
	1    0    0    -1  
$EndComp
$Comp
L Device:R_POT_US R25
U 1 1 5FBFAB75
P 8200 9250
F 0 "R25" H 8133 9296 50  0000 R CNN
F 1 "50K" H 8100 9200 50  0000 R CNN
F 2 "" H 8200 9250 50  0001 C CNN
F 3 "~" H 8200 9250 50  0001 C CNN
	1    8200 9250
	1    0    0    -1  
$EndComp
Wire Wire Line
	8350 9250 8450 9250
Wire Wire Line
	8450 9250 8450 8950
Wire Wire Line
	8450 8950 8200 8950
Wire Wire Line
	8200 8950 8200 9100
$Comp
L power:GND #PWR?
U 1 1 5FC22669
P 8200 9400
F 0 "#PWR?" H 8200 9150 50  0001 C CNN
F 1 "GND" H 8205 9227 50  0000 C CNN
F 2 "" H 8200 9400 50  0001 C CNN
F 3 "" H 8200 9400 50  0001 C CNN
	1    8200 9400
	1    0    0    -1  
$EndComp
$Comp
L Device:R_POT_US R31
U 1 1 5F2E974D
P 8200 8500
F 0 "R31" H 8133 8546 50  0000 R CNN
F 1 "200K" H 8100 8450 50  0000 R CNN
F 2 "" H 8200 8500 50  0001 C CNN
F 3 "~" H 8200 8500 50  0001 C CNN
	1    8200 8500
	1    0    0    -1  
$EndComp
Wire Wire Line
	8200 8350 8350 8350
Wire Wire Line
	8350 8350 8350 8500
$Comp
L Jumper:SolderJumper_3_Open SJ4
U 1 1 5F341FEA
P 7500 8800
F 0 "SJ4" V 7500 8867 50  0000 L CNN
F 1 "SolderJumper_3_Open" V 7455 8867 50  0001 L CNN
F 2 "" H 7500 8800 50  0001 C CNN
F 3 "~" H 7500 8800 50  0001 C CNN
	1    7500 8800
	0    -1   -1   0   
$EndComp
$Comp
L Jumper:SolderJumper_3_Open SJ3
U 1 1 5F377E7C
P 7700 8250
F 0 "SJ3" V 7700 8317 50  0000 L CNN
F 1 "SolderJumper_3_Open" V 7655 8317 50  0001 L CNN
F 2 "" H 7700 8250 50  0001 C CNN
F 3 "~" H 7700 8250 50  0001 C CNN
	1    7700 8250
	0    -1   -1   0   
$EndComp
$Comp
L Jumper:SolderJumper_3_Open SJ2
U 1 1 5F378EFF
P 8200 7950
F 0 "SJ2" V 8200 8017 50  0000 L CNN
F 1 "SolderJumper_3_Open" V 8245 8017 50  0001 L CNN
F 2 "" H 8200 7950 50  0001 C CNN
F 3 "~" H 8200 7950 50  0001 C CNN
	1    8200 7950
	0    -1   1    0   
$EndComp
$Comp
L tle7182em:TLE7182EM U3
U 1 1 5F26DA69
P 11900 7750
F 0 "U3" H 12100 6600 50  0000 C CNN
F 1 "TLE7182EM" V 11900 8050 50  0000 C CNN
F 2 "Package_SO:SSOP-24_3.9x8.7mm_P0.635mm" H 11900 8050 50  0001 C CNN
F 3 "" H 11900 8050 50  0001 C CNN
	1    11900 7750
	1    0    0    -1  
$EndComp
Wire Wire Line
	8200 8650 8200 8950
Connection ~ 8200 8950
Wire Wire Line
	8450 8100 8450 7950
Wire Wire Line
	8450 7950 8350 7950
Wire Wire Line
	8200 8150 8200 8350
Connection ~ 8200 8350
Wire Wire Line
	7500 8600 7500 7300
Wire Wire Line
	7500 7300 7150 7300
Wire Wire Line
	8600 8600 8600 8500
Wire Wire Line
	8600 8500 8350 8500
Connection ~ 8350 8500
Wire Wire Line
	9000 8600 9000 8950
Wire Wire Line
	10300 8600 10300 8900
Wire Wire Line
	10200 8600 10200 8800
Connection ~ 10200 8800
Wire Wire Line
	7650 8800 10200 8800
Wire Wire Line
	8900 8600 8600 8600
Wire Wire Line
	8850 7800 9550 7800
Wire Wire Line
	9550 7800 9550 9150
Connection ~ 9550 7800
Wire Wire Line
	7700 8050 7700 7700
Wire Wire Line
	7950 7900 7950 7750
Wire Wire Line
	7950 7750 8200 7750
Wire Wire Line
	7300 7400 7300 8100
Wire Wire Line
	7700 8450 7300 8450
Wire Wire Line
	7300 8450 7300 8350
$Comp
L Device:R R35
U 1 1 5F6D1824
P 7000 7300
F 0 "R35" V 6900 7300 50  0000 C CNN
F 1 "10K" V 6950 7500 50  0000 C CNN
F 2 "" V 6930 7300 50  0001 C CNN
F 3 "~" H 7000 7300 50  0001 C CNN
	1    7000 7300
	0    1    1    0   
$EndComp
Wire Wire Line
	7700 7700 7150 7700
$Comp
L Device:R R27
U 1 1 5F6D7238
P 7000 7500
F 0 "R27" V 6900 7500 50  0000 C CNN
F 1 "10K" V 6950 7700 50  0000 C CNN
F 2 "" V 6930 7500 50  0001 C CNN
F 3 "~" H 7000 7500 50  0001 C CNN
	1    7000 7500
	0    1    1    0   
$EndComp
$Comp
L Device:R R32
U 1 1 5F6D7659
P 7000 7700
F 0 "R32" V 6900 7700 50  0000 C CNN
F 1 "10K" V 6950 7900 50  0000 C CNN
F 2 "" V 6930 7700 50  0001 C CNN
F 3 "~" H 7000 7700 50  0001 C CNN
	1    7000 7700
	0    1    1    0   
$EndComp
$Comp
L Device:R R30
U 1 1 5F6D7AEE
P 7000 7900
F 0 "R30" V 6900 7900 50  0000 C CNN
F 1 "10K" V 6950 8100 50  0000 C CNN
F 2 "" V 6930 7900 50  0001 C CNN
F 3 "~" H 7000 7900 50  0001 C CNN
	1    7000 7900
	0    1    1    0   
$EndComp
Wire Wire Line
	7150 7900 7950 7900
$Comp
L Device:R R29
U 1 1 5F6D7F31
P 7000 8100
F 0 "R29" V 6900 8100 50  0000 C CNN
F 1 "10K" V 6950 8300 50  0000 C CNN
F 2 "" V 6930 8100 50  0001 C CNN
F 3 "~" H 7000 8100 50  0001 C CNN
	1    7000 8100
	0    1    1    0   
$EndComp
Wire Wire Line
	7150 8100 7300 8100
Wire Wire Line
	7150 8350 7300 8350
$Comp
L Device:R R34
U 1 1 5F6D82E2
P 7000 8350
F 0 "R34" V 6900 8350 50  0000 C CNN
F 1 "10K" V 6950 8550 50  0000 C CNN
F 2 "" V 6930 8350 50  0001 C CNN
F 3 "~" H 7000 8350 50  0001 C CNN
	1    7000 8350
	0    1    1    0   
$EndComp
Wire Wire Line
	7250 9000 7500 9000
Wire Wire Line
	7250 8650 7250 9000
Wire Wire Line
	7150 8650 7250 8650
$Comp
L Device:R R36
U 1 1 5F6F247F
P 7000 8650
F 0 "R36" V 6900 8650 50  0000 C CNN
F 1 "10K" V 6950 8850 50  0000 C CNN
F 2 "" V 6930 8650 50  0001 C CNN
F 3 "~" H 7000 8650 50  0001 C CNN
	1    7000 8650
	0    1    1    0   
$EndComp
$Comp
L power:GND #PWR?
U 1 1 5F7CAA3B
P 6800 10100
F 0 "#PWR?" H 6800 9850 50  0001 C CNN
F 1 "GND" H 6805 9927 50  0000 C CNN
F 2 "" H 6800 10100 50  0001 C CNN
F 3 "" H 6800 10100 50  0001 C CNN
	1    6800 10100
	0    -1   -1   0   
$EndComp
$Comp
L power:GND #PWR?
U 1 1 5F7CA61C
P 6800 9700
F 0 "#PWR?" H 6800 9450 50  0001 C CNN
F 1 "GND" H 6805 9527 50  0000 C CNN
F 2 "" H 6800 9700 50  0001 C CNN
F 3 "" H 6800 9700 50  0001 C CNN
	1    6800 9700
	0    -1   -1   0   
$EndComp
$Comp
L Device:R R41
U 1 1 5F7AA4D5
P 6650 10100
F 0 "R41" V 6550 9950 50  0000 C CNN
F 1 "5,1K" V 6550 10200 50  0000 C CNN
F 2 "" V 6580 10100 50  0001 C CNN
F 3 "~" H 6650 10100 50  0001 C CNN
	1    6650 10100
	0    1    1    0   
$EndComp
$Comp
L Device:C C23
U 1 1 5F7A8829
P 6650 9700
F 0 "C23" V 6550 9550 50  0000 C CNN
F 1 "22n" V 6550 9850 50  0000 C CNN
F 2 "" H 6688 9550 50  0001 C CNN
F 3 "~" H 6650 9700 50  0001 C CNN
	1    6650 9700
	0    1    1    0   
$EndComp
Wire Wire Line
	6250 7500 6250 7400
Wire Wire Line
	6250 7500 6850 7500
Wire Wire Line
	6050 7700 6050 7600
Wire Wire Line
	6050 7700 6850 7700
Wire Wire Line
	5950 7900 5950 7700
Wire Wire Line
	5950 7900 6850 7900
Wire Wire Line
	5850 8100 5850 7800
Wire Wire Line
	5850 8100 6850 8100
Wire Wire Line
	5750 7900 5750 8350
Wire Wire Line
	5750 8350 6850 8350
Wire Wire Line
	5650 8000 5650 8650
Wire Wire Line
	5650 8650 6850 8650
Wire Wire Line
	5550 9000 5550 8300
Wire Wire Line
	6500 9700 5450 9700
Wire Wire Line
	5450 9700 5450 8400
Text Label 6550 8650 0    50   ~ 0
IL1
Text Label 6550 8350 0    50   ~ 0
IH1
Text Label 6550 8100 0    50   ~ 0
IL2
Text Label 6550 7900 0    50   ~ 0
IH2
Text Label 6550 7700 0    50   ~ 0
PWM
Text Label 6550 7500 0    50   ~ 0
ERR
Text Label 6550 7300 0    50   ~ 0
DRV
$Comp
L power:GND #PWR?
U 1 1 5F7CA13E
P 6800 9350
F 0 "#PWR?" H 6800 9100 50  0001 C CNN
F 1 "GND" H 6805 9177 50  0000 C CNN
F 2 "" H 6800 9350 50  0001 C CNN
F 3 "" H 6800 9350 50  0001 C CNN
	1    6800 9350
	0    -1   -1   0   
$EndComp
$Comp
L power:GND #PWR?
U 1 1 5F7C9B05
P 6800 9000
F 0 "#PWR?" H 6800 8750 50  0001 C CNN
F 1 "GND" H 6805 8827 50  0000 C CNN
F 2 "" H 6800 9000 50  0001 C CNN
F 3 "" H 6800 9000 50  0001 C CNN
	1    6800 9000
	0    -1   -1   0   
$EndComp
$Comp
L Device:R R40
U 1 1 5F7A6341
P 6650 9350
F 0 "R40" V 6550 9200 50  0000 C CNN
F 1 "5,1K" V 6550 9450 50  0000 C CNN
F 2 "" V 6580 9350 50  0001 C CNN
F 3 "~" H 6650 9350 50  0001 C CNN
	1    6650 9350
	0    1    1    0   
$EndComp
$Comp
L Device:C C22
U 1 1 5F7A578B
P 6650 9000
F 0 "C22" V 6550 8850 50  0000 C CNN
F 1 "22n" V 6550 9150 50  0000 C CNN
F 2 "" H 6688 8850 50  0001 C CNN
F 3 "~" H 6650 9000 50  0001 C CNN
	1    6650 9000
	0    1    1    0   
$EndComp
$Comp
L Connector:Conn_01x16_Female FAB32Q2_B
U 1 1 5F9C0EB4
P 4800 8000
F 0 "FAB32Q2_B" H 4692 8885 50  0000 C CNN
F 1 "Conn_01x16_Female" H 4692 8794 50  0001 C CNN
F 2 "" H 4800 8000 50  0001 C CNN
F 3 "~" H 4800 8000 50  0001 C CNN
	1    4800 8000
	-1   0    0    -1  
$EndComp
Wire Wire Line
	6500 9000 6250 9000
Wire Wire Line
	6250 9000 6250 9350
Connection ~ 6250 9000
Wire Wire Line
	6250 9000 5550 9000
Wire Wire Line
	6500 9350 6250 9350
Connection ~ 6250 9350
Wire Wire Line
	6500 10100 5450 10100
Wire Wire Line
	5450 10100 5450 9700
Connection ~ 5450 9700
Connection ~ 5450 10100
$Comp
L power:+5V #PWR?
U 1 1 5FB0AA69
P 5200 8800
F 0 "#PWR?" H 5200 8650 50  0001 C CNN
F 1 "+5V" H 5215 8973 50  0000 C CNN
F 2 "" H 5200 8800 50  0001 C CNN
F 3 "" H 5200 8800 50  0001 C CNN
	1    5200 8800
	1    0    0    -1  
$EndComp
$Comp
L Device:C C21
U 1 1 5FB0B39F
P 5200 9100
F 0 "C21" H 5400 9050 50  0000 C CNN
F 1 "100n" H 5400 9150 50  0000 C CNN
F 2 "" H 5238 8950 50  0001 C CNN
F 3 "~" H 5200 9100 50  0001 C CNN
	1    5200 9100
	-1   0    0    1   
$EndComp
$Comp
L power:GND #PWR?
U 1 1 5FB0B909
P 5200 9400
F 0 "#PWR?" H 5200 9150 50  0001 C CNN
F 1 "GND" H 5205 9227 50  0000 C CNN
F 2 "" H 5200 9400 50  0001 C CNN
F 3 "" H 5200 9400 50  0001 C CNN
	1    5200 9400
	1    0    0    -1  
$EndComp
Wire Wire Line
	5000 8800 5200 8800
Wire Wire Line
	5200 8800 5200 8950
Connection ~ 5200 8800
Wire Wire Line
	5200 9250 5200 9400
Wire Wire Line
	5000 8400 5450 8400
Wire Wire Line
	5000 8300 5550 8300
Wire Wire Line
	5000 8000 5650 8000
Wire Wire Line
	5000 7900 5750 7900
Wire Wire Line
	5000 7800 5850 7800
Wire Wire Line
	5000 7700 5950 7700
Wire Wire Line
	5000 7600 6050 7600
Wire Wire Line
	5000 7400 6250 7400
Wire Wire Line
	5000 7300 6850 7300
Wire Wire Line
	3750 7000 3750 7500
Wire Wire Line
	3750 7000 7250 7000
$Comp
L Connector:Conn_01x16_Female FAB32Q2_A
U 1 1 5FCB8D30
P 2750 8200
F 0 "FAB32Q2_A" H 2642 8993 50  0000 C CNN
F 1 "Conn_01x16_Female" H 2642 8994 50  0001 C CNN
F 2 "" H 2750 8200 50  0001 C CNN
F 3 "~" H 2750 8200 50  0001 C CNN
	1    2750 8200
	-1   0    0    -1  
$EndComp
Wire Wire Line
	2950 7500 3750 7500
$Comp
L power:GND #PWR?
U 1 1 5FD86C1D
P 3200 9000
F 0 "#PWR?" H 3200 8750 50  0001 C CNN
F 1 "GND" H 3205 8827 50  0000 C CNN
F 2 "" H 3200 9000 50  0001 C CNN
F 3 "" H 3200 9000 50  0001 C CNN
	1    3200 9000
	1    0    0    -1  
$EndComp
Wire Wire Line
	3200 9000 2950 9000
Wire Wire Line
	3750 8300 2950 8300
Wire Wire Line
	6250 11700 6550 11700
Wire Wire Line
	6250 9350 6250 11700
Wire Wire Line
	5450 10100 5450 12000
Wire Wire Line
	5450 12000 6550 12000
$Comp
L Device:R R39
U 1 1 5FE6FA10
P 6700 11700
F 0 "R39" V 6600 11550 50  0000 C CNN
F 1 "47K" V 6600 11800 50  0000 C CNN
F 2 "" V 6630 11700 50  0001 C CNN
F 3 "~" H 6700 11700 50  0001 C CNN
	1    6700 11700
	0    1    1    0   
$EndComp
Wire Wire Line
	6850 11700 19100 11700
$Comp
L Device:R R42
U 1 1 5FE70263
P 6700 12000
F 0 "R42" V 6600 11850 50  0000 C CNN
F 1 "47K" V 6600 12100 50  0000 C CNN
F 2 "" V 6630 12000 50  0001 C CNN
F 3 "~" H 6700 12000 50  0001 C CNN
	1    6700 12000
	0    1    1    0   
$EndComp
Wire Wire Line
	6850 12000 18700 12000
Text Label 7050 11700 0    50   ~ 0
OUT2
Text Label 7050 12000 0    50   ~ 0
OUT1
Text Label 7000 10600 0    50   ~ 0
ISO*
Text Label 3350 8300 0    50   ~ 0
ISO*
Text Label 3300 7500 0    50   ~ 0
ISO*
Text Notes 8950 5000 0    50   ~ 0
ADD 5V REG HERE
$Comp
L Connector:Conn_01x05_Female GMSTBA5
U 1 1 5FEBECD0
P 10000 3550
F 0 "GMSTBA5" H 9892 3843 50  0000 C CNN
F 1 "Conn_01x05_Female" H 9892 3844 50  0001 C CNN
F 2 "" H 10000 3550 50  0001 C CNN
F 3 "~" H 10000 3550 50  0001 C CNN
	1    10000 3550
	-1   0    0    -1  
$EndComp
Wire Wire Line
	12950 3350 10350 3350
Connection ~ 12950 3350
Wire Wire Line
	10200 3450 10350 3450
Wire Wire Line
	10350 3450 10350 3350
Connection ~ 10350 3350
Wire Wire Line
	10350 3350 10200 3350
Wire Wire Line
	10200 3550 10350 3550
Wire Wire Line
	10350 3550 10350 3650
Wire Wire Line
	10200 3650 10350 3650
Connection ~ 10350 3650
Wire Wire Line
	10350 3650 10350 3750
Wire Wire Line
	10200 3750 10350 3750
Connection ~ 10350 3750
Wire Wire Line
	10350 3750 10350 3950
$Comp
L power:GNDPWR #PWR?
U 1 1 5FF7B440
P 10350 3950
F 0 "#PWR?" H 10350 3750 50  0001 C CNN
F 1 "GNDPWR" H 10354 3796 50  0000 C CNN
F 2 "" H 10350 3900 50  0001 C CNN
F 3 "" H 10350 3900 50  0001 C CNN
	1    10350 3950
	1    0    0    -1  
$EndComp
Connection ~ 15100 4950
Wire Wire Line
	15100 4950 14100 4950
Wire Wire Line
	15100 4950 15100 4000
Wire Wire Line
	10950 4000 10950 4950
Wire Wire Line
	10950 4950 9750 4950
Wire Wire Line
	10950 4000 15100 4000
Wire Notes Line
	9750 4800 9750 5150
Wire Notes Line
	9750 5150 8850 5150
Wire Wire Line
	9550 7800 11450 7800
Wire Wire Line
	11450 8100 8450 8100
Wire Wire Line
	8600 7300 8600 7400
Wire Wire Line
	8600 7950 11450 7950
Wire Wire Line
	7300 7400 8600 7400
Connection ~ 8600 7400
Wire Wire Line
	8600 7400 8600 7950
Wire Wire Line
	9150 7400 9150 7650
Wire Wire Line
	9150 7650 7900 7650
Wire Wire Line
	7900 7650 7900 7500
Connection ~ 9150 7650
Wire Wire Line
	7150 7500 7900 7500
Wire Wire Line
	7850 8250 11450 8250
Text Label 19600 6150 0    50   ~ 0
OUT1
Text Label 19600 7400 0    50   ~ 0
OUT2
Wire Wire Line
	20050 6150 20050 6500
Wire Wire Line
	20050 7400 20050 7000
Wire Wire Line
	19100 7400 20050 7400
Wire Wire Line
	18700 6150 20050 6150
$Comp
L Device:R R17
U 1 1 5F792E9E
P 13700 10600
F 0 "R17" V 13600 10600 50  0000 C CNN
F 1 "1K" V 13800 10600 50  0000 C CNN
F 2 "" V 13630 10600 50  0001 C CNN
F 3 "~" H 13700 10600 50  0001 C CNN
	1    13700 10600
	0    1    1    0   
$EndComp
Wire Wire Line
	14100 10600 13850 10600
Connection ~ 13350 10600
Wire Wire Line
	13350 10600 13350 10850
Wire Wire Line
	13350 10600 3750 10600
Wire Wire Line
	3750 8300 3750 10600
Wire Wire Line
	13550 10600 13350 10600
Wire Wire Line
	14100 9400 14100 10600
$EndSCHEMATC
