// Jest Snapshot v1, https://goo.gl/fbAQLP

exports[`Themes don't change 1`] = `"Study"`;

exports[`Themes don't change 2`] = `"Weather"`;

exports[`Themes don't change 3`] = `"Clothes"`;

exports[`Themes don't change 4`] = `"Food"`;

exports[`Themes don't change 5`] = `"Animals"`;
