[gd_resource type="DynamicFont" load_steps=2 format=2]

[ext_resource path="res://fonts/AstralSisters.ttf" type="DynamicFontData" id=1]

[resource]
size = 28
extra_spacing_top = 10
extra_spacing_bottom = 4
font_data = ExtResource( 1 )
