[gd_scene load_steps=3 format=2]

[ext_resource path="res://scripts/card/ResourceCard.gd" type="Script" id=1]
[ext_resource path="res://objects/Card.tscn" type="PackedScene" id=2]

[node name="Wood" type="Node2D"]
script = ExtResource( 1 )
card_name = "wood"
label = "Wood"
sell_value = 1

[node name="Card" parent="." instance=ExtResource( 2 )]
