var color1 = #ff0;
var color2 = #00ff00;

var a = 1;
var b = 2;

newline();

color(color1);
line: 20;

next_x();
next_y();

color(color2);
line: 20;

newlines(5);

color(color1);
line: 20;

move_y:3;
move_x: 3;

color(color2);
line: 20;

