%YAML 1.1
%TAG !u! tag:unity3d.com,2011:
--- !u!1045 &1
EditorBuildSettings:
  m_ObjectHideFlags: 0
  serializedVersion: 2
  m_Scenes:
  - enabled: 1
    path: Assets/Scenes/_preload.unity
    guid: 7d11708396626a8499439c4fc5a1f4ba
  - enabled: 1
    path: Assets/Scenes/MainMenu.unity
    guid: 2cda990e2423bbf4892e6590ba056729
  - enabled: 1
    path: Assets/Scenes/Level/Level1.unity
    guid: fd770534188b59b40820b5d0d7c159c5
  - enabled: 1
    path: Assets/Scenes/Level/Level2.unity
    guid: 3a5b3574dbe548440bf87415c540454f
  - enabled: 1
    path: Assets/Scenes/Level/Level3.unity
    guid: d56c47c1e2548d744b6e7e6b6e4a4f3a
  - enabled: 1
    path: Assets/Scenes/Shop.unity
    guid: 57b93fa8671ea2b4187ab148cfa34488
  m_configObjects: {}
