%YAML 1.1
%TAG !u! tag:unity3d.com,2011:
--- !u!74 &7400000
AnimationClip:
  m_ObjectHideFlags: 0
  m_CorrespondingSourceObject: {fileID: 0}
  m_PrefabInstance: {fileID: 0}
  m_PrefabAsset: {fileID: 0}
  m_Name: YellowDinoWalk
  serializedVersion: 6
  m_Legacy: 0
  m_Compressed: 0
  m_UseHighQualityCurve: 1
  m_RotationCurves: []
  m_CompressedRotationCurves: []
  m_EulerCurves: []
  m_PositionCurves: []
  m_ScaleCurves: []
  m_FloatCurves: []
  m_PPtrCurves:
  - curve:
    - time: 0
      value: {fileID: -6137631655012043944, guid: cf93eb0d25c45f447aebd280350571fe, type: 3}
    - time: 0.016666668
      value: {fileID: -1526909416146142791, guid: cf93eb0d25c45f447aebd280350571fe, type: 3}
    - time: 0.033333335
      value: {fileID: -5812025569532742915, guid: cf93eb0d25c45f447aebd280350571fe, type: 3}
    - time: 0.05
      value: {fileID: 7215298852823833845, guid: cf93eb0d25c45f447aebd280350571fe, type: 3}
    - time: 0.06666667
      value: {fileID: 1529181815446380542, guid: cf93eb0d25c45f447aebd280350571fe, type: 3}
    - time: 0.083333336
      value: {fileID: -2406839412012389654, guid: cf93eb0d25c45f447aebd280350571fe, type: 3}
    - time: 0.1
      value: {fileID: 9123236651310048806, guid: cf93eb0d25c45f447aebd280350571fe, type: 3}
    attribute: m_Sprite
    path: 
    classID: 212
    script: {fileID: 0}
  m_SampleRate: 60
  m_WrapMode: 0
  m_Bounds:
    m_Center: {x: 0, y: 0, z: 0}
    m_Extent: {x: 0, y: 0, z: 0}
  m_ClipBindingConstant:
    genericBindings:
    - serializedVersion: 2
      path: 0
      attribute: 0
      script: {fileID: 0}
      typeID: 212
      customType: 23
      isPPtrCurve: 1
    pptrCurveMapping:
    - {fileID: -6137631655012043944, guid: cf93eb0d25c45f447aebd280350571fe, type: 3}
    - {fileID: -1526909416146142791, guid: cf93eb0d25c45f447aebd280350571fe, type: 3}
    - {fileID: -5812025569532742915, guid: cf93eb0d25c45f447aebd280350571fe, type: 3}
    - {fileID: 7215298852823833845, guid: cf93eb0d25c45f447aebd280350571fe, type: 3}
    - {fileID: 1529181815446380542, guid: cf93eb0d25c45f447aebd280350571fe, type: 3}
    - {fileID: -2406839412012389654, guid: cf93eb0d25c45f447aebd280350571fe, type: 3}
    - {fileID: 9123236651310048806, guid: cf93eb0d25c45f447aebd280350571fe, type: 3}
  m_AnimationClipSettings:
    serializedVersion: 2
    m_AdditiveReferencePoseClip: {fileID: 0}
    m_AdditiveReferencePoseTime: 0
    m_StartTime: 0
    m_StopTime: 0.11666667
    m_OrientationOffsetY: 0
    m_Level: 0
    m_CycleOffset: 0
    m_HasAdditiveReferencePose: 0
    m_LoopTime: 1
    m_LoopBlend: 0
    m_LoopBlendOrientation: 0
    m_LoopBlendPositionY: 0
    m_LoopBlendPositionXZ: 0
    m_KeepOriginalOrientation: 0
    m_KeepOriginalPositionY: 1
    m_KeepOriginalPositionXZ: 0
    m_HeightFromFeet: 0
    m_Mirror: 0
  m_EditorCurves: []
  m_EulerEditorCurves: []
  m_HasGenericRootTransform: 0
  m_HasMotionFloatCurves: 0
  m_Events: []
