@startuml
left to right direction




/' Objects '/

class AboutWindow {
	+AboutWindow(QWidget* parent, Qt::WindowType type)
	-setupUI() : void
}


class AndBoolFilterNode {
	+AndBoolFilterNode()
	#inA : GrafileDataBoolean
	#inB : GrafileDataBoolean
	#output : GrafileDataBoolean
	+outData(PortIndex outPortIndex) : std::shared_ptr<NodeData>
	+compute() : void
	#convertInputsToVars() : void
}


class ApplyTreatmentNode {
	+ApplyTreatmentNode()
}


class BooleanSourceNode {
	+BooleanSourceNode()
	+save() : QJsonObject {query}
	#_inputWidget : QPushButton*
	#valToString() : QString
	+embeddedWidget() : QWidget*
	#_value : bool
	+outData(PortIndex) : std::shared_ptr<NodeData>
	+restore(QJsonObject const& p) : void
}


class CompareOperationSourceNode {
	+CompareOperationSourceNode()
	#_value : CompareOperatorType
	#_inputWidget : QComboBox*
	+save() : QJsonObject {query}
	+embeddedWidget() : QWidget*
	+outData(PortIndex) : std::shared_ptr<NodeData>
	+restore(QJsonObject const& p) : void
}


class CompressionTreatmentNode {
	+CompressionTreatmentNode()
}


class CopyTreatmentNode {
	+CopyTreatmentNode()
	+copyLogic(GrafileDataStringFile src, QString dest) : GrafileDataStringFile
	#dest : GrafileDataStringFile
	#output : GrafileDataStringFile
	#src : GrafileDataStringFile
	+outData(PortIndex outPortIndex) : std::shared_ptr<NodeData>
	+compute() : void
	#convertInputsToVars() : void
}


class CustomFileModel {
	+CustomFileModel(QObject* parent)
	+addDirectory(QString path) : QFutureWatcher<void>*
	-dirIcon : QIcon
	-fileIcon : QIcon
	+getPopulateFiles() : QList<QFileInfo>*
	-populateFiles : QList<QFileInfo>*
	-rootItem : QStandardItem*
	+populateDirectory(QPromise<void>& promise, CustomFileEntry root) : void
}


class DateTimeAnalysisTreatmentNode {
	+DateTimeAnalysisTreatmentNode()
}


class DateTimeSourceNode {
	+DateTimeSourceNode()
	#_value : QDateTime
	#_inputWidget : QDateTimeEdit*
	+save() : QJsonObject {query}
	+embeddedWidget() : QWidget*
	#DATETIME_FORMAT_SAVED : const QString
	+outData(PortIndex) : std::shared_ptr<NodeData>
	+restore(QJsonObject const& p) : void
}


class DecimalSourceNode {
	+DecimalSourceNode()
	+save() : QJsonObject {query}
	#_inputWidget : QLineEdit*
	+embeddedWidget() : QWidget*
	#_value : double
	+outData(PortIndex) : std::shared_ptr<NodeData>
	+restore(QJsonObject const& p) : void
}


class DecimalToIntegerConverter {
	-_integer : SharedNodeData
	+operator()(SharedNodeData data) : SharedNodeData
}


class DeleteTreatmentNode {
	+DeleteTreatmentNode()
	#output : GrafileDataStringFile
	#src : GrafileDataStringFile
	+outData(PortIndex outPortIndex) : std::shared_ptr<NodeData>
	+compute() : void
	#convertInputsToVars() : void
}


class EndNode {
	+EndNode()
	#src : GrafileDataStringFile
	#actionIfFileAlreadyExists(StringFile file) : bool
	#applyCopy(StringFile file) : bool
	#applyCopyLogic(StringFile* file) : bool
	#applyDelete(StringFile file) : bool
	#applyDeleteLogic(StringFile* file) : bool
	#applyMove(StringFile file) : bool
	+compute() : void
	#convertInputsToVars() : void
	#displayErrorMessageApplyLogic(StringFile file, QString when) : void
}


class FileContainsFilterNode {
	+FileContainsFilterNode()
}


class FileExtFilterNode {
	+FileExtFilterNode()
	#inFiles : GrafileDataStringFile
	#outExcluded : GrafileDataStringFile
	#outFiltered : GrafileDataStringFile
	#inExt : GrafileDataText
	+outData(PortIndex outPortIndex) : std::shared_ptr<NodeData>
	+compute() : void
	#convertInputsToVars() : void
}


class FileNameFilterNode {
	+FileNameFilterNode()
	#inFiles : GrafileDataStringFile
	#outExcluded : GrafileDataStringFile
	#outFiltered : GrafileDataStringFile
	#inNames : GrafileDataText
	#inCaseSensitive : bool
	+outData(PortIndex outPortIndex) : std::shared_ptr<NodeData>
	+compute() : void
	#convertInputsToVars() : void
}


class FilePathFilterNode {
	+FilePathFilterNode()
	#inFiles : GrafileDataStringFile
	#outExcluded : GrafileDataStringFile
	#outFiltered : GrafileDataStringFile
	#inPaths : GrafileDataText
	+outData(PortIndex outPortIndex) : std::shared_ptr<NodeData>
	+compute() : void
	#convertInputsToVars() : void
}


class FileSizeFilterNode {
	+FileSizeFilterNode()
	#inComparators : GrafileDataComparator
	#inSizes : GrafileDataDecimal
	#inFiles : GrafileDataStringFile
	#outExcluded : GrafileDataStringFile
	#outFiltered : GrafileDataStringFile
	+DEFAULT_UNIT : const double
	+outData(PortIndex outPortIndex) : std::shared_ptr<NodeData>
	+compute() : void
	#convertInputsToVars() : void
}


class FilterNodeModel {
	+FilterNodeModel()
	+FilterNodeModel(QString name, bool canEnable)
	#compareValues(int a, CompareOperatorType comparator, int b) : bool
}


class GrafileData <template<typename T>> {
	+GrafileData(QVector<T> list, NodeDataType type)
	+GrafileData(QVector<T> list)
	+GrafileData(T element)
	+GrafileData()
	#_type : NodeDataType
	+type() : NodeDataType {query}
	#_list : QVector<T>
	+getCopyList() : QVector<T>
	+getList() : QVector<T>&
	+getValue() : T
	+getValueAt(int index) : T
	+hasValues() : bool {query}
	+clear() : void
	+setList(const QVector<T>& list) : void {query}
	+setValue(T value) : void
	+setValueAt(int index, T value) : void
}


class GrafileDataBoolean {
	+GrafileDataBoolean(QVector<bool> values)
	+GrafileDataBoolean(bool value)
	+GrafileDataBoolean()
}


class GrafileDataComparator {
	+GrafileDataComparator(QVector<CompareOperatorType> values)
	+GrafileDataComparator(CompareOperatorType value)
	+GrafileDataComparator()
}


class GrafileDataDateTime {
	+GrafileDataDateTime(QVector<QDateTime> dates)
	+GrafileDataDateTime(QDateTime date)
	+GrafileDataDateTime()
}


class GrafileDataDecimal {
	+GrafileDataDecimal(QVector<double> values)
	+GrafileDataDecimal(double value)
	+GrafileDataDecimal()
}


class GrafileDataInteger {
	+GrafileDataInteger(QVector<int> values)
	+GrafileDataInteger(int value)
	+GrafileDataInteger()
}


class GrafileDataStringFile {
	+GrafileDataStringFile(QVector<StringFile> values)
	+GrafileDataStringFile(StringFile value)
	+GrafileDataStringFile()
	+getPtrValueAt(int index) : StringFile*
}


class GrafileDataText {
	+GrafileDataText(QVector<QString> texts)
	+GrafileDataText(QString text)
	+GrafileDataText()
}


class GrafileNodeModel {
	+GrafileNodeModel()
	+GrafileNodeModel(QString name)
	+dataType(PortType portType, PortIndex portIndex) : NodeDataType {query}
	#modelValidationState : NodeValidationState
	+validationState() : NodeValidationState {query}
	#_name : QString
	+caption() : QString {query}
	#modelValidationError : QString
	+name() : QString {query}
	+portCaption(PortType portType, PortIndex portIndex) : QString {query}
	+validationMessage() : QString {query}
	#_input : QVector<std::shared_ptr<NodeData>>
	+embeddedWidget() : QWidget*
	+getParent() : QWidget*
	-eventEnabledComputeChange(bool isComputed) : Q_OBJECT signals : void
	#_isEnabled : bool
	#forceCompute : bool
	+isComputeExec() : bool
	+isEnabled() : bool
	+portCaptionVisible(PortType portType, PortIndex portIndex) : bool {query}
	#{static} _isComputeExec : static bool
	+outData(PortIndex outPortIndex) : std::shared_ptr<NodeData>
	+nPorts(PortType portType) : unsigned int {query}
	#addInputPort(QString typeName, QString name) : void
	#addOutputPort(QString typeName, QString name) : void
	+changeValidationState(bool hasError) : void
	+compute() : void
	#convertInputsToVars() : void
	+setComputeExec(bool state) : void
	#setEnableInput(QtNodes::PortIndex inPortIndex) : void
	+setEnabled(bool state) : void
	+setInData(std::shared_ptr<NodeData> data, PortIndex portIndex) : void
	+setInData(std::vector<std::shared_ptr<NodeData>> data, PortIndex inPortIndex) : void
}


class GrafileWidget {
	+GrafileWidget(QWidget* parent)
	-end : EndNode*
	-connectionEventEnd : QMetaObject::Connection
	-connectionEventStart : QMetaObject::Connection
	-eventEnabledComputeChange(bool isComputed) : Q_OBJECT signals : void
	-scene : QtNodes::FlowScene*
	-start : StartNode*
	+isGraphStarted() : bool
	+verifyGraphValidity() : bool
	+registerDataModels() : std::shared_ptr<DataModelRegistry>
	+cancelExecuteGraph() : void
	+executeGraph(QStringList sourceFiles) : void
	+loadGraph() : void
	+saveGraph() : void
}


class InputColumnWidget {
	+InputColumnWidget(QWidget* parent)
	-fileSystemModel : CustomFileModel*
	-selectInputDialog : QFileDialog*
	-listDirectoriesWatcher : QFutureWatcher<void>*
	+getOpenedFiles() : QList<QFileInfo>*
	-inputTree : QTreeView*
	-directoryChanged(QString directory) : signals : void
	-dataLoaded(bool state) : void
	-execute() : void
	-selectedDirectory(QString directory) : void
	-selectedFolder(QString folder) : void
	+setExecuteButtonEnabled(bool isEnabled) : void
	-setupUI() : void
	-updateReadyness() : void
}


class IntegerSourceNode {
	+IntegerSourceNode()
	+save() : QJsonObject {query}
	#_inputWidget : QLineEdit*
	+embeddedWidget() : QWidget*
	#_value : int
	+outData(PortIndex) : std::shared_ptr<NodeData>
	+restore(QJsonObject const& p) : void
}


class IntegerToDecimalConverter {
	-_decimal : SharedNodeData
	+operator()(SharedNodeData data) : SharedNodeData
}


class IsFolderFilterNode {
	+IsFolderFilterNode()
	#inFiles : GrafileDataStringFile
	#outFiles : GrafileDataStringFile
	#outFolders : GrafileDataStringFile
	+outData(PortIndex outPortIndex) : std::shared_ptr<NodeData>
	+compute() : void
	#convertInputsToVars() : void
}


class MainWidget {
	+MainWidget(MainWindow* parent)
	-_grafileWidget : GrafileWidget*
	+grafileWidget() : GrafileWidget*
	-inputColumnWidget : InputColumnWidget*
	-cancelExecuteButton : QPushButton*
	-executeButton : QPushButton*
	-isInputColumnWidgetDataLoaded : bool
	-cancelGraph() : void
	-executeGraph() : void
	-onGraphExecutionChanged(bool state) : void
	-onInputColumnWidgetDataLoaded(bool state) : void
	-setupUI() : void
	-toggleExecutionButton() : void
}


class MainWindow {
	+MainWindow(QWidget* parent)
	-aboutWindow : AboutWindow*
	-aboutAction : QAction*
	-loadGraphAction : QAction*
	-saveGraphAction : QAction*
	-editMenu : QMenu*
	-helpMenu : QMenu*
	-setupMenubar() : void
	-setupUI() : void
	-showAbout() : void
}


class MessageTreatmentNode {
	+MessageTreatmentNode()
	#inForConnectionOrder : GrafileDataStringFile
	#outForConnectionOrder : GrafileDataStringFile
	#DEFAULT_MESSAGE : QString
	#DEFAULT_TXT_BTN1 : QString
	#DEFAULT_TXT_BTN2 : QString
	#message : QString
	#txtBtn1 : QString
	#txtBtn2 : QString
	#onBtn1 : bool
	#onBtn2 : bool
	+outData(PortIndex outPortIndex) : std::shared_ptr<NodeData>
	+compute() : void
	#convertInputsToVars() : void
}


class MoveTreatmentNode {
	+MoveTreatmentNode()
	#dest : GrafileDataStringFile
	+moveLogic(GrafileDataStringFile src, QString dest) : GrafileDataStringFile
	#output : GrafileDataStringFile
	#src : GrafileDataStringFile
	+outData(PortIndex outPortIndex) : std::shared_ptr<NodeData>
	+compute() : void
	#convertInputsToVars() : void
}


class NameAnalysisTreatmentNode {
	+NameAnalysisTreatmentNode()
}


class NotBoolFilterNode {
	+NotBoolFilterNode()
	#input : GrafileDataBoolean
	#output : GrafileDataBoolean
	+outData(PortIndex outPortIndex) : std::shared_ptr<NodeData>
	+compute() : void
	#convertInputsToVars() : void
}


class OpenFileAndFolderWidget {
	+OpenFileAndFolderWidget(QWidget* parent)
	#dialogFiles : QFileDialog*
	#dialogFolders : QFileDialog*
	#lblOpenedElements : QLabel*
	#btnCleanFiles : QPushButton*
	#btnCleanFolders : QPushButton*
	#btnOpenFiles : QPushButton*
	#btnOpenFolders : QPushButton*
	#openLocation : QString
	+getOpenedElements() : QStringList
	#openedFiles : QStringList*
	#openedFolders : QStringList*
	#NOTHING_OPENED : const QString
	+openedElementsChange(QStringList openedElements) : signals : void
	+setOpenedElements(QStringList elements) : void
	#updateLabel() : void
	#updateOpenLocation(QStringList openedSrc) : void
}


class OrBoolFilterNode {
	+OrBoolFilterNode()
	#inA : GrafileDataBoolean
	#inB : GrafileDataBoolean
	#output : GrafileDataBoolean
	+outData(PortIndex outPortIndex) : std::shared_ptr<NodeData>
	+compute() : void
	#convertInputsToVars() : void
}


class OutputColumnWidget {
	+OutputColumnWidget(QWidget* parent)
	-fileSystemModel : QFileSystemModel*
	-executeButton : QPushButton*
	-outputTree : QTreeView*
	+folderChanged(QString folder) : signals : void
	+readyState(bool enabled) : void
	-selectedFolder(QString folder) : void
	-setupUI() : void
}


class PreviewTreatmentNode {
	+PreviewTreatmentNode()
}


class StartNode {
	+StartNode()
	-output : GrafileDataStringFile
	+outData(PortIndex outPortIndex) : std::shared_ptr<NodeData>
	+compute() : void
	+setData(QStringList files) : void
}


class StringFile {
	+StringFile()
	+StringFile(QString path)
	+StringFile(QString path, QString originalPath)
	+StringFile(QString path, QString originalPath, QString finalPath)
	+StringFile(StringFile const &)
	+~StringFile()
	+operator<<(QDataStream &, const StringFile &) : QDataStream&
	+operator>>(QDataStream &, StringFile &) : QDataStream&
	+operator<<(QDebug dbg, const StringFile& stringFile) : QDebug
	+{static} toJson(const QList<StringFile>& list) : QJsonArray
	+toJson() : QJsonObject {query}
	+{static} fromJson(QJsonArray const& list) : QList<StringFile>
	-_currentPath : QString
	-_finalPath : QString
	-_originalPath : QString
	+getCurrentPath() : QString
	+getFinalPath() : QString
	+getOriginalPath() : QString
	+getNeedDelete() : bool
	+getNeedMove() : bool
	-needDelete : bool
	-needMove : bool
	+operator==(const StringFile& l, const StringFile& r) : bool
	+fromJson(QJsonObject const &) : void
	+setCurrentPath(QString path) : void
	+setFinalPath(QString path) : void
	+setNeedDelete(bool state) : void
	+setNeedMove(bool state) : void
	+setOriginalPath(QString path) : void
}


class StringFileSourceNode {
	+StringFileSourceNode()
	#_inputWidget : OpenFileAndFolderWidget*
	+save() : QJsonObject {query}
	#_values : QList<StringFile>
	#valuesToListString() : QStringList
	+embeddedWidget() : QWidget*
	+outData(PortIndex) : std::shared_ptr<NodeData>
	+restore(QJsonObject const& p) : void
}


class TemporaryWork {
	+{static} getTempFile() : QString
	+{static} displayMessageNoTempFile(QString file, QWidget* parent) : bool
	+{static} isFileInTemp(QString file) : bool
	-{static} FOLDER_APP_NAME : static const QString
	-{static} TEMP_FILENAME_TEMPLATE : static const QString
	+{static} TEMP_FOLDER : static const QString
	+{static} cleanTempAppFolder() : void
	-{static} createTempAppFolder() : void
}


class TestInNode {
	+TestInNode()
	#inBool : GrafileDataBoolean
	#inComp : GrafileDataComparator
	#inDateTime : GrafileDataDateTime
	#inDecimal : GrafileDataDecimal
	#inInt : GrafileDataInteger
	#inStringFile : GrafileDataStringFile
	#inText : GrafileDataText
	#inBoolConnected : bool
	#inCompConnected : bool
	#inDateTimeConnected : bool
	#inDecimalConnected : bool
	#inIntConnected : bool
	#inStringFileConnected : bool
	#inTextConnected : bool
	+compute() : void
	#convertInputsToVars() : void
}


class TextSourceNode {
	+TextSourceNode()
	+save() : QJsonObject {query}
	#_value : QString
	#_inputWidget : QTextEdit*
	+embeddedWidget() : QWidget*
	+outData(PortIndex) : std::shared_ptr<NodeData>
	+restore(QJsonObject const& p) : void
}


class TreatmentNodeModel {
	+TreatmentNodeModel()
	+TreatmentNodeModel(QString name, bool canEnable)
}


class Utility {
	+{static} copyFile(QString src, QString to) : bool
	+{static} createDir(QString path) : bool
	+{static} deleteFile(QString file) : bool
	+{static} isDir(QString path) : bool
}


class ValueSourceNodeModel {
	+ValueSourceNodeModel()
	+ValueSourceNodeModel(QString name)
}


enum CompareOperatorType {
	EQUALS
	GREATHER_EQUALS_THAN
	GREATHER_THAN
	LOWER_EQUALS_THAN
	LOWER_THAN
	NOT_EQUALS
}


class CustomFileEntry {
	+fileInfo : QFileInfo
	+parent : QStandardItem*
}





/' Inheritance relationships '/

.FilterNodeModel <|-- .AndBoolFilterNode


.FilterNodeModel <|-- .FileContainsFilterNode


.FilterNodeModel <|-- .FileExtFilterNode


.FilterNodeModel <|-- .FileNameFilterNode


.FilterNodeModel <|-- .FilePathFilterNode


.FilterNodeModel <|-- .FileSizeFilterNode


.FilterNodeModel <|-- .IsFolderFilterNode


.FilterNodeModel <|-- .NotBoolFilterNode


.FilterNodeModel <|-- .OrBoolFilterNode


.GrafileData <|-- .GrafileDataBoolean


.GrafileData <|-- .GrafileDataComparator


.GrafileData <|-- .GrafileDataDateTime


.GrafileData <|-- .GrafileDataDecimal


.GrafileData <|-- .GrafileDataInteger


.GrafileData <|-- .GrafileDataStringFile


.GrafileData <|-- .GrafileDataText


.GrafileNodeModel <|-- .FilterNodeModel


.GrafileNodeModel <|-- .TestInNode


.GrafileNodeModel <|-- .TreatmentNodeModel


.GrafileNodeModel <|-- .ValueSourceNodeModel


.TreatmentNodeModel <|-- .ApplyTreatmentNode


.TreatmentNodeModel <|-- .CompressionTreatmentNode


.TreatmentNodeModel <|-- .CopyTreatmentNode


.TreatmentNodeModel <|-- .DateTimeAnalysisTreatmentNode


.TreatmentNodeModel <|-- .DeleteTreatmentNode


.TreatmentNodeModel <|-- .EndNode


.TreatmentNodeModel <|-- .MessageTreatmentNode


.TreatmentNodeModel <|-- .MoveTreatmentNode


.TreatmentNodeModel <|-- .NameAnalysisTreatmentNode


.TreatmentNodeModel <|-- .PreviewTreatmentNode


.TreatmentNodeModel <|-- .StartNode


.ValueSourceNodeModel <|-- .BooleanSourceNode


.ValueSourceNodeModel <|-- .CompareOperationSourceNode


.ValueSourceNodeModel <|-- .DateTimeSourceNode


.ValueSourceNodeModel <|-- .DecimalSourceNode


.ValueSourceNodeModel <|-- .IntegerSourceNode


.ValueSourceNodeModel <|-- .StringFileSourceNode


.ValueSourceNodeModel <|-- .TextSourceNode





/' Aggregation relationships '/

.AndBoolFilterNode "3" *-- .GrafileDataBoolean


.CompareOperationSourceNode *-- .CompareOperatorType


.CopyTreatmentNode "3" *-- .GrafileDataStringFile


.DeleteTreatmentNode "2" *-- .GrafileDataStringFile


.EndNode *-- .GrafileDataStringFile


.FileExtFilterNode "3" *-- .GrafileDataStringFile


.FileExtFilterNode *-- .GrafileDataText


.FileNameFilterNode "3" *-- .GrafileDataStringFile


.FileNameFilterNode *-- .GrafileDataText


.FilePathFilterNode "3" *-- .GrafileDataStringFile


.FilePathFilterNode *-- .GrafileDataText


.FileSizeFilterNode *-- .GrafileDataComparator


.FileSizeFilterNode *-- .GrafileDataDecimal


.FileSizeFilterNode "3" *-- .GrafileDataStringFile


.GrafileWidget o-- .EndNode


.GrafileWidget o-- .StartNode


.InputColumnWidget o-- .CustomFileModel


.IsFolderFilterNode "3" *-- .GrafileDataStringFile


.MainWidget o-- .GrafileWidget


.MainWidget o-- .InputColumnWidget


.MainWindow o-- .AboutWindow


.MessageTreatmentNode "2" *-- .GrafileDataStringFile


.MoveTreatmentNode "3" *-- .GrafileDataStringFile


.NotBoolFilterNode "2" *-- .GrafileDataBoolean


.OrBoolFilterNode "3" *-- .GrafileDataBoolean


.StartNode *-- .GrafileDataStringFile


.StringFileSourceNode o-- .OpenFileAndFolderWidget


.StringFileSourceNode *-- .StringFile


.TestInNode *-- .GrafileDataBoolean


.TestInNode *-- .GrafileDataComparator


.TestInNode *-- .GrafileDataDateTime


.TestInNode *-- .GrafileDataDecimal


.TestInNode *-- .GrafileDataInteger


.TestInNode *-- .GrafileDataStringFile


.TestInNode *-- .GrafileDataText






/' Nested objects '/



@enduml

