https://patorjk.com/software/taag/#p=testall&v=2&f=Crazy&t=Lifinity%0ADungeon
 
Graceful : 
 __    __  ____  __  __ _  __  ____  _  _ 
(  )  (  )(  __)(  )(  ( \(  )(_  _)( \/ )
/ (_/\ )(  ) _)  )( /    / )(   )(   )  / 
\____/(__)(__)_ (__)\_)__)(__) (__) (__/  
(    \/ )( \(  ( \ / __)(  __)/  \ (  ( \ 
 ) D () \/ (/    /( (_ \ ) _)(  O )/    / 
(____/\____/\_)__) \___/(____)\__/ \_)__) 


Graffiti :

.____    .__  _____.__       .__  __                
|    |   |__|/ ____\__| ____ |__|/  |_ ___.__.      
|    |   |  \   __\|  |/    \|  \   __<   |  |      
|    |___|  ||  |  |  |   |  \  ||  |  \___  |      
|_______ \__||__|  |__|___|  /__||__|  / ____|      
\______ \/ __ __  ____    _\/_   ____  \/__   ____  
 |    |  \|  |  \/    \  / ___\_/ __ \/  _ \ /    \ 
 |    `   \  |  /   |  \/ /_/  >  ___(  <_> )   |  \
/_______  /____/|___|  /\___  / \___  >____/|___|  /
        \/           \//_____/      \/           \/ 


Blood :

 ██▓     ██▓  █████▒██▓ ███▄    █  ██▓▄▄▄█████▓▓██   ██▓       
▓██▒    ▓██▒▓██   ▒▓██▒ ██ ▀█   █ ▓██▒▓  ██▒ ▓▒ ▒██  ██▒       
▒██░    ▒██▒▒████ ░▒██▒▓██  ▀█ ██▒▒██▒▒ ▓██░ ▒░  ▒██ ██░       
▒██░    ░██░░▓█▒  ░░██░▓██▒  ▐▌██▒░██░░ ▓██▓ ░   ░ ▐██▓░       
░██████▒░██░░▒█░   ░██░▒██░   ▓██░░██░  ▒██▒ ░   ░ ██▒▓░       
░ ▒░▓  ░░▓   ▒ ░   ░▓  ░ ▒░   ▒ ▒ ░▓    ▒ ░░      ██▒▒▒        
░ ░ ▒  ░ ▒ ░ ░      ▒ ░░ ░░   ░ ▒░ ▒ ░    ░     ▓██ ░▒░        
  ░ ░    ▒ ░ ░ ░    ▒ ░   ░   ░ ░  ▒ ░  ░       ▒ ▒ ░░         
    ░  ░ ░          ░           ░  ░            ░ ░            
                                                ░ ░            
▓█████▄  █    ██  ███▄    █   ▄████ ▓█████  ▒█████   ███▄    █ 
▒██▀ ██▌ ██  ▓██▒ ██ ▀█   █  ██▒ ▀█▒▓█   ▀ ▒██▒  ██▒ ██ ▀█   █ 
░██   █▌▓██  ▒██░▓██  ▀█ ██▒▒██░▄▄▄░▒███   ▒██░  ██▒▓██  ▀█ ██▒
░▓█▄   ▌▓▓█  ░██░▓██▒  ▐▌██▒░▓█  ██▓▒▓█  ▄ ▒██   ██░▓██▒  ▐▌██▒
░▒████▓ ▒▒█████▓ ▒██░   ▓██░░▒▓███▀▒░▒████▒░ ████▓▒░▒██░   ▓██░
 ▒▒▓  ▒ ░▒▓▒ ▒ ▒ ░ ▒░   ▒ ▒  ░▒   ▒ ░░ ▒░ ░░ ▒░▒░▒░ ░ ▒░   ▒ ▒ 
 ░ ▒  ▒ ░░▒░ ░ ░ ░ ░░   ░ ▒░  ░   ░  ░ ░  ░  ░ ▒ ▒░ ░ ░░   ░ ▒░
 ░ ░  ░  ░░░ ░ ░    ░   ░ ░ ░ ░   ░    ░   ░ ░ ░ ▒     ░   ░ ░ 
   ░       ░              ░       ░    ░  ░    ░ ░           ░ 
 ░                                                             


Delta Corps Priest 1

 ▄█        ▄█     ▄████████  ▄█  ███▄▄▄▄    ▄█      ███     ▄██   ▄            
███       ███    ███    ███ ███  ███▀▀▀██▄ ███  ▀█████████▄ ███   ██▄          
███       ███▌   ███    █▀  ███▌ ███   ███ ███▌    ▀███▀▀██ ███▄▄▄███          
███       ███▌  ▄███▄▄▄     ███▌ ███   ███ ███▌     ███   ▀ ▀▀▀▀▀▀███          
███       ███▌ ▀▀███▀▀▀     ███▌ ███   ███ ███▌     ███     ▄██   ███          
███       ███    ███        ███  ███   ███ ███      ███     ███   ███          
███▌    ▄ ███    ███        ███  ███   ███ ███      ███     ███   ███          
█████▄▄██ █▀     ███        █▀    ▀█   █▀  █▀      ▄████▀    ▀█████▀           
▀                                                                              
████████▄  ███    █▄  ███▄▄▄▄      ▄██████▄     ▄████████  ▄██████▄  ███▄▄▄▄   
███   ▀███ ███    ███ ███▀▀▀██▄   ███    ███   ███    ███ ███    ███ ███▀▀▀██▄ 
███    ███ ███    ███ ███   ███   ███    █▀    ███    █▀  ███    ███ ███   ███ 
███    ███ ███    ███ ███   ███  ▄███         ▄███▄▄▄     ███    ███ ███   ███ 
███    ███ ███    ███ ███   ███ ▀▀███ ████▄  ▀▀███▀▀▀     ███    ███ ███   ███ 
███    ███ ███    ███ ███   ███   ███    ███   ███    █▄  ███    ███ ███   ███ 
███   ▄███ ███    ███ ███   ███   ███    ███   ███    ███ ███    ███ ███   ███ 
████████▀  ████████▀   ▀█   █▀    ████████▀    ██████████  ▀██████▀   ▀█   █▀  
                                                                               


The edge


█    ▄█ ▄████  ▄█    ▄   ▄█    ▄▄▄▄▀ ▀▄    ▄  
█    ██ █▀   ▀ ██     █  ██ ▀▀▀ █      █  █   
█    ██ █▀▀    ██ ██   █ ██     █       ▀█    
███▄ ▐█ █      ▐█ █ █  █ ▐█    █        █     
    ▀ ▐  █      ▐ █  █ █  ▐   ▀       ▄▀      
          ▀       █   ██                      
██▄     ▄      ▄     ▄▀  ▄███▄   ████▄    ▄   
█  █     █      █  ▄▀    █▀   ▀  █   █     █  
█   █ █   █ ██   █ █ ▀▄  ██▄▄    █   █ ██   █ 
█  █  █   █ █ █  █ █   █ █▄   ▄▀ ▀████ █ █  █ 
███▀  █▄ ▄█ █  █ █  ███  ▀███▀         █  █ █ 
       ▀▀▀  █   ██                     █   ██ 
                                              


Def Leppard

                        ,                                                            
                        Et                                                           
                        E#t          L.                                              
             i   t      E##t     t   EW:        ,ft t                                
            LE   Ej     E#W#t    Ej  E##;       t#E Ej GEEEEEEELf.     ;WE.          
           L#E   E#,    E#tfL.   E#, E###t      t#E E#,,;;L#K;;.E#,   i#G            
          G#W.   E#t    E#t      E#t E#fE#f     t#E E#t   t#E   E#t  f#f             
         D#K.    E#t ,ffW#Dffj.  E#t E#t D#G    t#E E#t   t#E   E#t G#i              
        E#K.     E#t  ;LW#ELLLf. E#t E#t  f#E.  t#E E#t   t#E   E#jEW,               
      .E#E.      E#t    E#t      E#t E#t   t#K: t#E E#t   t#E   E##E.                
     .K#E        E#t    E#t      E#t E#t    ;#W,t#E E#t   t#E   E#G                  
    .K#D         E#t    E#t      E#t E#t     :K#D#E E#t   t#E   E#t                  
   .W#G          E#t    E#t      E#t E#t      .E##E E#t   t#E   E#t                  
  :W##########Wt E#t    E#t      E#t ..         G#E E#t    fE   EE.                  
  :,,,,,,,,,,,,,.,;.    ;#t      ,;.             fE ,;.     :   t                    
  ;                      :;                       ,                                  
  ED.                                                           :                    
  E#Wi         :      L.                                 ,;    t#,     L.            
  E###G.       Ef     EW:        ,ft         .Gt       f#i    ;##W.    EW:        ,ft
  E#fD#W;      E#t    E##;       t#E        j#W:     .E#t    :#L:WE    E##;       t#E
  E#t t##L     E#t    E###t      t#E      ;K#f      i#W,    .KG  ,#D   E###t      t#E
  E#t  .E#K,   E#t    E#fE#f     t#E    .G#D.      L#D.     EE    ;#f  E#fE#f     t#E
  E#t    j##f  E#t fi E#t D#G    t#E   j#K;      :K#Wfff;  f#.     t#i E#t D#G    t#E
  E#t    :E#K: E#t L#jE#t  f#E.  t#E ,K#f   ,GD; i##WLLLLt :#G     GK  E#t  f#E.  t#E
  E#t   t##L   E#t L#LE#t   t#K: t#E  j#Wi   E#t  .E#L      ;#L   LW.  E#t   t#K: t#E
  E#t .D#W;    E#tf#E:E#t    ;#W,t#E   .G#D: E#t    f#E:     t#f f#:   E#t    ;#W,t#E
  E#tiW#G.     E###f  E#t     :K#D#E     ,K#fK#t     ,WW;     f#D#;    E#t     :K#D#E
  E#K##i       E#K,   E#t      .E##E       j###t      .D#;     G#t     E#t      .E##E
  E##D.        EL     ..         G#E        .G#t        tt      t      ..         G#E
  E#t          :                  fE          ;;                                   fE
  L:                               ,                                                ,


