[
{
    "model": "main.product",
    "pk": 1,
    "fields": {
        "title": "Карандаш",
        "img": "/img/carandash.jpg",
        "desc": "Простой карандаш имеет графитовый грифель и пишет серым цветом с оттенками от светлого до почти чёрного (зависит от твёрдости графита). Оправа грифеля может быть деревянной, пластиковой, бумажной, верёвочной. Такие карандаши считаются одноразовыми. Иногда на обратном конце карандаша укреплён ластик в обойме.",
        "price": "10.00",
        "url": "carandash"
    }
},
{
    "model": "main.product",
    "pk": 2,
    "fields": {
        "title": "Тетрадь",
        "img": "/img/tetrad.jpg",
        "desc": "Печатный или письменный носитель информации, состоящий из листов бумаги, согнутых пополам и переплетённых в месте сгиба нитками или скобами. Также тетрадью могут называться отдельные листы для письма, скрепленные клеем или проволочной спиралью.",
        "price": "20.00",
        "url": "tetrad"
    }
},
{
    "model": "main.product",
    "pk": 3,
    "fields": {
        "title": "Ластик",
        "img": "/img/lastik.jpg",
        "desc": "Стира́тельная резинка (также резинка для стирания, ла́стик, канцеля́рская резинка) — канцелярская принадлежность для удаления карандашных (и иногда чернильных) надписей с бумаги и других поверхностей для письма, кусок натурального или вулканизированного каучука.",
        "price": "23.00",
        "url": "lastik"
    }
},
{
    "model": "main.product",
    "pk": 4,
    "fields": {
        "title": "Линер",
        "img": "/img/liner.jpg",
        "desc": "Линер — вид капиллярной ручки с чернилами на водной основе. Предназначен для рисования тонкими, насыщенными линиями и используется в работе дизайнеров, архитекторов, для чертежей и оформительских работ.",
        "price": "41.00",
        "url": "liner"
    }
},
{
    "model": "main.product",
    "pk": 5,
    "fields": {
        "title": "Маркер",
        "img": "/img/marker.jpg",
        "desc": "Обычный маркер представляет собой инструмент для рисования или письма, имеющий чаще всего, вытянутую цилиндрическую или многогранную форму из пластика или металла, в которой находится резервуар со стержнем из мелкопористого синтетического материала, пропитанный краской (чернилами) определённого цвета.",
        "price": "44.00",
        "url": "marker"
    }
},
{
    "model": "main.product",
    "pk": 6,
    "fields": {
        "title": "Фломастер",
        "img": "/img/flomaster.jpg",
        "desc": "Флома́стер (происходит от торговой марки «Flo-Master») , также ма́ркер, англ. mark — «метка, пометка») — инструмент для письма и рисования при помощи краски, стекающей из резервуара к наконечнику из пористого материала (нейлон или войлок).",
        "price": "55.00",
        "url": "flomaster"
    }
},
{
    "model": "main.product",
    "pk": 7,
    "fields": {
        "title": "Степлер",
        "img": "/img/stepler.jpg",
        "desc": "Степлер, или сшиватель (англ. stapler, /ˈsteɪplə(r)/), — устройство для скрепления листов бумаги металлическими скобами.",
        "price": "123.00",
        "url": "stepler"
    }
},
{
    "model": "main.product",
    "pk": 8,
    "fields": {
        "title": "Дырокол",
        "img": "/img/dirokol.jpg",
        "desc": "Дыроко́л — механическое устройство для пробивания отверстий в бумаге. Обычно дырокол пробивает два отверстия круглой формы для хранения документов в скоросшивателе, но также производятся дыроколы на четыре отверстия и на одно.",
        "price": "443.00",
        "url": "dirokol"
    }
}
]
