{
  "file_generated_by": "FlutterFire CLI",
  "purpose": "FirebaseAppID & ProjectID for this Firebase app in this directory",
  "GOOGLE_APP_ID": "1:437143159608:ios:d4cdee72bfaa1269b4f7cd",
  "FIREBASE_PROJECT_ID": "cats-6fac5",
  "GCM_SENDER_ID": "437143159608"
}