%YAML 1.1
%TAG !u! tag:unity3d.com,2011:
--- !u!114 &11400000
MonoBehaviour:
  m_ObjectHideFlags: 0
  m_CorrespondingSourceObject: {fileID: 0}
  m_PrefabInstance: {fileID: 0}
  m_PrefabAsset: {fileID: 0}
  m_GameObject: {fileID: 0}
  m_Enabled: 1
  m_EditorHideFlags: 0
  m_Script: {fileID: 11500000, guid: 51a94826ae6c67c4b872f8502ea60ae3, type: 3}
  m_Name: Settings
  m_EditorClassIdentifier: 
  controllerType: 0
  startFromGameScene: 0
  failPanelAppearTime: 1
  successPanelAppearTime: 1
