%YAML 1.1
%TAG !u! tag:unity3d.com,2011:
--- !u!1045 &1
EditorBuildSettings:
  m_ObjectHideFlags: 0
  serializedVersion: 2
  m_Scenes:
  - enabled: 1
    path: Assets/Game/Scenes/ManagerScene.unity
    guid: cdddaf4acafb1414ba16f67535a92d0a
  - enabled: 1
    path: Assets/Game/Scenes/LevelLoaderScene.unity
    guid: b81c49af1443789478047b86c59b428b
  - enabled: 1
    path: Assets/Game/Scenes/LevelScene.unity
    guid: 1556752f02ceb0f4aad245a8b0d1a37e
  - enabled: 1
    path: Assets/Game/Scenes/EmptyScene.unity
    guid: 8d900d25141322f4bab3fff3ed0cb8bf
  - enabled: 1
    path: Assets/Game/Scenes/LevelScenes/DefaultLevelScene.unity
    guid: d4665543b7c25164192af3f61fcb081e
  m_configObjects: {}
