%YAML 1.1
%TAG !u! tag:unity3d.com,2011:
--- !u!221 &22100000
AnimatorOverrideController:
  m_ObjectHideFlags: 0
  m_CorrespondingSourceObject: {fileID: 0}
  m_PrefabInstance: {fileID: 0}
  m_PrefabAsset: {fileID: 0}
  m_Name: Swipe Controller
  m_Controller: {fileID: 9100000, guid: eb312b0d542f44109aa174b23772749b, type: 2}
  m_Clips:
  - m_OriginalClip: {fileID: 7400000, guid: 8c93093de909f46edbcf0b865ab2bb73, type: 2}
    m_OverrideClip: {fileID: 7400000, guid: 8c93093de909f46edbcf0b865ab2bb73, type: 2}
