%YAML 1.1
%TAG !u! tag:unity3d.com,2011:
--- !u!114 &11400000
MonoBehaviour:
  m_ObjectHideFlags: 0
  m_CorrespondingSourceObject: {fileID: 0}
  m_PrefabInstance: {fileID: 0}
  m_PrefabAsset: {fileID: 0}
  m_GameObject: {fileID: 0}
  m_Enabled: 1
  m_EditorHideFlags: 0
  m_Script: {fileID: 11500000, guid: d0dab957cd724ce99e064b445bc61526, type: 3}
  m_Name: UniRx
  m_EditorClassIdentifier: 
  packageName: UniRx
  path: Assets/UnityPackages/UniRx.unitypackage
  importedPath:
  - Assets/Plugins/UniRx
  dependencies: UNIRX_IMPORTED
  imported: 0
