%YAML 1.1
%TAG !u! tag:unity3d.com,2011:
--- !u!78 &1
TagManager:
  serializedVersion: 2
  tags:
  - EnemyTarget
  - PlayerTargets
  - PlayerMob
  - EnemyMob
  layers:
  - Default
  - TransparentFX
  - Ignore Raycast
  - PostProcessing
  - Water
  - UI
  - Mob
  - Player
  - NavmeshIgnore
  - Collectable
  - Projectile
  - Obstacle
  - Ground
  - 
  - 
  - 
  - 
  - 
  - 
  - 
  - 
  - 
  - 
  - 
  - 
  - 
  - 
  - 
  - 
  - 
  - 
  - 
  m_SortingLayers:
  - name: Default
    uniqueID: 0
    locked: 0
