%YAML 1.1
%TAG !u! tag:unity3d.com,2011:
--- !u!21 &2100000
Material:
  serializedVersion: 6
  m_ObjectHideFlags: 0
  m_CorrespondingSourceObject: {fileID: 0}
  m_PrefabInstance: {fileID: 0}
  m_PrefabAsset: {fileID: 0}
  m_Name: finish_line
  m_Shader: {fileID: 4800000, guid: faed8d89bf63a154a9e2283927a52790, type: 3}
  m_ShaderKeywords: CURVEDWORLD_BEND_ID_1 CURVEDWORLD_BEND_TYPE_CLASSICRUNNER_Z_POSITIVE
  m_LightmapFlags: 4
  m_EnableInstancingVariants: 0
  m_DoubleSidedGI: 0
  m_CustomRenderQueue: 2000
  stringTagMap: {}
  disabledShaderPasses: []
  m_SavedProperties:
    serializedVersion: 3
    m_TexEnvs:
    - _Albedo:
        m_Texture: {fileID: 2800000, guid: 74a368937057b5040ab5e3599cf1554e, type: 3}
        m_Scale: {x: 1, y: 1}
        m_Offset: {x: 0, y: 0}
    - _AmbientCube:
        m_Texture: {fileID: 0}
        m_Scale: {x: 1, y: 1}
        m_Offset: {x: 0, y: 0}
    - _BumpMap:
        m_Texture: {fileID: 0}
        m_Scale: {x: 1, y: 1}
        m_Offset: {x: 0, y: 0}
    - _ReflectionTex:
        m_Texture: {fileID: 0}
        m_Scale: {x: 1, y: 1}
        m_Offset: {x: 0, y: 0}
    - _SketchTexture:
        m_Texture: {fileID: 0}
        m_Scale: {x: 1, y: 1}
        m_Offset: {x: 0, y: 0}
    - _StylizedThreshold:
        m_Texture: {fileID: 2800000, guid: f44c324003825d647b7db982f88705e0, type: 3}
        m_Scale: {x: 1, y: 1}
        m_Offset: {x: 0, y: 0}
    m_Floats:
    - _BumpScale: 1
    - _Cull: 0
    - _Cutoff: 0.5
    - _DstBlend: 0
    - _HSV_H: 0
    - _HSV_S: 0
    - _HSV_V: 0.114
    - _LightWrapFactor: 2
    - _PlanarNormalsInfluence: 0.1
    - _RampSmoothing: 1
    - _RampThreshold: 0.5
    - _ReceiveShadowsOff: 1
    - _ReflectionSmoothness: 0.5
    - _RenderingMode: 0
    - _RimMaxVert: 1
    - _RimMinVert: 0.5
    - _ShadowLineSmoothing: 0.015
    - _ShadowLineStrength: 1
    - _ShadowLineThreshold: 0.5
    - _Shadow_HSV_H: 0
    - _Shadow_HSV_S: 0
    - _Shadow_HSV_V: -1
    - _SketchMax: 1
    - _SketchMin: 0
    - _SketchTexture_OffsetSpeed: 120
    - _SpecularShadowAttenuation: 0
    - _SpecularToonSize: 0
    - _SpecularToonSmoothness: 0.001
    - _SrcBlend: 1
    - _SubsurfaceDistortion: 0.2
    - _SubsurfacePower: 3
    - _SubsurfaceScale: 1
    - _UseAmbient: 0
    - _UseRim: 0
    - _UseSubsurface: 0
    - _ZWrite: 1
    - __BeginGroup_AlbedoHSV: 1
    - __BeginGroup_ShadowHSV: 1
    - __EndGroup: 0
    - __dummy__: 0
    - _blendOperation: 0
    - _faceCulling: 0
    m_Colors:
    - _BaseColor: {r: 1, g: 1, b: 1, a: 1}
    - _CurvedWorldBendSettings: {r: 2, g: 1, b: 0, a: 0}
    - _Emission: {r: 0, g: 0, b: 0, a: 1}
    - _HColor: {r: 0.8301887, g: 0.8301887, b: 0.8301887, a: 1}
    - _ReflectionColor: {r: 1, g: 1, b: 1, a: 1}
    - _RimColor: {r: 0.8, g: 0.8, b: 0.8, a: 0.5}
    - _RimDirVert: {r: 0, g: 0, b: 1, a: 1}
    - _SColor: {r: 0.094844, g: 0, b: 0.4339623, a: 1}
    - _ShadowLineColor: {r: 0, g: 0, b: 0, a: 1}
    - _SpecularColor: {r: 0, g: 0, b: 0, a: 1}
    - _SubsurfaceAmbientColor: {r: 0.5, g: 0.5, b: 0.5, a: 1}
    - _SubsurfaceColor: {r: 0.5, g: 0.5, b: 0.5, a: 1}
    - _TCP2_AMBIENT_BACK: {r: 0, g: 0, b: 0, a: 1}
    - _TCP2_AMBIENT_BOTTOM: {r: 0, g: 0, b: 0, a: 1}
    - _TCP2_AMBIENT_FRONT: {r: 0, g: 0, b: 0, a: 1}
    - _TCP2_AMBIENT_LEFT: {r: 0, g: 0, b: 0, a: 1}
    - _TCP2_AMBIENT_RIGHT: {r: 0, g: 0, b: 0, a: 1}
    - _TCP2_AMBIENT_TOP: {r: 0, g: 0, b: 0, a: 1}
  m_BuildTextureStacks: []
--- !u!114 &4632645026948604454
MonoBehaviour:
  m_ObjectHideFlags: 11
  m_CorrespondingSourceObject: {fileID: 0}
  m_PrefabInstance: {fileID: 0}
  m_PrefabAsset: {fileID: 0}
  m_GameObject: {fileID: 0}
  m_Enabled: 1
  m_EditorHideFlags: 0
  m_Script: {fileID: 11500000, guid: d0353a89b1f911e48b9e16bdc9f2e058, type: 3}
  m_Name: 
  m_EditorClassIdentifier: 
  version: 4
