%YAML 1.1
%TAG !u! tag:unity3d.com,2011:
--- !u!114 &11400000
MonoBehaviour:
  m_ObjectHideFlags: 0
  m_CorrespondingSourceObject: {fileID: 0}
  m_PrefabInstance: {fileID: 0}
  m_PrefabAsset: {fileID: 0}
  m_GameObject: {fileID: 0}
  m_Enabled: 1
  m_EditorHideFlags: 0
  m_Script: {fileID: 11500000, guid: a9b65b6d76a0cfb4bacbfc08e5027bda, type: 3}
  m_Name: Hero_Serkan
  m_EditorClassIdentifier: 
  string_Name: Serkan
  float_Health: 100
  float_AttackPower: 50
  float_Experience: 0
  int_Level: 0
  float_LevelUpDifference: 1.1
  CharacterPrefab: {fileID: 541751373502710072, guid: 73bc1ec11555831408026c3a9b65c543,
    type: 3}
  ModelPrefab: {fileID: 8259594449995967548, guid: 4d09f901389da9d4a85133bee21ab917,
    type: 3}
  Icon: {fileID: 21300000, guid: d8f2f909458e61041acbfa99c8f223df, type: 3}
