%YAML 1.1
%TAG !u! tag:unity3d.com,2011:
--- !u!114 &11400000
MonoBehaviour:
  m_ObjectHideFlags: 0
  m_CorrespondingSourceObject: {fileID: 0}
  m_PrefabInstance: {fileID: 0}
  m_PrefabAsset: {fileID: 0}
  m_GameObject: {fileID: 0}
  m_Enabled: 1
  m_EditorHideFlags: 0
  m_Script: {fileID: 11500000, guid: 986704a6d8af09242be6b1dc763fe34c, type: 3}
  m_Name: Heros_SelectedBlueCorner
  m_EditorClassIdentifier: 
  TheList:
  - {fileID: 11400000, guid: b299a254ce564d44d88c96ddc6287f6f, type: 2}
  - {fileID: 11400000, guid: fc2a39fab799b4c44ae5ae7566deb7a6, type: 2}
  - {fileID: 11400000, guid: f1e7a86a1302b5b4f855a261df7d8642, type: 2}
  limit: 3
  OnAdd: {fileID: 11400000, guid: 2fa696c7561e5264ab811adc12c6e01b, type: 2}
  OnRemove: {fileID: 11400000, guid: 10384d1e0f3ae334fb324ff0ab093d91, type: 2}
  OnFillStateChange: {fileID: 11400000, guid: 512de8ac01cfd5146b3854a1ef2b5a65, type: 2}
