%YAML 1.1
%TAG !u! tag:unity3d.com,2011:
--- !u!1001 &5958255742270193025
PrefabInstance:
  m_ObjectHideFlags: 0
  serializedVersion: 2
  m_Modification:
    m_TransformParent: {fileID: 0}
    m_Modifications:
    - target: {fileID: 2319357534420210109, guid: fc47997693ba3004a8943dcb144231cf,
        type: 3}
      propertyPath: m_Name
      value: StickmanDark
      objectReference: {fileID: 0}
    - target: {fileID: 2320051173352851816, guid: fc47997693ba3004a8943dcb144231cf,
        type: 3}
      propertyPath: m_Materials.Array.data[0]
      value: 
      objectReference: {fileID: 2100000, guid: fa8d0e2792ccaa64e9f0c4fc3ceb4489, type: 2}
    - target: {fileID: 3133330851787328263, guid: fc47997693ba3004a8943dcb144231cf,
        type: 3}
      propertyPath: m_RootOrder
      value: 0
      objectReference: {fileID: 0}
    - target: {fileID: 3133330851787328263, guid: fc47997693ba3004a8943dcb144231cf,
        type: 3}
      propertyPath: m_LocalPosition.x
      value: 0
      objectReference: {fileID: 0}
    - target: {fileID: 3133330851787328263, guid: fc47997693ba3004a8943dcb144231cf,
        type: 3}
      propertyPath: m_LocalPosition.y
      value: 0
      objectReference: {fileID: 0}
    - target: {fileID: 3133330851787328263, guid: fc47997693ba3004a8943dcb144231cf,
        type: 3}
      propertyPath: m_LocalPosition.z
      value: 0
      objectReference: {fileID: 0}
    - target: {fileID: 3133330851787328263, guid: fc47997693ba3004a8943dcb144231cf,
        type: 3}
      propertyPath: m_LocalRotation.w
      value: 0.7071068
      objectReference: {fileID: 0}
    - target: {fileID: 3133330851787328263, guid: fc47997693ba3004a8943dcb144231cf,
        type: 3}
      propertyPath: m_LocalRotation.x
      value: 0
      objectReference: {fileID: 0}
    - target: {fileID: 3133330851787328263, guid: fc47997693ba3004a8943dcb144231cf,
        type: 3}
      propertyPath: m_LocalRotation.y
      value: 0.7071068
      objectReference: {fileID: 0}
    - target: {fileID: 3133330851787328263, guid: fc47997693ba3004a8943dcb144231cf,
        type: 3}
      propertyPath: m_LocalRotation.z
      value: 0
      objectReference: {fileID: 0}
    - target: {fileID: 3133330851787328263, guid: fc47997693ba3004a8943dcb144231cf,
        type: 3}
      propertyPath: m_LocalEulerAnglesHint.x
      value: 0
      objectReference: {fileID: 0}
    - target: {fileID: 3133330851787328263, guid: fc47997693ba3004a8943dcb144231cf,
        type: 3}
      propertyPath: m_LocalEulerAnglesHint.y
      value: 90
      objectReference: {fileID: 0}
    - target: {fileID: 3133330851787328263, guid: fc47997693ba3004a8943dcb144231cf,
        type: 3}
      propertyPath: m_LocalEulerAnglesHint.z
      value: 0
      objectReference: {fileID: 0}
    m_RemovedComponents: []
  m_SourcePrefab: {fileID: 100100000, guid: fc47997693ba3004a8943dcb144231cf, type: 3}
