isim,adet,fiyat
çikolata,20,8.4016
gofret,20,3.9530000000000003
lastik,90,389.3882
ekmek,34,2.1168
şeker,110,11.88
yağ,201,34.7544
bebek bezi,301,63.4132
matkap,400,129.269
telefon,0,5773.950000000001
çorap,2,5.4634
